Build: #292 failed Changes by Eric Milles

Build result summary

Details

Completed
Duration
102 minutes
Labels
None
Agent
bamboo-23.af.pivotal.io
Revision
726eab017b9b5d2154f6dd3bbc3b8e122eda1f54 726eab017b9b5d2154f6dd3bbc3b8e122eda1f54
Total tests
6810
Failing since
#290 (Changes by Eric Milles)
Fixed in
#294 (Changes by Eric Milles)

Responsible

Code commits

Author Commit Message Commit date
Eric Milles Eric Milles 726eab017b9b5d2154f6dd3bbc3b8e122eda1f54 726eab017b9b5d2154f6dd3bbc3b8e122eda1f54 Fix for #1163: check "on build path" before "is test"
Eric Milles Eric Milles 33008b5c6c55680956239684d75cb4b5fdcde189 33008b5c6c55680956239684d75cb4b5fdcde189 GROOVY-8103

Tests

New test failures 8
Status Test View job Duration
Collapse Failed BasicGroovyBuildTests testCompileStatic_IterableParameter History
Default Job < 1 sec
org.junit.ComparisonFailure: unexpected recompiled units. lenExpected=1 lenActual=2 expected:<{Foo[]}> but was:<{Foo[,Foo]}>
	at org.eclipse.jdt.core.groovy.tests.builder.BasicGroovyBuildTests.testCompileStatic_IterableParameter(BasicGroovyBuildTests.java:750)
Collapse Failed BuildAccessRulesTests testAccessForMethodParameterGenerics History
Default Job < 1 sec
junit.framework.ComparisonFailure: 
----------- Expected ------------
Problem : Access restriction: The type 'BeanInfo' is not API (restriction on required library '##') [ resource : </Project/src/Foo.groovy> range : <48,56> category : <150> severity : <2>]

------------ but was ------------

--------- Difference is ----------
 expected:<[Problem : Access restriction: The type 'BeanInfo' is not API (restriction on required library '##') [ resource : </Project/src/Foo.groovy> range : <48,56> category : <150> severity : <2>]
(13 more lines...)
Collapse Failed DGMInferencingTests testDGM1 History
Default Job < 1 sec
java.lang.AssertionError: Expected type not found.
Expected: java.lang.Integer
Found: java.lang.Object
Declaring type: groovy.lang.Closure<V extends java.lang.Object>
ASTNode: org.codehaus.groovy.ast.expr.VariableExpression@97b39ad[variable: it]
Confidence: INFERRED

java.lang.AssertionError: 
(9 more lines...)
Collapse Failed DGMInferencingTests testDGM34 History
Default Job < 1 sec
java.lang.AssertionError: Expected type not found.
Expected: java.io.OutputStream
Found: java.lang.Object
Declaring type: groovy.lang.Closure<V extends java.lang.Object>
ASTNode: org.codehaus.groovy.ast.expr.VariableExpression@7f8c6a22[variable: it]
Confidence: INFERRED

java.lang.AssertionError: 
(9 more lines...)
Collapse Failed DGMInferencingTests testDGM19 History
Default Job < 1 sec
java.lang.AssertionError: Expected type not found.
Expected: java.lang.Integer
Found: java.lang.Object
Declaring type: Search
ASTNode: org.codehaus.groovy.ast.expr.VariableExpression@6de625d9[variable: value]
Confidence: INFERRED

java.lang.AssertionError: 
(9 more lines...)
Collapse Failed DGMInferencingTests testDGM22 History
Default Job < 1 sec
java.lang.AssertionError: Expected type not found.
Expected: java.lang.Integer
Found: java.lang.Object
Declaring type: groovy.lang.Closure<V extends java.lang.Object>
ASTNode: org.codehaus.groovy.ast.expr.VariableExpression@727aefdf[variable: it]
Confidence: INFERRED

java.lang.AssertionError: 
(9 more lines...)
Collapse Failed DGMInferencingTests testDGM5 History
Default Job < 1 sec
java.lang.AssertionError: Expected type not found.
Expected: java.lang.String
Found: java.lang.Object
Declaring type: Search
ASTNode: org.codehaus.groovy.ast.expr.VariableExpression@33dcdf77[variable: key]
Confidence: INFERRED

java.lang.AssertionError: 
(9 more lines...)
Collapse Failed DGMInferencingTests testStaticMixinDGM History
Default Job < 1 sec
java.lang.AssertionError: Expected declaring type not found.
 Expected: org.codehaus.groovy.runtime.DefaultGroovyMethods
 Found type: java.lang.Object
 Found declaring type: java.lang.String
 ASTNode: org.codehaus.groovy.ast.expr.ConstantExpression@5c684e4[mixin]
java.lang.AssertionError: 
Expected declaring type not found.
	Expected: org.codehaus.groovy.runtime.DefaultGroovyMethods
(5 more lines...)
Fixed tests 5
Status Test Failing since View job Duration
Successful ClosureInferencingTests testClosure25 History
Failing since build #291 (Changes by Eric Milles) Default Job < 1 sec
Successful ClosureInferencingTests testNestedClosure3 History
Failing since build #291 (Changes by Eric Milles) Default Job < 1 sec
Successful DGMInferencingTests testDGMClosure13 History
Failing since build #291 (Changes by Eric Milles) Default Job < 1 sec
Successful DGMInferencingTests testDGMDeclaring2 History
Failing since build #291 (Changes by Eric Milles) Default Job < 1 sec
Successful GenericInferencingTests testList10 History
Failing since build #291 (Changes by Eric Milles) Default Job < 1 sec

Jira issues

IssueDescriptionStatus
Unknown Issue TypeGROOVY-8103Could not obtain issue details from Jira