Build: #292 failed Changes by Eric Milles

Test results

  • 6,810 tests in total
  • 8 tests failed
  • 8 failures are new
  • 5 tests were fixed
  • 144 tests were quarantined / skipped
  • 97 minutes taken in total.
New test failures 8
Status Test View job Duration
Collapse Failed BasicGroovyBuildTests testCompileStatic_IterableParameter History
Default Job < 1 sec
org.junit.ComparisonFailure: unexpected recompiled units. lenExpected=1 lenActual=2 expected:<{Foo[]}> but was:<{Foo[,Foo]}>
	at org.eclipse.jdt.core.groovy.tests.builder.BasicGroovyBuildTests.testCompileStatic_IterableParameter(BasicGroovyBuildTests.java:750)
Collapse Failed BuildAccessRulesTests testAccessForMethodParameterGenerics History
Default Job < 1 sec
junit.framework.ComparisonFailure: 
----------- Expected ------------
Problem : Access restriction: The type 'BeanInfo' is not API (restriction on required library '##') [ resource : </Project/src/Foo.groovy> range : <48,56> category : <150> severity : <2>]

------------ but was ------------

--------- Difference is ----------
 expected:<[Problem : Access restriction: The type 'BeanInfo' is not API (restriction on required library '##') [ resource : </Project/src/Foo.groovy> range : <48,56> category : <150> severity : <2>]
(13 more lines...)
Collapse Failed DGMInferencingTests testDGM1 History
Default Job < 1 sec
java.lang.AssertionError: Expected type not found.
Expected: java.lang.Integer
Found: java.lang.Object
Declaring type: groovy.lang.Closure<V extends java.lang.Object>
ASTNode: org.codehaus.groovy.ast.expr.VariableExpression@97b39ad[variable: it]
Confidence: INFERRED

java.lang.AssertionError: 
(9 more lines...)
Collapse Failed DGMInferencingTests testDGM34 History
Default Job < 1 sec
java.lang.AssertionError: Expected type not found.
Expected: java.io.OutputStream
Found: java.lang.Object
Declaring type: groovy.lang.Closure<V extends java.lang.Object>
ASTNode: org.codehaus.groovy.ast.expr.VariableExpression@7f8c6a22[variable: it]
Confidence: INFERRED

java.lang.AssertionError: 
(9 more lines...)
Collapse Failed DGMInferencingTests testDGM19 History
Default Job < 1 sec
java.lang.AssertionError: Expected type not found.
Expected: java.lang.Integer
Found: java.lang.Object
Declaring type: Search
ASTNode: org.codehaus.groovy.ast.expr.VariableExpression@6de625d9[variable: value]
Confidence: INFERRED

java.lang.AssertionError: 
(9 more lines...)
Collapse Failed DGMInferencingTests testDGM22 History
Default Job < 1 sec
java.lang.AssertionError: Expected type not found.
Expected: java.lang.Integer
Found: java.lang.Object
Declaring type: groovy.lang.Closure<V extends java.lang.Object>
ASTNode: org.codehaus.groovy.ast.expr.VariableExpression@727aefdf[variable: it]
Confidence: INFERRED

java.lang.AssertionError: 
(9 more lines...)
Collapse Failed DGMInferencingTests testDGM5 History
Default Job < 1 sec
java.lang.AssertionError: Expected type not found.
Expected: java.lang.String
Found: java.lang.Object
Declaring type: Search
ASTNode: org.codehaus.groovy.ast.expr.VariableExpression@33dcdf77[variable: key]
Confidence: INFERRED

java.lang.AssertionError: 
(9 more lines...)
Collapse Failed DGMInferencingTests testStaticMixinDGM History
Default Job < 1 sec
java.lang.AssertionError: Expected declaring type not found.
 Expected: org.codehaus.groovy.runtime.DefaultGroovyMethods
 Found type: java.lang.Object
 Found declaring type: java.lang.String
 ASTNode: org.codehaus.groovy.ast.expr.ConstantExpression@5c684e4[mixin]
java.lang.AssertionError: 
Expected declaring type not found.
	Expected: org.codehaus.groovy.runtime.DefaultGroovyMethods
(5 more lines...)
Fixed tests 5
Status Test Failing since View job Duration
Successful ClosureInferencingTests testClosure25 History
Failing since build #291 (Changes by Eric Milles) Default Job < 1 sec
Successful ClosureInferencingTests testNestedClosure3 History
Failing since build #291 (Changes by Eric Milles) Default Job < 1 sec
Successful DGMInferencingTests testDGMClosure13 History
Failing since build #291 (Changes by Eric Milles) Default Job < 1 sec
Successful DGMInferencingTests testDGMDeclaring2 History
Failing since build #291 (Changes by Eric Milles) Default Job < 1 sec
Successful GenericInferencingTests testList10 History
Failing since build #291 (Changes by Eric Milles) Default Job < 1 sec
Skipped tests 100
Status Test Failing since View job
Skipped ConstructorCompletionTests testNamedArgumentTrigger2 History
Default Job
Skipped DefaultGroovyMethodCompletionTests testDateGM History
Default Job
Skipped MethodCompletionTests testMethodReference5 History
Default Job
Skipped MethodCompletionTests testMethodReference0 History
Default Job
Skipped MethodCompletionTests testMethodReference2 History
Default Job
Skipped MethodCompletionTests testMethodReference4 History
Default Job
Skipped MethodCompletionTests testMethodReference1 History
Default Job
Skipped MethodCompletionTests testMethodReference3 History
Default Job
Skipped RelevanceTests testNewMethodThenModifier History
Default Job
Skipped CodeSelectKeywordsTests testCodeSelectKeywordDef4 History
Default Job
Skipped CodeSelectKeywordsTests testCodeSelectKeywordDef5 History
Default Job
Skipped CodeSelectMiscellaneousTests testSelectColonInMethRef History
Default Job
Skipped CodeSelectTypesTests testSelectPackageOnFullyQualifiedName7b History
Default Job
Skipped CodeSelectTypesTests testSelectPackageOnFullyQualifiedName7 History
Default Job
Skipped CodeSelectTypesTests testSelectPackageOnFullyQualifiedName7a History
Default Job
Skipped BuiltInDSLInferencingTests testSwingBuilder2 History
Default Job
Skipped BuiltInDSLInferencingTests testSwingBuilder1 History
Default Job
Skipped DSLContentAssistTests testSwingBuilder3 History
Default Job
Skipped DSLContentAssistTests testSwingBuilder2 History
Default Job
Skipped DSLContentAssistTests testSwingBuilder1 History
Default Job
Skipped ExpressionFinderTests testNoExpression1 History
Default Job
Skipped ExpressionFinderTests testComplex4 History
Default Job
Skipped SemanticHighlightingTests testLambdaParams1 History
Default Job
Skipped SemanticHighlightingTests testMethodReference2 History
Default Job
Skipped SemanticHighlightingTests testLambdaParams3 History
Default Job
Skipped SemanticHighlightingTests testVarKeyword7 History
Default Job
Skipped SemanticHighlightingTests testVarKeyword3 History
Default Job
Skipped SemanticHighlightingTests testForParams2 History
Default Job
Skipped SemanticHighlightingTests testMethodReference1 History
Default Job
Skipped SemanticHighlightingTests testTailCallMethods History
Default Job
Skipped SemanticHighlightingTests testVarKeyword6 History
Default Job
Skipped SemanticHighlightingTests testForParams1 History
Default Job
Skipped SemanticHighlightingTests testForParams3 History
Default Job
Skipped SemanticHighlightingTests testVarKeyword4 History
Default Job
Skipped SemanticHighlightingTests testVarKeyword5 History
Default Job
Skipped SemanticHighlightingTests testLambdaParams2 History
Default Job
Skipped BasicGroovyBuildTests testBuildGroovyHelloWorld4 History
Default Job
Skipped BasicGroovyBuildTests testBuildGroovyHelloWorld3 History
Default Job
Skipped BasicGroovyBuildTests testBuildGroovyHelloWorld5 History
Default Job
Skipped SourceLocationsTests testErrorPositionForUnsupportedOperation History
Default Job
Skipped SourceLocationsTests testSourceLocationsTrailingWhitespace1 History
Default Job
Skipped SourceLocationsTests testSourceLocationsTrailingWhitespace2 History
Default Job
Skipped GroovyPartialModelTests testFieldInitializerIsAvailable3 History
Default Job
Skipped GroovyPartialModelTests testFieldInitializerIsAvailable4 History
Default Job
Skipped DGMInferencingTests testDGM43 History
Default Job
Skipped DGMInferencingTests testDGSMDeclaring1 History
Default Job
Skipped GenericInferencingTests testJira1718 History
Default Job
Skipped GenericInferencingTests testClosure6b History
Default Job
Skipped GenericInferencingTests testStaticMethod8 History
Default Job
Skipped GenericInferencingTests testClosure5a History
Default Job
Skipped Groovy20InferencingTests testTypeChecked7a History
Default Job
Skipped Groovy20InferencingTests testCompileStatic7a History
Default Job
Skipped Groovy20InferencingTests testCompileStatic9a History
Default Job
Skipped Groovy20InferencingTests testTypeChecked9a History
Default Job
Skipped Groovy25InferencingTests org.eclipse.jdt.core.groovy.tests.search.Groovy25InferencingTests History
Default Job
Skipped InferencingTests testInstanceOf3a History
Default Job
Skipped InferencingTests testInstanceOf2a History
Default Job
Skipped InferencingTests testGetAt9 History
Default Job
Skipped InferencingTests testGetAt8 History
Default Job
Skipped InferencingTests testEqualsClassTest3 History
Default Job
Skipped InferencingTests testInstanceOf10a History
Default Job
Skipped MethodReferenceSearchTests testOverloadedMethodReferences5a History
Default Job
Skipped SpockInferencingTests testDataTableChecks History
Default Job
Skipped StaticInferencingTests testStaticImport13 History
Default Job
Skipped StaticInferencingTests testStaticImport14 History
Default Job
Skipped StaticInferencingTests testStaticImport15 History
Default Job
Skipped AnnotationsTests testDoubleLiteralAttributeDefault2a[Java 1.8] History
Default Job
Skipped AnnotationsTests testFloatLiteralAttributeDefault2a[Java 1.8] History
Default Job
Skipped AnnotationsTests testCharLiteralAttributeValue[Java 1.7] History
Default Job
Skipped AnnotationsTests testLongLiteralAttributeDefault2[Java 1.8] History
Default Job
Skipped AnnotationsTests testDoubleLiteralAttributeDefault2[Java 1.8] History
Default Job
Skipped AnnotationsTests testCharLiteralAttributeValue[Java 1.8] History
Default Job
Skipped AnnotationsTests testFloatLiteralAttributeDefault2[Java 1.8] History
Default Job
Skipped AnnotationsTests testLongLiteralAttributeDefault2[Java 1.7] History
Default Job
Skipped AnnotationsTests testFloatLiteralAttributeDefault2[Java 1.7] History
Default Job
Skipped AnnotationsTests testDoubleLiteralAttributeDefault2[Java 1.7] History
Default Job
Skipped AnnotationsTests testLongLiteralAttributeDefault2a[Java 1.8] History
Default Job
Skipped AnnotationsTests testLongLiteralAttributeDefault2a[Java 1.7] History
Default Job
Skipped AnnotationsTests testDoubleLiteralAttributeDefault2a[Java 1.7] History
Default Job
Skipped AnnotationsTests testFloatLiteralAttributeDefault2a[Java 1.7] History
Default Job
Skipped GenericsTests testExtendingGenerics_GroovyExtendsJava06[Java 1.8] History
Default Job
Skipped GenericsTests testExtendingGenerics_GroovyExtendsJava07[Java 1.8] History
Default Job
Skipped GenericsTests testExtendingGenerics_GroovyExtendsJava08[Java 1.8] History
Default Job
Skipped GroovySimpleTests testLambdaScope2[Java 1.7] History
Default Job
Skipped GroovySimpleTests testMultiCatch1[Java 1.7] History
Default Job
Skipped GroovySimpleTests testLambdaScope2[Java 1.8] History
Default Job
Skipped GroovySimpleTests testLambdaScope1[Java 1.8] History
Default Job
Skipped GroovySimpleTests testLambdaScope1[Java 1.7] History
Default Job
Skipped GroovySimpleTests testMultiCatch1[Java 1.8] History
Default Job
Skipped GroovySimpleTests testModuleInfo1[Java 1.8] History
Default Job
Skipped GroovySimpleTests testModuleInfo1[Java 1.7] History
Default Job
Skipped GroovySimpleTests testLambdaBasic[Java 1.8] History
Default Job
Skipped GroovySimpleTests testLambdaBasic[Java 1.7] History
Default Job
Skipped Java8Tests testRepeatableAnnotation2[Java 1.7] History
Default Job
Skipped Java8Tests testRepeatableAnnotation3[Java 1.7] History
Default Job
Skipped Java8Tests testNonRepeatableAnnotation[Java 1.7] History
Default Job
Skipped Java8Tests testFunctionalInterfaceCoercion[Java 1.7] History
Default Job
Skipped Java8Tests testRepeatableAnnotation1[Java 1.7] History
Default Job
Skipped Java8Tests testDefaultAndStaticMethodInInterface[Java 1.7] History
Default Job
Skipped TraitsTests testTraits8854[Java 1.8] History
Default Job