Build: #293 failed Changes by Eric Milles

Build result summary

Details

Completed
Duration
102 minutes
Labels
None
Agent
bamboo-18.af.pivotal.io
Revision
7d20870a1237805884ecdd4a8f6db321ac4b257e 7d20870a1237805884ecdd4a8f6db321ac4b257e
Total tests
6810
Failing since
#290 (Changes by Eric Milles)
Fixed in
#294 (Changes by Eric Milles)

Responsible

Code commits

Author Commit Message Commit date
Eric Milles Eric Milles 7d20870a1237805884ecdd4a8f6db321ac4b257e 7d20870a1237805884ecdd4a8f6db321ac4b257e minor fix-ups

Tests

New test failures 7
Status Test View job Duration
Collapse Failed ClosureInferencingTests testNestedClosure3 History
Default Job < 1 sec
java.lang.AssertionError: Expected type not found.
Expected: java.lang.Integer
Found: java.lang.Object
Declaring type: groovy.lang.Closure
ASTNode: org.codehaus.groovy.ast.expr.ConstantExpression@63401e7f[intValue]
Confidence: UNKNOWN

java.lang.AssertionError: 
(8 more lines...)
Collapse Failed ConstructorReferenceSearchTests testConstructorReferences2 History
Default Job < 1 sec
java.lang.AssertionError: Incorrect number of matches; expected:<1> but was:<0>
	at org.eclipse.jdt.core.groovy.tests.search.ConstructorReferenceSearchTests.testConstructorReferences2(ConstructorReferenceSearchTests.java:95)
Collapse Failed DGMInferencingTests testDGM21 History
Default Job < 1 sec
java.lang.AssertionError: Expected type not found.
Expected: java.lang.Integer
Found: java.lang.Object
Declaring type: Search
ASTNode: org.codehaus.groovy.ast.expr.VariableExpression@161dc7a5[variable: value]
Confidence: INFERRED

java.lang.AssertionError: 
(9 more lines...)
Collapse Failed DGMInferencingTests testDGMClosure3 History
Default Job < 1 sec
java.lang.AssertionError: Expected type not found.
Expected: java.lang.String
Found: java.lang.Object
Declaring type: groovy.lang.Closure<V extends java.lang.Object>
ASTNode: org.codehaus.groovy.ast.expr.VariableExpression@63705405[variable: it]
Confidence: INFERRED

java.lang.AssertionError: 
(9 more lines...)
Collapse Failed DGMInferencingTests testDGM26a History
Default Job < 1 sec
java.lang.AssertionError: Expected type not found.
Expected: java.lang.String
Found: java.lang.Object
Declaring type: Search
ASTNode: org.codehaus.groovy.ast.expr.VariableExpression@373cd43b[variable: key]
Confidence: INFERRED

java.lang.AssertionError: 
(9 more lines...)
Collapse Failed DGMInferencingTests testDGM7 History
Default Job < 1 sec
java.lang.AssertionError: Expected type not found.
Expected: java.lang.String
Found: java.lang.Object
Declaring type: Search
ASTNode: org.codehaus.groovy.ast.expr.VariableExpression@48b51a4c[variable: key]
Confidence: INFERRED

java.lang.AssertionError: 
(9 more lines...)
Collapse Failed OperatorOverloadingInferencingTests testPlus3 History
Default Job < 1 sec
java.lang.AssertionError: Did not find expected ASTNode
	at org.eclipse.jdt.core.groovy.tests.search.OperatorOverloadingInferencingTests.testPlus3(OperatorOverloadingInferencingTests.java:58)
Fixed tests 8
Status Test Failing since View job Duration
Successful BasicGroovyBuildTests testCompileStatic_IterableParameter History
Failing since build #292 (Changes by Eric Milles) Default Job < 1 sec
Successful BuildAccessRulesTests testAccessForMethodParameterGenerics History
Failing since build #292 (Changes by Eric Milles) Default Job < 1 sec
Successful DGMInferencingTests testStaticMixinDGM History
Failing since build #292 (Changes by Eric Milles) Default Job < 1 sec
Successful DGMInferencingTests testDGM5 History
Failing since build #292 (Changes by Eric Milles) Default Job < 1 sec
Successful DGMInferencingTests testDGM34 History
Failing since build #292 (Changes by Eric Milles) Default Job < 1 sec
Successful DGMInferencingTests testDGM1 History
Failing since build #292 (Changes by Eric Milles) Default Job < 1 sec
Successful DGMInferencingTests testDGM22 History
Failing since build #292 (Changes by Eric Milles) Default Job < 1 sec
Successful DGMInferencingTests testDGM19 History
Failing since build #292 (Changes by Eric Milles) Default Job < 1 sec