Build: #454 failed Changes by Eric Milles

Build result summary

Details

Completed
Duration
71 minutes
Labels
None
Agent
bamboo-11.af.pivotal.io
Revision
aa1935a07c9dd9e178ecea791c76240ee1906625 aa1935a07c9dd9e178ecea791c76240ee1906625
Total tests
6075
Failing since
#453 (Changes by Eric Milles)
Fixed in
#457 (Changes by Eric Milles)

Responsible

Code commits

Author Commit Message Commit date
Eric Milles Eric Milles aa1935a07c9dd9e178ecea791c76240ee1906625 aa1935a07c9dd9e178ecea791c76240ee1906625 GROOVY-10063

Tests

New test failures 4
Status Test View job Duration
Collapse Failed ConstructorReferenceSearchTests testConstructorReferences13 History
Default Job < 1 sec
java.lang.AssertionError: expected:<1> but was:<0>
	at org.eclipse.jdt.core.groovy.tests.search.ConstructorReferenceSearchTests.testConstructorReferences13(ConstructorReferenceSearchTests.java:390)
Collapse Failed ConstructorReferenceSearchTests testConstructorReferences14 History
Default Job < 1 sec
java.lang.AssertionError: expected:<1> but was:<0>
	at org.eclipse.jdt.core.groovy.tests.search.ConstructorReferenceSearchTests.testConstructorReferences14(ConstructorReferenceSearchTests.java:416)
Collapse Failed ConstructorReferenceSearchTests testNewifyConstructorReferences2 History
Default Job < 1 sec
java.lang.AssertionError: expected:<1> but was:<0>
	at org.eclipse.jdt.core.groovy.tests.search.ConstructorReferenceSearchTests.testNewifyConstructorReferences2(ConstructorReferenceSearchTests.java:470)
Collapse Failed TypeReferenceSearchTests testConstructorWithDefaultArgsInCompileStatic History
Default Job < 1 sec
java.lang.AssertionError: Wrong number of matches found
[] expected:<2> but was:<0>
java.lang.AssertionError: 
Wrong number of matches found
[] expected:<2> but was:<0>
	at org.eclipse.jdt.core.groovy.tests.search.TypeReferenceSearchTests.testConstructorWithDefaultArgsInCompileStatic(TypeReferenceSearchTests.java:414)
Fixed tests 1
Status Test Failing since View job Duration
Successful BasicGroovyBuildTests testUpdateProjectPreferences History
Failing since build #453 (Changes by Eric Milles) Default Job < 1 sec

Jira issues

IssueDescriptionStatus
Unknown Issue TypeGROOVY-10063Could not obtain issue details from Jira