Build: #53 failed Changes by Eric Milles

Build result summary

Details

Completed
Duration
97 minutes
Labels
None
Agent
bamboo-16.af.pivotal.io
Revision
6effbf75085f86e2fd9efa01a3519bea51c41195 6effbf75085f86e2fd9efa01a3519bea51c41195
Total tests
6310
Failing since
#30 (Changes by Eric Milles)
Fixed in
#60 (Code changes detected)

Responsible

Code commits

Author Commit Message Commit date
Eric Milles Eric Milles 6effbf75085f86e2fd9efa01a3519bea51c41195 6effbf75085f86e2fd9efa01a3519bea51c41195 minor fix-ups

Configuration changes

Plan configuration has changed since the last successful build. See the plan audit log for more details.

Tests

New test failures 6
Status Test View job Duration
Collapse Failed JUnit3TestFinderTests testFinderOfSubclass History
Default Job 2 secs
org.eclipse.jdt.core.JavaModelException: /TestProject/src/p/script.groovy already exists in target
	at org.codehaus.groovy.eclipse.junit.test.JUnit3TestFinderTests.testFinderOfSubclass(JUnit3TestFinderTests.groovy:50)
Collapse Failed JUnit3TestFinderTests testFinderOfNonPublicSubclass History
Default Job 5 secs
org.eclipse.jdt.core.JavaModelException: /TestProject/src/p/script.groovy already exists in target
	at org.codehaus.groovy.eclipse.junit.test.JUnit3TestFinderTests.testFinderOfNonPublicSubclass(JUnit3TestFinderTests.groovy:66)
Collapse Failed JUnit4TestFinderTests testFinderOfNonPublicSubclass History
Default Job 4 secs
org.eclipse.jdt.core.JavaModelException: /TestProject/src/p/script.groovy already exists in target
	at org.codehaus.groovy.eclipse.junit.test.JUnit4TestFinderTests.testFinderOfNonPublicSubclass(JUnit4TestFinderTests.groovy:67)
Collapse Failed JUnit4TestFinderTests testFinderOfSubclass History
Default Job 1 sec
org.eclipse.jdt.core.JavaModelException: /TestProject/src/p/script.groovy already exists in target
	at org.codehaus.groovy.eclipse.junit.test.JUnit4TestFinderTests.testFinderOfSubclass(JUnit4TestFinderTests.groovy:51)
Collapse Failed BasicGroovyBuildTests testSimpleTaskMarkerInSingleLineComment History
Default Job < 1 sec
java.lang.AssertionError: missing expected problem: Problem : todonothing [ resource : </Project/src/p/A.groovy> range : <24,36> category : <-1> severity : <2>]
	at org.eclipse.jdt.core.groovy.tests.builder.BasicGroovyBuildTests.testSimpleTaskMarkerInSingleLineComment(BasicGroovyBuildTests.java:2323)
Collapse Failed DGMInferencingTests testDGM13 History
Default Job < 1 sec
java.lang.AssertionError: Expected type not found.
Expected: java.lang.Integer
Found: java.lang.Object
Declaring type: Search
ASTNode: org.codehaus.groovy.ast.expr.VariableExpression@f69ba[variable: value]
Confidence: INFERRED

java.lang.AssertionError: 
(9 more lines...)
Existing test failures 2
Status Test Failing since View job Duration
org.eclipse.jdt.core.JavaModelException: /TestProject/src/p/script.groovy already exists in target
	at org.codehaus.groovy.eclipse.junit.test.JUnit3TestFinderTests.testFindAllTestSuites(JUnit3TestFinderTests.groovy:82)
org.eclipse.jdt.core.JavaModelException: /TestProject/src/p/script.groovy already exists in target
	at org.codehaus.groovy.eclipse.junit.test.JUnit4TestFinderTests.testFindAllTestSuites(JUnit4TestFinderTests.groovy:123)