Build: #85 failed Changes by Eric Milles

Build result summary

Details

Completed
Duration
98 minutes
Labels
None
Agent
bamboo-10.af.pivotal.io
Revision
5a8469fb344eef2a21d68d4c51773ea0673c03e3 5a8469fb344eef2a21d68d4c51773ea0673c03e3
Total tests
6350
Failing since
#83 (Changes by Eric Milles)
Fixed in
#87 (Changes by Eric Milles)

Responsible

Code commits

Author Commit Message Commit date
Eric Milles Eric Milles 5a8469fb344eef2a21d68d4c51773ea0673c03e3 5a8469fb344eef2a21d68d4c51773ea0673c03e3 Fix for #1066: reduce timeout (30s -> 10s) and use of synchronization

Tests

New test failures 3
Status Test View job Duration
Collapse Failed BasicGroovyBuildTests testTraitBinary History
Default Job < 1 sec
org.junit.ComparisonFailure: unexpected recompiled units. lenExpected=5 lenActual=2 expected:<{Runner,[p.Named,p.Named$Trait$Helper,q.DefaultNamed,]r.NamedClass}> but was:<{Runner,[]r.NamedClass}>
	at org.eclipse.jdt.core.groovy.tests.builder.BasicGroovyBuildTests.testTraitBinary(BasicGroovyBuildTests.java:3052)
Collapse Failed DGMInferencingTests testDGM17 History
Default Job < 1 sec
java.lang.AssertionError: Expected type not found.
Expected: java.lang.Integer
Found: java.lang.Object
Declaring type: Search
ASTNode: org.codehaus.groovy.ast.expr.VariableExpression@f6236[variable: value]
Confidence: INFERRED

java.lang.AssertionError: 
(9 more lines...)
Collapse Failed MethodReferenceSearchTests testExplicitPropertySetterSearch1 History
Default Job < 1 sec
java.lang.AssertionError: expected:<5> but was:<0>
	at org.eclipse.jdt.core.groovy.tests.search.MethodReferenceSearchTests.testExplicitPropertySetterSearch1(MethodReferenceSearchTests.java:733)
Fixed tests 2
Status Test Failing since View job Duration
Successful BasicGroovyBuildTests testCopyResourceNonGroovyProject_GRECLIPSE653 History
Failing since build #84 (Changes by Eric Milles) Default Job < 1 sec
Successful ClosureInferencingTests testClosure16 History
Failing since build #84 (Changes by Eric Milles) Default Job < 1 sec