Build: #291 failed

Job: Default Job failed

Stages & jobs

  1. Default Stage

Job result summary

Completed
Duration
102 minutes
Agent
bamboo-24.af.pivotal.io
Revision
25de4ee90e719a7dff6d30369d028ae54b91c6e8 25de4ee90e719a7dff6d30369d028ae54b91c6e8
Total tests
6807
Failing since
#290 (Code changes detected – )
Fixed in
#294 (Code changes detected)

Tests

  • 6,807 tests in total
  • 5 tests failed
  • 5 failures are new
  • 1 test was fixed
  • 144 tests were quarantined / skipped
  • 97 minutes taken in total.
New test failures 5
Status Test Duration
Collapse Failed ClosureInferencingTests testClosure25 History
< 1 sec
java.lang.AssertionError: Expected type not found.
Expected: java.lang.Void
Found: java.lang.Long
Declaring type: Search
ASTNode: org.codehaus.groovy.ast.expr.VariableExpression@87a4a8b[variable: time]
Confidence: INFERRED

java.lang.AssertionError: 
(8 more lines...)
Collapse Failed ClosureInferencingTests testNestedClosure3 History
< 1 sec
java.lang.AssertionError: Expected type not found.
Expected: java.lang.Integer
Found: java.lang.Object
Declaring type: groovy.lang.Closure
ASTNode: org.codehaus.groovy.ast.expr.ConstantExpression@487f00cc[intValue]
Confidence: UNKNOWN

java.lang.AssertionError: 
(8 more lines...)
Collapse Failed DGMInferencingTests testDGMClosure13 History
< 1 sec
java.lang.AssertionError: Expected type not found.
Expected: java.lang.Integer
Found: java.lang.Object
Declaring type: Search
ASTNode: org.codehaus.groovy.ast.expr.VariableExpression@62ba3b32[variable: key]
Confidence: INFERRED

java.lang.AssertionError: 
(9 more lines...)
Collapse Failed DGMInferencingTests testDGMDeclaring2 History
< 1 sec
java.lang.AssertionError: Expected declaring type not found.
 Expected: org.codehaus.groovy.runtime.ResourceGroovyMethods
 Found type: java.lang.Object
 Found declaring type: java.io.File
 ASTNode: org.codehaus.groovy.ast.expr.ConstantExpression@6ae5a8fe[eachLine]
java.lang.AssertionError: 
Expected declaring type not found.
	Expected: org.codehaus.groovy.runtime.ResourceGroovyMethods
(5 more lines...)
Collapse Failed GenericInferencingTests testList10 History
< 1 sec
java.lang.AssertionError: Expected type not found.
Expected: java.util.List<java.lang.String>
Found: java.util.List<java.lang.Object>
Declaring type: Search
ASTNode: org.codehaus.groovy.ast.expr.VariableExpression@42419d9a[variable: xxx]
Confidence: INFERRED

java.lang.AssertionError: 
(8 more lines...)
Fixed tests 1
Status Test Failing since Duration
Successful BasicGroovyBuildTests testBuildJavaHelloWorld History
Failing since build #290 (Code changes detected) < 1 sec

Error summary

The build generated some errors. See the full build log for more details.

Sep 17, 2020 10:28:06 PM org.apache.http.impl.execchain.RetryExec execute
INFO: I/O exception (org.apache.http.NoHttpResponseException) caught when processing request to {s}->https://download.eclipse.org:443: The target server failed to respond
Sep 17, 2020 10:28:06 PM org.apache.http.impl.execchain.RetryExec execute
INFO: Retrying request to {s}->https://download.eclipse.org:443
SWT SessionManagerDBus: Failed to connect to org.gnome.SessionManager: Failed to execute child process “dbus-launch” (No such file or directory)
SWT SessionManagerDBus: Failed to connect to org.xfce.SessionManager: Failed to execute child process “dbus-launch” (No such file or directory)
TypeInferencingVisitorWithRequestor.findMethodNode: no match found for Main.main([Qjava.lang.String;)
TypeInferencingVisitorWithRequestor.findMethodNode: no match found for Main.main([Qjava.lang.String;)
CodeSelectRequestor: Could not proceed due to null declaring type for org.codehaus.groovy.ast.expr.BinaryExpression@4c6054e8[org.codehaus.groovy.ast.expr.VariableExpression@6ef90da[variable: it]("in" at 1:20:  "in" )org.codehaus.groovy.ast.expr.ListExpression@674aa278[]]
CodeSelectRequestor: Could not proceed due to null declaring type for org.codehaus.groovy.ast.expr.RangeExpression@2cb4ee1
CodeSelectRequestor: Could not proceed due to null declaring type for org.codehaus.groovy.ast.expr.RangeExpression@54188ee0
CodeSelectRequestor: Could not proceed due to null declaring type for org.codehaus.groovy.ast.expr.ClosureExpression@40f40e2cnull{ org.codehaus.groovy.ast.stmt.BlockStatement@30ffcdbd[] }
CodeSelectRequestor: Could not proceed due to null declaring type for org.codehaus.groovy.ast.expr.ClosureExpression@28404141null{ org.codehaus.groovy.ast.stmt.BlockStatement@23e721c[org.codehaus.groovy.ast.stmt.ReturnStatement@5d1c174f[expression:org.codehaus.groovy.ast.expr.ConstantExpression@605e176a[null]]] }
CodeSelectRequestor: Could not proceed due to null declaring type for org.codehaus.groovy.ast.expr.ClosureExpression@2e0c9309[org.codehaus.groovy.ast.Parameter@5abe9361[name:param type: java.lang.String, hasDefaultValue: false]]{ org.codehaus.groovy.ast.stmt.BlockStatement@67e8d578[org.codehaus.groovy.ast.stmt.ReturnStatement@65933fd5[expression:org.codehaus.groovy.ast.expr.ConstantExpression@6f8969dc[null]]] }
CodeSelectRequestor: Could not proceed due to null declaring type for org.codehaus.groovy.ast.expr.MapEntryExpression@1b3b247c(key: org.codehaus.groovy.ast.expr.ConstantExpression@6477b209[foo], value: org.codehaus.groovy.ast.expr.ConstantExpression@ee4572[bar])
CodeSelectRequestor: Could not proceed due to null declaring type for org.codehaus.groovy.ast.expr.SpreadMapExpression@1a45d458
CodeSelectRequestor: Could not proceed due to null declaring type for org.codehaus.groovy.ast.expr.ConstantExpression@268a7be3[foo]
CodeSelectRequestor: Could not proceed due to null declaring type for org.codehaus.groovy.ast.expr.ConstantExpression@53a61c58[foo]
CodeSelectRequestor: Could not proceed due to null declaring type for org.codehaus.groovy.ast.expr.ConstantExpression@420d4a3b[foo]
TypeInferencingVisitorWithRequestor.findMethodNode: no match found for Type.x(QList<Qjava.util.Date;>;)
TypeInferencingVisitorWithRequestor.findMethodNode: no match found for Type.x(QList<Qjava.lang.Number;>;)
TypeInferencingVisitorWithRequestor.findMethodNode: no match found for Type.x(QList<Qjava.lang.Number;>;)
TypeInferencingVisitorWithRequestor.findMethodNode: no match found for Type.x(QList<Qjava.util.Date;>;)
TypeInferencingVisitorWithRequestor.findMethodNode: no match found for Type.x(QList<Qjava.lang.Number;>;)
TypeInferencingVisitorWithRequestor.findMethodNode: no match found for Type.x(QList<Qjava.lang.Number;>;)
CodeSelectRequestor: Could not proceed due to null declaring type for org.codehaus.groovy.ast.expr.ConstantExpression@30169feb[fff]
CodeSelectRequestor: Could not proceed due to null declaring type for org.codehaus.groovy.ast.expr.ConstantExpression@5277731[fff]
CodeSelectRequestor: Could not proceed due to null declaring type for org.codehaus.groovy.ast.expr.ConstantExpression@6fb9492a[fff]
Waiting for: Java indexing... 3 files to index (/Project)
Waiting for: Java indexing... 24 files to index (/Project)
Waiting for: Java indexing... 24 files to index (/Project)
Waiting for: Java indexing... 24 files to index (/Project)
Waiting for: Java indexing... 24 files to index (/Project)
Waiting for: Java indexing... 24 files to index (/Project)
Waiting for: Java indexing... 24 files to index (/Project)
Waiting for: Java indexing... 6 files to index (/Project)
Waiting for: Java indexing... 23 files to index (/Project)
Waiting for: Java indexing... 23 files to index (/Project)
Waiting for: Flushing content description cache.
Waiting for: Java indexing... 20 files to index (/opt/jdk8u232-b09/jre/lib/jsse.jar)