Build: #291 failed

Job: Default Job failed

Stages & jobs

  1. Default Stage

Test results

  • 6,807 tests in total
  • 5 tests failed
  • 5 failures are new
  • 1 test was fixed
  • 144 tests were quarantined / skipped
  • 97 minutes taken in total.

Build 291 has the following 5 errors: 5 new failure(s) occurred since the previous build.

New test failures 5
Status Test Duration
Collapse Failed ClosureInferencingTests testClosure25 History
< 1 sec
java.lang.AssertionError: Expected type not found.
Expected: java.lang.Void
Found: java.lang.Long
Declaring type: Search
ASTNode: org.codehaus.groovy.ast.expr.VariableExpression@87a4a8b[variable: time]
Confidence: INFERRED

java.lang.AssertionError: 
(8 more lines...)
Collapse Failed ClosureInferencingTests testNestedClosure3 History
< 1 sec
java.lang.AssertionError: Expected type not found.
Expected: java.lang.Integer
Found: java.lang.Object
Declaring type: groovy.lang.Closure
ASTNode: org.codehaus.groovy.ast.expr.ConstantExpression@487f00cc[intValue]
Confidence: UNKNOWN

java.lang.AssertionError: 
(8 more lines...)
Collapse Failed DGMInferencingTests testDGMClosure13 History
< 1 sec
java.lang.AssertionError: Expected type not found.
Expected: java.lang.Integer
Found: java.lang.Object
Declaring type: Search
ASTNode: org.codehaus.groovy.ast.expr.VariableExpression@62ba3b32[variable: key]
Confidence: INFERRED

java.lang.AssertionError: 
(9 more lines...)
Collapse Failed DGMInferencingTests testDGMDeclaring2 History
< 1 sec
java.lang.AssertionError: Expected declaring type not found.
 Expected: org.codehaus.groovy.runtime.ResourceGroovyMethods
 Found type: java.lang.Object
 Found declaring type: java.io.File
 ASTNode: org.codehaus.groovy.ast.expr.ConstantExpression@6ae5a8fe[eachLine]
java.lang.AssertionError: 
Expected declaring type not found.
	Expected: org.codehaus.groovy.runtime.ResourceGroovyMethods
(5 more lines...)
Collapse Failed GenericInferencingTests testList10 History
< 1 sec
java.lang.AssertionError: Expected type not found.
Expected: java.util.List<java.lang.String>
Found: java.util.List<java.lang.Object>
Declaring type: Search
ASTNode: org.codehaus.groovy.ast.expr.VariableExpression@42419d9a[variable: xxx]
Confidence: INFERRED

java.lang.AssertionError: 
(8 more lines...)