Build: #454 failed

Job: Default Job failed

Stages & jobs

  1. Default Stage

Job result summary

Completed
Duration
71 minutes
Agent
bamboo-11.af.pivotal.io
Revision
aa1935a07c9dd9e178ecea791c76240ee1906625 aa1935a07c9dd9e178ecea791c76240ee1906625
Total tests
6075
Failing since
#453 (Code changes detected – )
Fixed in
#457 (Code changes detected)

Tests

  • 6,075 tests in total
  • 4 tests failed
  • 4 failures are new
  • 1 test was fixed
  • 101 tests were quarantined / skipped
  • 66 minutes taken in total.
New test failures 4
Status Test Duration
Collapse Failed ConstructorReferenceSearchTests testConstructorReferences13 History
< 1 sec
java.lang.AssertionError: expected:<1> but was:<0>
	at org.eclipse.jdt.core.groovy.tests.search.ConstructorReferenceSearchTests.testConstructorReferences13(ConstructorReferenceSearchTests.java:390)
Collapse Failed ConstructorReferenceSearchTests testConstructorReferences14 History
< 1 sec
java.lang.AssertionError: expected:<1> but was:<0>
	at org.eclipse.jdt.core.groovy.tests.search.ConstructorReferenceSearchTests.testConstructorReferences14(ConstructorReferenceSearchTests.java:416)
Collapse Failed ConstructorReferenceSearchTests testNewifyConstructorReferences2 History
< 1 sec
java.lang.AssertionError: expected:<1> but was:<0>
	at org.eclipse.jdt.core.groovy.tests.search.ConstructorReferenceSearchTests.testNewifyConstructorReferences2(ConstructorReferenceSearchTests.java:470)
Collapse Failed TypeReferenceSearchTests testConstructorWithDefaultArgsInCompileStatic History
< 1 sec
java.lang.AssertionError: Wrong number of matches found
[] expected:<2> but was:<0>
java.lang.AssertionError: 
Wrong number of matches found
[] expected:<2> but was:<0>
	at org.eclipse.jdt.core.groovy.tests.search.TypeReferenceSearchTests.testConstructorWithDefaultArgsInCompileStatic(TypeReferenceSearchTests.java:414)
Fixed tests 1
Status Test Failing since Duration
Successful BasicGroovyBuildTests testUpdateProjectPreferences History
Failing since build #453 (Code changes detected) < 1 sec

Error summary

The build generated some errors. See the full build log for more details.

Waiting for: Java indexing... 21 files to index (/TestProject)
Waiting for: Cleaning/Rebuilding Project: TestProject
Waiting for: Java indexing... 21 files to index (/TestProject)
Waiting for: Cleaning/Rebuilding Project: OtherProject
Waiting for: Java indexing... 8 files to index (/opt/jdk8u232-b09/jre/lib/ext/jmxremote_optional-1.0.1_04-b58.jar)
Waiting for: Cleaning/Rebuilding Project: P4
Waiting for: Java indexing... 21 files to index (/P4)
Waiting for: Cleaning/Rebuilding Project: P3
Waiting for: Java indexing... 21 files to index (/P3)
Waiting for: Cleaning/Rebuilding Project: P2
Waiting for: Java indexing... 21 files to index (/P2)
Waiting for: Cleaning/Rebuilding Project: P1
Waiting for: Java indexing... 21 files to index (/P1)
Waiting for: Cleaning/Rebuilding Project: P1a
Waiting for: Java indexing... 21 files to index (/P1a)
Waiting for: Cleaning/Rebuilding Project: P2a
Waiting for: Java indexing... 21 files to index (/P2a)
Waiting for: Cleaning/Rebuilding Project: OtherProject
Waiting for: Java indexing... 19 files to index (/OtherProject)
Waiting for: Cleaning/Rebuilding Project: TestProject
Waiting for: Java indexing... 21 files to index (/TestProject)
CodeSelectRequestor: Could not proceed due to null declaring type for [email protected][fff]
CodeSelectRequestor: Could not proceed due to null declaring type for [email protected][fff]
CodeSelectRequestor: Could not proceed due to null declaring type for [email protected][fff]
Waiting for: Cleaning/Rebuilding Project: TestProject
Waiting for: Java indexing... 21 files to index (/TestProject)
Waiting for: Java indexing... 21 files to index (/TestProject)
Waiting for: Cleaning/Rebuilding Project: TestProject
Waiting for: Java indexing... 21 files to index (/TestProject)
Waiting for: Cleaning/Rebuilding Project: TestProject
Waiting for: Java indexing... 21 files to index (/TestProject)
Waiting for: Cleaning/Rebuilding Project: TestProject
Waiting for: Java indexing... 21 files to index (/TestProject)
Waiting for: Cleaning/Rebuilding Project: TestProject
Waiting for: Java indexing... 21 files to index (/TestProject)
Waiting for: Cleaning/Rebuilding Project: TestProject
Waiting for: Java indexing... 21 files to index (/TestProject)
Waiting for: Cleaning/Rebuilding Project: TestProject
Waiting for: Java indexing... 21 files to index (/TestProject)
Waiting for: Cleaning/Rebuilding Project: TestProject
Waiting for: Java indexing... 21 files to index (/TestProject)
Apr 28, 2021 11:47:21 PM groovy.util.FactoryBuilderSupport createNode
WARNING: Could not find match for name 'normal'
Apr 28, 2021 11:47:21 PM groovy.util.FactoryBuilderSupport createNode
WARNING: Could not find match for name 'normal'
Apr 28, 2021 11:47:33 PM groovy.util.FactoryBuilderSupport createNode
WARNING: Could not find match for name 'star'
Apr 28, 2021 11:47:33 PM groovy.util.FactoryBuilderSupport createNode
WARNING: Could not find match for name 'star'
Apr 28, 2021 11:47:33 PM groovy.util.FactoryBuilderSupport createNode
WARNING: Could not find match for name 'normal'
Apr 28, 2021 11:47:33 PM groovy.util.FactoryBuilderSupport createNode
WARNING: Could not find match for name 'normal'
Apr 28, 2021 11:47:34 PM groovy.util.FactoryBuilderSupport createNode
WARNING: Could not find match for name 'normal'
Apr 28, 2021 11:47:34 PM groovy.util.FactoryBuilderSupport createNode
WARNING: Could not find match for name 'normal'
Apr 28, 2021 11:47:34 PM groovy.util.FactoryBuilderSupport createNode
WARNING: Could not find match for name 'normal'
Apr 28, 2021 11:47:34 PM groovy.util.FactoryBuilderSupport createNode
WARNING: Could not find match for name 'normal'
Apr 28, 2021 11:47:36 PM groovy.util.FactoryBuilderSupport createNode
WARNING: Could not find match for name 'star'
Apr 28, 2021 11:47:39 PM groovy.util.FactoryBuilderSupport createNode
WARNING: Could not find match for name 'normal'
Apr 28, 2021 11:47:41 PM groovy.util.FactoryBuilderSupport createNode
WARNING: Could not find match for name 'star'
Apr 28, 2021 11:47:41 PM groovy.util.FactoryBuilderSupport createNode
WARNING: Could not find match for name 'normal'
Apr 28, 2021 11:47:41 PM groovy.util.FactoryBuilderSupport createNode
WARNING: Could not find match for name 'normal'
Apr 28, 2021 11:47:42 PM groovy.util.FactoryBuilderSupport createNode
WARNING: Could not find match for name 'star'
Apr 28, 2021 11:47:43 PM groovy.util.FactoryBuilderSupport createNode
WARNING: Could not find match for name 'normal'
Apr 28, 2021 11:47:44 PM groovy.util.FactoryBuilderSupport createNode
WARNING: Could not find match for name 'normal'
Apr 28, 2021 11:47:44 PM groovy.util.FactoryBuilderSupport createNode
WARNING: Could not find match for name 'normal'
Apr 28, 2021 11:49:31 PM groovy.util.FactoryBuilderSupport createNode
WARNING: Could not find match for name 'normal'
Executing Spock 2.0.0-M4-groovy-3.0 with NOT compatible Groovy version 4.0.0-alpha-3 due to set spock.iKnowWhatImDoing.disableGroovyVersionCheck system property. This is unsupported and may result in weird runtime errors!
Executing Spock 2.0.0-M4-groovy-3.0 with NOT compatible Groovy version 4.0.0-alpha-3 due to set spock.iKnowWhatImDoing.disableGroovyVersionCheck system property. This is unsupported and may result in weird runtime errors!
Executing Spock 2.0.0-M4-groovy-3.0 with NOT compatible Groovy version 4.0.0-alpha-3 due to set spock.iKnowWhatImDoing.disableGroovyVersionCheck system property. This is unsupported and may result in weird runtime errors!
Executing Spock 2.0.0-M4-groovy-3.0 with NOT compatible Groovy version 4.0.0-alpha-3 due to set spock.iKnowWhatImDoing.disableGroovyVersionCheck system property. This is unsupported and may result in weird runtime errors!
Executing Spock 2.0.0-M4-groovy-3.0 with NOT compatible Groovy version 4.0.0-alpha-3 due to set spock.iKnowWhatImDoing.disableGroovyVersionCheck system property. This is unsupported and may result in weird runtime errors!
Executing Spock 2.0.0-M4-groovy-3.0 with NOT compatible Groovy version 4.0.0-alpha-3 due to set spock.iKnowWhatImDoing.disableGroovyVersionCheck system property. This is unsupported and may result in weird runtime errors!
Executing Spock 2.0.0-M4-groovy-3.0 with NOT compatible Groovy version 4.0.0-alpha-3 due to set spock.iKnowWhatImDoing.disableGroovyVersionCheck system property. This is unsupported and may result in weird runtime errors!
Apr 28, 2021 11:52:40 PM groovy.util.FactoryBuilderSupport createNode
WARNING: Could not find match for name 'normal'
Apr 28, 2021 11:52:40 PM groovy.util.FactoryBuilderSupport createNode
WARNING: Could not find match for name 'staticMember'
TypeInferencingVisitorWithRequestor.findMethodNode: no match found for Search(Qgroovy.lang.Binding;)
TypeInferencingVisitorWithRequestor.findMethodNode: no match found for Search(Qgroovy.lang.Binding;)
TypeInferencingVisitorWithRequestor.findMethodNode: no match found for Search(Qgroovy.lang.Binding;)
TypeInferencingVisitorWithRequestor.findMethodNode: no match found for Search(Qgroovy.lang.Binding;)
TypeInferencingVisitorWithRequestor.findMethodNode: no match found for Search(Qgroovy.lang.Binding;)
TypeInferencingVisitorWithRequestor.findMethodNode: no match found for Search(Qgroovy.lang.Binding;)
TypeInferencingVisitorWithRequestor.findMethodNode: no match found for Search.test(QSet<Qjava.beans.BeanInfo;>;)
TypeInferencingVisitorWithRequestor.findMethodNode: no match found for Search.test(QSet<Qjava.beans.BeanInfo;>;)