Build: #56 failed Changes by Eric Milles

Build result summary

Details

Completed
Duration
98 minutes
Labels
None
Agent
bamboo-17.af.pivotal.io
Revision
41a7dc4f6c022cd01a3e2dd5fcbbc3e7d82ce27b 41a7dc4f6c022cd01a3e2dd5fcbbc3e7d82ce27b
Total tests
6310
Failing since
#30 (Changes by Eric Milles)

Responsible

Code commits

Author Commit Message Commit date
Eric Milles Eric Milles 41a7dc4f6c022cd01a3e2dd5fcbbc3e7d82ce27b 41a7dc4f6c022cd01a3e2dd5fcbbc3e7d82ce27b restore optional dependency

Configuration changes

Plan configuration has changed since the last successful build. See the plan audit log for more details.

Tests

New test failures 3
Status Test View job Duration
Collapse Failed BasicGroovyBuildTests testProjectBasedirAsOutputLocation History
Default Job < 1 sec
org.junit.ComparisonFailure: unexpected recompiled units. lenExpected=1 lenActual=2 expected:<{p.Script[]}> but was:<{p.Script[,p.Script]}>
	at org.eclipse.jdt.core.groovy.tests.builder.BasicGroovyBuildTests.testProjectBasedirAsOutputLocation(BasicGroovyBuildTests.java:274)
Collapse Failed BinarySearchTests testMethodDecl History
Default Job 1 sec
java.lang.AssertionError: Expecting 4 matches, but found 0

java.lang.AssertionError: 
Expecting 4 matches, but found 0

	at org.eclipse.jdt.core.groovy.tests.search.BinarySearchTests.assertMatches(BinarySearchTests.java:139)
	at org.eclipse.jdt.core.groovy.tests.search.BinarySearchTests.testMethodDecl(BinarySearchTests.java:199)
Collapse Failed DGMInferencingTests testDGM5 History
Default Job < 1 sec
java.lang.AssertionError: Expected type not found.
Expected: java.lang.String
Found: java.lang.Object
Declaring type: Search
ASTNode: org.codehaus.groovy.ast.expr.VariableExpression@f0080[variable: key]
Confidence: INFERRED

java.lang.AssertionError: 
(9 more lines...)
Fixed tests 1
Status Test Failing since View job Duration
Successful GroovyContentTypeTests testJavaThenGroovyProject History
Failing since build #55 (Changes by Eric Milles) Default Job < 1 sec