Build: #345 failed Changes by Eric Milles

Build result summary

Details

Completed
Duration
91 minutes
Labels
None
Agent
bamboo-34.spring.vmware.com
Revision
058310cb700473827fbeb120e56cb1b43d868b45 058310cb700473827fbeb120e56cb1b43d868b45
Total tests
6102
Fixed in
#346 (Changes by Eric Milles)

Tests

Responsible

Code commits

Author Commit Message Commit date
Eric Milles Eric Milles 058310cb700473827fbeb120e56cb1b43d868b45 058310cb700473827fbeb120e56cb1b43d868b45 GROOVY-8946
Eric Milles Eric Milles a35832dc02aec9aeff6be80706402096042de622 a35832dc02aec9aeff6be80706402096042de622 GROOVY-5523, GROOVY-7753, GROOVY-9972, GROOVY-9983

Tests

New test failures 2
Status Test View job Duration
Collapse Failed BasicGroovyBuildTests testBuildJavaHelloWorld History
Default Job < 1 sec
org.junit.internal.ArrayComparisonFailure: array lengths differed, expected.length=1 actual.length=2; arrays first differed at element [1]; expected:<end of array> but was:<p1.Hello>
	at org.eclipse.jdt.core.groovy.tests.builder.BasicGroovyBuildTests.testBuildJavaHelloWorld(BasicGroovyBuildTests.java:205)
Caused by: java.lang.AssertionError: expected:<end of array> but was:<p1.Hello>
	at org.eclipse.jdt.core.groovy.tests.builder.BasicGroovyBuildTests.testBuildJavaHelloWorld(BasicGroovyBuildTests.java:205)
Collapse Failed SpockInferencingTests testGetterCheck History
Default Job < 1 sec
java.lang.AssertionError: Expected type not found.
Expected: java.lang.Integer
Found: java.lang.Object
Declaring type: foo.Bar
ASTNode: [email protected][getBaz]
Confidence: UNKNOWN

java.lang.AssertionError: 
(8 more lines...)

Jira issues

IssueDescriptionStatus
Unknown Issue TypeGROOVY-5523Could not obtain issue details from Jira
Unknown Issue TypeGROOVY-7753Could not obtain issue details from Jira
Unknown Issue TypeGROOVY-8946Could not obtain issue details from Jira
Unknown Issue TypeGROOVY-9972Could not obtain issue details from Jira
Unknown Issue TypeGROOVY-9983Could not obtain issue details from Jira