Build: #345 failed

Job: Default Job failed

Stages & jobs

  1. Default Stage

Job result summary

Completed
Duration
75 minutes
Agent
bamboo-34.spring.vmware.com
Revision
058310cb700473827fbeb120e56cb1b43d868b45 058310cb700473827fbeb120e56cb1b43d868b45
Total tests
6102
Fixed in
#346 (Code changes detected)

Tests

  • 6,102 tests in total
  • 2 tests failed
  • 2 failures are new
  • 98 tests were quarantined / skipped
  • 69 minutes taken in total.
New test failures 2
Status Test Duration
Collapse Failed BasicGroovyBuildTests testBuildJavaHelloWorld History
< 1 sec
org.junit.internal.ArrayComparisonFailure: array lengths differed, expected.length=1 actual.length=2; arrays first differed at element [1]; expected:<end of array> but was:<p1.Hello>
	at org.eclipse.jdt.core.groovy.tests.builder.BasicGroovyBuildTests.testBuildJavaHelloWorld(BasicGroovyBuildTests.java:205)
Caused by: java.lang.AssertionError: expected:<end of array> but was:<p1.Hello>
	at org.eclipse.jdt.core.groovy.tests.builder.BasicGroovyBuildTests.testBuildJavaHelloWorld(BasicGroovyBuildTests.java:205)
Collapse Failed SpockInferencingTests testGetterCheck History
< 1 sec
java.lang.AssertionError: Expected type not found.
Expected: java.lang.Integer
Found: java.lang.Object
Declaring type: foo.Bar
ASTNode: [email protected][getBaz]
Confidence: UNKNOWN

java.lang.AssertionError: 
(8 more lines...)

Error summary

The build generated some errors. See the full build log for more details.

Waiting for: Java indexing... 22 files to index (/TestProject)
Waiting for: Cleaning/Rebuilding Project: TestProject
Waiting for: Java indexing... 22 files to index (/TestProject)
Waiting for: Cleaning/Rebuilding Project: TestProject
Waiting for: Java indexing... 22 files to index (/TestProject)
Waiting for: Cleaning/Rebuilding Project: TestProject
Waiting for: Cleaning/Rebuilding Project: OtherProject
Waiting for: Java indexing... 10 files to index (/opt/jdk8u292-b10/jre/lib/ext/nashorn.jar)
Waiting for: Cleaning/Rebuilding Project: P4
Waiting for: Cleaning/Rebuilding Project: P3
Waiting for: Java indexing... 22 files to index (/P3)
Waiting for: Cleaning/Rebuilding Project: P2
Waiting for: Java indexing... 22 files to index (/P2)
Waiting for: Cleaning/Rebuilding Project: P1
Waiting for: Java indexing... 22 files to index (/P1)
Waiting for: Cleaning/Rebuilding Project: P1a
Waiting for: Java indexing... 22 files to index (/P1a)
Waiting for: Cleaning/Rebuilding Project: P2a
Waiting for: Cleaning/Rebuilding Project: OtherProject
Waiting for: Java indexing... 20 files to index (/OtherProject)
Waiting for: Cleaning/Rebuilding Project: TestProject
Waiting for: Java indexing... 22 files to index (/TestProject)
CodeSelectRequestor: Could not proceed due to null declaring type for [email protected][fff]
CodeSelectRequestor: Could not proceed due to null declaring type for [email protected][fff]
CodeSelectRequestor: Could not proceed due to null declaring type for [email protected][fff]
Waiting for: Cleaning/Rebuilding Project: TestProject
Waiting for: Java indexing... 22 files to index (/TestProject)
Waiting for: Cleaning/Rebuilding Project: TestProject
Waiting for: Java indexing... 22 files to index (/TestProject)
Waiting for: Cleaning/Rebuilding Project: TestProject
Waiting for: Java indexing... 22 files to index (/TestProject)
Waiting for: Cleaning/Rebuilding Project: TestProject
Waiting for: Java indexing... 22 files to index (/TestProject)
Waiting for: Cleaning/Rebuilding Project: TestProject
Waiting for: Java indexing... 22 files to index (/TestProject)
Waiting for: Cleaning/Rebuilding Project: TestProject
Waiting for: Java indexing... 22 files to index (/TestProject)
Waiting for: Cleaning/Rebuilding Project: TestProject
Waiting for: Java indexing... 22 files to index (/TestProject)
Waiting for: Cleaning/Rebuilding Project: TestProject
Waiting for: Cleaning/Rebuilding Project: TestProject
May 18, 2021 12:05:57 AM groovy.util.FactoryBuilderSupport createNode
WARNING: Could not find match for name 'normal'
May 18, 2021 12:05:57 AM groovy.util.FactoryBuilderSupport createNode
WARNING: Could not find match for name 'normal'
May 18, 2021 12:06:09 AM groovy.util.FactoryBuilderSupport createNode
WARNING: Could not find match for name 'star'
May 18, 2021 12:06:09 AM groovy.util.FactoryBuilderSupport createNode
WARNING: Could not find match for name 'star'
May 18, 2021 12:06:10 AM groovy.util.FactoryBuilderSupport createNode
WARNING: Could not find match for name 'normal'
May 18, 2021 12:06:10 AM groovy.util.FactoryBuilderSupport createNode
WARNING: Could not find match for name 'normal'
May 18, 2021 12:06:11 AM groovy.util.FactoryBuilderSupport createNode
WARNING: Could not find match for name 'normal'
May 18, 2021 12:06:11 AM groovy.util.FactoryBuilderSupport createNode
WARNING: Could not find match for name 'normal'
May 18, 2021 12:06:11 AM groovy.util.FactoryBuilderSupport createNode
WARNING: Could not find match for name 'normal'
May 18, 2021 12:06:11 AM groovy.util.FactoryBuilderSupport createNode
WARNING: Could not find match for name 'normal'
May 18, 2021 12:06:13 AM groovy.util.FactoryBuilderSupport createNode
WARNING: Could not find match for name 'star'
May 18, 2021 12:06:17 AM groovy.util.FactoryBuilderSupport createNode
WARNING: Could not find match for name 'normal'
May 18, 2021 12:06:18 AM groovy.util.FactoryBuilderSupport createNode
WARNING: Could not find match for name 'star'
May 18, 2021 12:06:18 AM groovy.util.FactoryBuilderSupport createNode
WARNING: Could not find match for name 'normal'
May 18, 2021 12:06:18 AM groovy.util.FactoryBuilderSupport createNode
WARNING: Could not find match for name 'normal'
May 18, 2021 12:06:20 AM groovy.util.FactoryBuilderSupport createNode
WARNING: Could not find match for name 'star'
May 18, 2021 12:06:21 AM groovy.util.FactoryBuilderSupport createNode
WARNING: Could not find match for name 'normal'
May 18, 2021 12:06:21 AM groovy.util.FactoryBuilderSupport createNode
WARNING: Could not find match for name 'normal'
May 18, 2021 12:06:21 AM groovy.util.FactoryBuilderSupport createNode
WARNING: Could not find match for name 'normal'
May 18, 2021 12:08:17 AM groovy.util.FactoryBuilderSupport createNode
WARNING: Could not find match for name 'normal'
Executing Spock 2.0.0-M4-groovy-3.0 with NOT compatible Groovy version 4.0.0-alpha-3 due to set spock.iKnowWhatImDoing.disableGroovyVersionCheck system property. This is unsupported and may result in weird runtime errors!
Executing Spock 2.0.0-M4-groovy-3.0 with NOT compatible Groovy version 4.0.0-alpha-3 due to set spock.iKnowWhatImDoing.disableGroovyVersionCheck system property. This is unsupported and may result in weird runtime errors!
Executing Spock 2.0.0-M4-groovy-3.0 with NOT compatible Groovy version 4.0.0-alpha-3 due to set spock.iKnowWhatImDoing.disableGroovyVersionCheck system property. This is unsupported and may result in weird runtime errors!
Executing Spock 2.0.0-M4-groovy-3.0 with NOT compatible Groovy version 4.0.0-alpha-3 due to set spock.iKnowWhatImDoing.disableGroovyVersionCheck system property. This is unsupported and may result in weird runtime errors!
Executing Spock 2.0.0-M4-groovy-3.0 with NOT compatible Groovy version 4.0.0-alpha-3 due to set spock.iKnowWhatImDoing.disableGroovyVersionCheck system property. This is unsupported and may result in weird runtime errors!
Executing Spock 2.0.0-M4-groovy-3.0 with NOT compatible Groovy version 4.0.0-alpha-3 due to set spock.iKnowWhatImDoing.disableGroovyVersionCheck system property. This is unsupported and may result in weird runtime errors!
Executing Spock 2.0.0-M4-groovy-3.0 with NOT compatible Groovy version 4.0.0-alpha-3 due to set spock.iKnowWhatImDoing.disableGroovyVersionCheck system property. This is unsupported and may result in weird runtime errors!
May 18, 2021 12:11:55 AM groovy.util.FactoryBuilderSupport createNode
WARNING: Could not find match for name 'normal'
May 18, 2021 12:11:55 AM groovy.util.FactoryBuilderSupport createNode
WARNING: Could not find match for name 'staticMember'
TypeInferencingVisitorWithRequestor.findMethodNode: no match found for Search(Qgroovy.lang.Binding;)
TypeInferencingVisitorWithRequestor.findMethodNode: no match found for Search(Qgroovy.lang.Binding;)
TypeInferencingVisitorWithRequestor.findMethodNode: no match found for Search(Qgroovy.lang.Binding;)
TypeInferencingVisitorWithRequestor.findMethodNode: no match found for Search(Qgroovy.lang.Binding;)
TypeInferencingVisitorWithRequestor.findMethodNode: no match found for Search(Qgroovy.lang.Binding;)
TypeInferencingVisitorWithRequestor.findMethodNode: no match found for Search(Qgroovy.lang.Binding;)
TypeInferencingVisitorWithRequestor.findMethodNode: no match found for Search.test(QSet<Qjava.beans.BeanInfo;>;)
TypeInferencingVisitorWithRequestor.findMethodNode: no match found for Search.test(QSet<Qjava.beans.BeanInfo;>;)