Build: #345 failed

Job: Default Job failed

Stages & jobs

  1. Default Stage

Build log

The build generated 70,104 lines of output.The output is too long and has been truncated to the last 1,000 lines. Download or view full build log

18-May-2021 00:30:54 testDelegatesToResolveStrategy2(org.eclipse.jdt.core.groovy.tests.search.Groovy21InferencingTests)  Time elapsed: 1.209 s
18-May-2021 00:30:54 testDelegatesToResolveStrategy3(org.eclipse.jdt.core.groovy.tests.search.Groovy21InferencingTests)  Time elapsed: 1.344 s
18-May-2021 00:30:54 testDelegatesToResolveStrategy4(org.eclipse.jdt.core.groovy.tests.search.Groovy21InferencingTests)  Time elapsed: 1.312 s
18-May-2021 00:30:54 testDelegatesToTarget2a(org.eclipse.jdt.core.groovy.tests.search.Groovy21InferencingTests)  Time elapsed: 1.328 s
18-May-2021 00:30:54 testDelegatesToTypeName3a(org.eclipse.jdt.core.groovy.tests.search.Groovy21InferencingTests)  Time elapsed: 0.68 s
18-May-2021 00:30:54 testDelegatesToTypeName3b(org.eclipse.jdt.core.groovy.tests.search.Groovy21InferencingTests)  Time elapsed: 0.686 s
18-May-2021 00:30:54 testTypeCheckingExtension(org.eclipse.jdt.core.groovy.tests.search.Groovy21InferencingTests)  Time elapsed: 1.513 s
18-May-2021 00:30:54 testDelegatesToTarget1(org.eclipse.jdt.core.groovy.tests.search.Groovy21InferencingTests)  Time elapsed: 1.31 s
18-May-2021 00:30:54 testDelegatesToTarget2(org.eclipse.jdt.core.groovy.tests.search.Groovy21InferencingTests)  Time elapsed: 1.333 s
18-May-2021 00:30:54 testDelegatesToTarget3(org.eclipse.jdt.core.groovy.tests.search.Groovy21InferencingTests)  Time elapsed: 1.277 s
18-May-2021 00:30:54 testDelegatesToTarget4(org.eclipse.jdt.core.groovy.tests.search.Groovy21InferencingTests)  Time elapsed: 1.882 s
18-May-2021 00:30:54 testDelegatesToTarget5(org.eclipse.jdt.core.groovy.tests.search.Groovy21InferencingTests)  Time elapsed: 1.331 s
18-May-2021 00:30:54 testDelegatesToTarget6(org.eclipse.jdt.core.groovy.tests.search.Groovy21InferencingTests)  Time elapsed: 1.331 s
18-May-2021 00:30:54 testDelegatesToTarget7(org.eclipse.jdt.core.groovy.tests.search.Groovy21InferencingTests)  Time elapsed: 1.36 s
18-May-2021 00:30:54 testDelegatesToValue2(org.eclipse.jdt.core.groovy.tests.search.Groovy21InferencingTests)  Time elapsed: 0.739 s
18-May-2021 00:30:54 testDelegatesToValue3(org.eclipse.jdt.core.groovy.tests.search.Groovy21InferencingTests)  Time elapsed: 0.715 s
18-May-2021 00:30:54 testDelegatesToValue4(org.eclipse.jdt.core.groovy.tests.search.Groovy21InferencingTests)  Time elapsed: 0.715 s
18-May-2021 00:30:54 testDelegatesToValue5(org.eclipse.jdt.core.groovy.tests.search.Groovy21InferencingTests)  Time elapsed: 0.715 s
18-May-2021 00:30:54 testDelegatesToValue6(org.eclipse.jdt.core.groovy.tests.search.Groovy21InferencingTests)  Time elapsed: 0.731 s
18-May-2021 00:30:54 testDelegatesToTypeName1(org.eclipse.jdt.core.groovy.tests.search.Groovy21InferencingTests)  Time elapsed: 0.67 s
18-May-2021 00:30:54 testDelegatesToTypeName2(org.eclipse.jdt.core.groovy.tests.search.Groovy21InferencingTests)  Time elapsed: 0.722 s
18-May-2021 00:30:54 testDelegatesToTypeName3(org.eclipse.jdt.core.groovy.tests.search.Groovy21InferencingTests)  Time elapsed: 0.671 s
18-May-2021 00:30:54 testDelegatesToValue(org.eclipse.jdt.core.groovy.tests.search.Groovy21InferencingTests)  Time elapsed: 0.704 s
18-May-2021 00:30:54 testEnumOverrides1(org.eclipse.jdt.core.groovy.tests.search.Groovy21InferencingTests)  Time elapsed: 0.717 s
18-May-2021 00:30:54 testEnumOverrides2(org.eclipse.jdt.core.groovy.tests.search.Groovy21InferencingTests)  Time elapsed: 0.724 s
18-May-2021 00:30:54 testEnumOverrides3(org.eclipse.jdt.core.groovy.tests.search.Groovy21InferencingTests)  Time elapsed: 1.363 s
18-May-2021 00:30:54 testEnumOverrides4(org.eclipse.jdt.core.groovy.tests.search.Groovy21InferencingTests)  Time elapsed: 0.669 s
18-May-2021 00:30:54 testEnumOverrides4a(org.eclipse.jdt.core.groovy.tests.search.Groovy21InferencingTests)  Time elapsed: 0.709 s
18-May-2021 00:30:54 testEnumOverrides4b(org.eclipse.jdt.core.groovy.tests.search.Groovy21InferencingTests)  Time elapsed: 0.719 s
18-May-2021 00:30:54 testMemoized1(org.eclipse.jdt.core.groovy.tests.search.Groovy22InferencingTests)  Time elapsed: 0.753 s
18-May-2021 00:30:54 testMemoized2(org.eclipse.jdt.core.groovy.tests.search.Groovy22InferencingTests)  Time elapsed: 1.303 s
18-May-2021 00:30:54 testMemoized3(org.eclipse.jdt.core.groovy.tests.search.Groovy22InferencingTests)  Time elapsed: 0.704 s
18-May-2021 00:30:54 testMemoized4(org.eclipse.jdt.core.groovy.tests.search.Groovy22InferencingTests)  Time elapsed: 0.703 s
18-May-2021 00:30:54 testDelegatesToGenericTypeIndex1(org.eclipse.jdt.core.groovy.tests.search.Groovy22InferencingTests)  Time elapsed: 0.766 s
18-May-2021 00:30:54 testDelegatesToGenericTypeIndex2(org.eclipse.jdt.core.groovy.tests.search.Groovy22InferencingTests)  Time elapsed: 0.719 s
18-May-2021 00:30:54 testDelegatesToGenericTypeIndex3(org.eclipse.jdt.core.groovy.tests.search.Groovy22InferencingTests)  Time elapsed: 0.713 s
18-May-2021 00:30:54 testBaseScript1(org.eclipse.jdt.core.groovy.tests.search.Groovy22InferencingTests)  Time elapsed: 1.257 s
18-May-2021 00:30:54 testBaseScript2(org.eclipse.jdt.core.groovy.tests.search.Groovy22InferencingTests)  Time elapsed: 1.305 s
18-May-2021 00:30:54 testBaseScript3(org.eclipse.jdt.core.groovy.tests.search.Groovy22InferencingTests)  Time elapsed: 1.315 s
18-May-2021 00:30:54 org.eclipse.jdt.core.groovy.tests.search.Groovy25InferencingTests skipped
18-May-2021 00:30:54 testFieldAndPropertyWithSameName(org.eclipse.jdt.core.groovy.tests.search.InferencingTests)  Time elapsed: 0.71 s
18-May-2021 00:30:54 testObjectMethodOnInterface(org.eclipse.jdt.core.groovy.tests.search.InferencingTests)  Time elapsed: 0.716 s
18-May-2021 00:30:54 testLocalWithInitializer1(org.eclipse.jdt.core.groovy.tests.search.InferencingTests)  Time elapsed: 0.709 s
18-May-2021 00:30:54 testLocalWithInitializer2(org.eclipse.jdt.core.groovy.tests.search.InferencingTests)  Time elapsed: 0.7 s
18-May-2021 00:30:54 testLocalWithInitializer3(org.eclipse.jdt.core.groovy.tests.search.InferencingTests)  Time elapsed: 0.706 s
18-May-2021 00:30:54 testLocalWithInitializer4(org.eclipse.jdt.core.groovy.tests.search.InferencingTests)  Time elapsed: 0.706 s
18-May-2021 00:30:54 testLocalWithInitializer5(org.eclipse.jdt.core.groovy.tests.search.InferencingTests)  Time elapsed: 0.715 s
18-May-2021 00:30:54 testEqualsClassTest1(org.eclipse.jdt.core.groovy.tests.search.InferencingTests)  Time elapsed: 2.389 s
18-May-2021 00:30:54 testEqualsClassTest2(org.eclipse.jdt.core.groovy.tests.search.InferencingTests)  Time elapsed: 2.462 s
18-May-2021 00:30:54 testEqualsClassTest3(org.eclipse.jdt.core.groovy.tests.search.InferencingTests) skipped
18-May-2021 00:30:54 testEqualsClassTest4(org.eclipse.jdt.core.groovy.tests.search.InferencingTests)  Time elapsed: 2.485 s
18-May-2021 00:30:54 testNothingIsUnknown(org.eclipse.jdt.core.groovy.tests.search.InferencingTests)  Time elapsed: 0.219 s
18-May-2021 00:30:54 testNonCategoryUseMethod(org.eclipse.jdt.core.groovy.tests.search.InferencingTests)  Time elapsed: 1.048 s
18-May-2021 00:30:54 testInnerClass1(org.eclipse.jdt.core.groovy.tests.search.InferencingTests)  Time elapsed: 0.767 s
18-May-2021 00:30:54 testInnerClass2(org.eclipse.jdt.core.groovy.tests.search.InferencingTests)  Time elapsed: 0.705 s
18-May-2021 00:30:54 testInnerClass3(org.eclipse.jdt.core.groovy.tests.search.InferencingTests)  Time elapsed: 0.708 s
18-May-2021 00:30:54 testInnerClass4(org.eclipse.jdt.core.groovy.tests.search.InferencingTests)  Time elapsed: 0.716 s
18-May-2021 00:30:54 testInnerClass5(org.eclipse.jdt.core.groovy.tests.search.InferencingTests)  Time elapsed: 0.565 s
18-May-2021 00:30:54 testInnerClass6(org.eclipse.jdt.core.groovy.tests.search.InferencingTests)  Time elapsed: 0.604 s
18-May-2021 00:30:54 testInnerClass7(org.eclipse.jdt.core.groovy.tests.search.InferencingTests)  Time elapsed: 2.408 s
18-May-2021 00:30:54 testInnerClass8(org.eclipse.jdt.core.groovy.tests.search.InferencingTests)  Time elapsed: 2.495 s
18-May-2021 00:30:54 testInnerClass9(org.eclipse.jdt.core.groovy.tests.search.InferencingTests)  Time elapsed: 1.356 s
18-May-2021 00:30:54 testMethodOverloadsArgumentMatching1(org.eclipse.jdt.core.groovy.tests.search.InferencingTests)  Time elapsed: 0.72 s
18-May-2021 00:30:54 testMethodOverloadsArgumentMatching2(org.eclipse.jdt.core.groovy.tests.search.InferencingTests)  Time elapsed: 0.729 s
18-May-2021 00:30:54 testMethodOverloadsArgumentMatching3(org.eclipse.jdt.core.groovy.tests.search.InferencingTests)  Time elapsed: 0.711 s
18-May-2021 00:30:54 testMethodOverloadsArgumentMatching4(org.eclipse.jdt.core.groovy.tests.search.InferencingTests)  Time elapsed: 1.619 s
18-May-2021 00:30:54 testMethodOverloadsArgumentMatching5(org.eclipse.jdt.core.groovy.tests.search.InferencingTests)  Time elapsed: 0.706 s
18-May-2021 00:30:54 testMethodOverloadsArgumentMatching6(org.eclipse.jdt.core.groovy.tests.search.InferencingTests)  Time elapsed: 0.715 s
18-May-2021 00:30:54 testMethodOverloadsArgumentMatching7(org.eclipse.jdt.core.groovy.tests.search.InferencingTests)  Time elapsed: 0.711 s
18-May-2021 00:30:54 testMethodOverloadsArgumentMatching8(org.eclipse.jdt.core.groovy.tests.search.InferencingTests)  Time elapsed: 0.713 s
18-May-2021 00:30:54 testMethodOverloadsArgumentMatching9(org.eclipse.jdt.core.groovy.tests.search.InferencingTests)  Time elapsed: 0.712 s
18-May-2021 00:30:54 testBoolean1(org.eclipse.jdt.core.groovy.tests.search.InferencingTests)  Time elapsed: 0.7 s
18-May-2021 00:30:54 testBoolean2(org.eclipse.jdt.core.groovy.tests.search.InferencingTests)  Time elapsed: 0.704 s
18-May-2021 00:30:54 testBoolean3(org.eclipse.jdt.core.groovy.tests.search.InferencingTests)  Time elapsed: 0.676 s
18-May-2021 00:30:54 testBoolean4(org.eclipse.jdt.core.groovy.tests.search.InferencingTests)  Time elapsed: 0.701 s
18-May-2021 00:30:54 testBoolean5(org.eclipse.jdt.core.groovy.tests.search.InferencingTests)  Time elapsed: 0.703 s
18-May-2021 00:30:54 testBoolean6(org.eclipse.jdt.core.groovy.tests.search.InferencingTests)  Time elapsed: 0.704 s
18-May-2021 00:30:54 testBoolean7(org.eclipse.jdt.core.groovy.tests.search.InferencingTests)  Time elapsed: 0.685 s
18-May-2021 00:30:54 testNonPublicCategoryMethod(org.eclipse.jdt.core.groovy.tests.search.InferencingTests)  Time elapsed: 0.703 s
18-May-2021 00:30:54 testDeclarationAtBeginningOfMethod(org.eclipse.jdt.core.groovy.tests.search.InferencingTests)  Time elapsed: 0.704 s
18-May-2021 00:30:54 testLocalTypeAndDefaultImportCollision(org.eclipse.jdt.core.groovy.tests.search.InferencingTests)  Time elapsed: 1.291 s
18-May-2021 00:30:54 testTernaryInitializer(org.eclipse.jdt.core.groovy.tests.search.InferencingTests)  Time elapsed: 0.705 s
18-May-2021 00:30:54 testSuperFieldReference1a(org.eclipse.jdt.core.groovy.tests.search.InferencingTests)  Time elapsed: 0.666 s
18-May-2021 00:30:54 testSuperFieldReference1b(org.eclipse.jdt.core.groovy.tests.search.InferencingTests)  Time elapsed: 0.738 s
18-May-2021 00:30:54 testSuperFieldReference1c(org.eclipse.jdt.core.groovy.tests.search.InferencingTests)  Time elapsed: 0.704 s
18-May-2021 00:30:54 testSuperFieldReference1d(org.eclipse.jdt.core.groovy.tests.search.InferencingTests)  Time elapsed: 0.702 s
18-May-2021 00:30:54 testSuperFieldReference2a(org.eclipse.jdt.core.groovy.tests.search.InferencingTests)  Time elapsed: 0.706 s
18-May-2021 00:30:54 testSuperFieldReference2b(org.eclipse.jdt.core.groovy.tests.search.InferencingTests)  Time elapsed: 0.695 s
18-May-2021 00:30:54 testSuperFieldReference2c(org.eclipse.jdt.core.groovy.tests.search.InferencingTests)  Time elapsed: 0.7 s
18-May-2021 00:30:54 testSuperFieldReference2d(org.eclipse.jdt.core.groovy.tests.search.InferencingTests)  Time elapsed: 0.712 s
18-May-2021 00:30:54 testSuperFieldReference3a(org.eclipse.jdt.core.groovy.tests.search.InferencingTests)  Time elapsed: 0.731 s
18-May-2021 00:30:54 testSuperFieldReference3b(org.eclipse.jdt.core.groovy.tests.search.InferencingTests)  Time elapsed: 0.702 s
18-May-2021 00:30:54 testSuperFieldReference3c(org.eclipse.jdt.core.groovy.tests.search.InferencingTests)  Time elapsed: 0.698 s
18-May-2021 00:30:54 testSuperFieldReference3d(org.eclipse.jdt.core.groovy.tests.search.InferencingTests)  Time elapsed: 0.706 s
18-May-2021 00:30:54 testSuperFieldReference5a(org.eclipse.jdt.core.groovy.tests.search.InferencingTests)  Time elapsed: 0.748 s
18-May-2021 00:30:54 testSuperFieldReference5b(org.eclipse.jdt.core.groovy.tests.search.InferencingTests)  Time elapsed: 0.668 s
18-May-2021 00:30:54 testMethodOverloadsArgumentMatching14a(org.eclipse.jdt.core.groovy.tests.search.InferencingTests)  Time elapsed: 3.08 s
18-May-2021 00:30:54 testMethodOverloadsArgumentMatching15a(org.eclipse.jdt.core.groovy.tests.search.InferencingTests)  Time elapsed: 0.711 s
18-May-2021 00:30:54 testSpecialConstructor1(org.eclipse.jdt.core.groovy.tests.search.InferencingTests)  Time elapsed: 1.177 s
18-May-2021 00:30:54 testSpecialConstructor2(org.eclipse.jdt.core.groovy.tests.search.InferencingTests)  Time elapsed: 1.194 s
18-May-2021 00:30:54 testInnerClass10(org.eclipse.jdt.core.groovy.tests.search.InferencingTests)  Time elapsed: 1.311 s
18-May-2021 00:30:54 testInnerClass11(org.eclipse.jdt.core.groovy.tests.search.InferencingTests)  Time elapsed: 1.298 s
18-May-2021 00:30:54 testMultiDecl10(org.eclipse.jdt.core.groovy.tests.search.InferencingTests)  Time elapsed: 1.305 s
18-May-2021 00:30:54 testMultiDecl11(org.eclipse.jdt.core.groovy.tests.search.InferencingTests)  Time elapsed: 1.308 s
18-May-2021 00:30:54 testMultiDecl12(org.eclipse.jdt.core.groovy.tests.search.InferencingTests)  Time elapsed: 1.358 s
18-May-2021 00:30:54 testMultiDecl13(org.eclipse.jdt.core.groovy.tests.search.InferencingTests)  Time elapsed: 1.306 s
18-May-2021 00:30:54 testAsExpression1(org.eclipse.jdt.core.groovy.tests.search.InferencingTests)  Time elapsed: 0.708 s
18-May-2021 00:30:54 testAsExpression2(org.eclipse.jdt.core.groovy.tests.search.InferencingTests)  Time elapsed: 0.704 s
18-May-2021 00:30:54 testSuperClassMethod1(org.eclipse.jdt.core.groovy.tests.search.InferencingTests)  Time elapsed: 0.689 s
18-May-2021 00:30:54 testSuperClassMethod2(org.eclipse.jdt.core.groovy.tests.search.InferencingTests)  Time elapsed: 0.709 s
18-May-2021 00:30:54 testSuperClassMethod3(org.eclipse.jdt.core.groovy.tests.search.InferencingTests)  Time elapsed: 0.71 s
18-May-2021 00:30:54 testSuperClassMethod4(org.eclipse.jdt.core.groovy.tests.search.InferencingTests)  Time elapsed: 0.7 s
18-May-2021 00:30:54 testSuperClassMethod5(org.eclipse.jdt.core.groovy.tests.search.InferencingTests)  Time elapsed: 1.296 s
18-May-2021 00:30:54 testElvisInitializer(org.eclipse.jdt.core.groovy.tests.search.InferencingTests)  Time elapsed: 0.703 s
18-May-2021 00:30:54 testSuperPropertyReference1(org.eclipse.jdt.core.groovy.tests.search.InferencingTests)  Time elapsed: 0.708 s
18-May-2021 00:30:54 testSuperPropertyReference2(org.eclipse.jdt.core.groovy.tests.search.InferencingTests)  Time elapsed: 0.706 s
18-May-2021 00:30:54 testSuperPropertyReference3(org.eclipse.jdt.core.groovy.tests.search.InferencingTests)  Time elapsed: 0.709 s
18-May-2021 00:30:54 testSuperPropertyReference4(org.eclipse.jdt.core.groovy.tests.search.InferencingTests)  Time elapsed: 0.715 s
18-May-2021 00:30:54 testSuperPropertyReference5(org.eclipse.jdt.core.groovy.tests.search.InferencingTests)  Time elapsed: 0.713 s
18-May-2021 00:30:54 testRangeExpression1(org.eclipse.jdt.core.groovy.tests.search.InferencingTests)  Time elapsed: 0.702 s
18-May-2021 00:30:54 testRangeExpression2(org.eclipse.jdt.core.groovy.tests.search.InferencingTests)  Time elapsed: 0.743 s
18-May-2021 00:30:54 testRangeExpression3(org.eclipse.jdt.core.groovy.tests.search.InferencingTests)  Time elapsed: 0.702 s
18-May-2021 00:30:54 testRangeExpression4(org.eclipse.jdt.core.groovy.tests.search.InferencingTests)  Time elapsed: 0.705 s
18-May-2021 00:30:54 testRangeExpression5(org.eclipse.jdt.core.groovy.tests.search.InferencingTests)  Time elapsed: 0.704 s
18-May-2021 00:30:54 testRangeExpression6(org.eclipse.jdt.core.groovy.tests.search.InferencingTests)  Time elapsed: 0.706 s
18-May-2021 00:30:54 testSpread10(org.eclipse.jdt.core.groovy.tests.search.InferencingTests)  Time elapsed: 0.741 s
18-May-2021 00:30:54 testSpread11(org.eclipse.jdt.core.groovy.tests.search.InferencingTests)  Time elapsed: 0.711 s
18-May-2021 00:30:54 testSpread12(org.eclipse.jdt.core.groovy.tests.search.InferencingTests)  Time elapsed: 0.706 s
18-May-2021 00:30:54 testSpread13(org.eclipse.jdt.core.groovy.tests.search.InferencingTests)  Time elapsed: 1.321 s
18-May-2021 00:30:54 testSpread14(org.eclipse.jdt.core.groovy.tests.search.InferencingTests)  Time elapsed: 1.325 s
18-May-2021 00:30:54 testSpread15(org.eclipse.jdt.core.groovy.tests.search.InferencingTests)  Time elapsed: 1.305 s
18-May-2021 00:30:54 testSpread16(org.eclipse.jdt.core.groovy.tests.search.InferencingTests)  Time elapsed: 1.314 s
18-May-2021 00:30:54 testSpread17(org.eclipse.jdt.core.groovy.tests.search.InferencingTests)  Time elapsed: 0.697 s
18-May-2021 00:30:54 testSpread18(org.eclipse.jdt.core.groovy.tests.search.InferencingTests)  Time elapsed: 0.72 s
18-May-2021 00:30:54 testSpread19(org.eclipse.jdt.core.groovy.tests.search.InferencingTests)  Time elapsed: 0.72 s
18-May-2021 00:30:54 testSpread20(org.eclipse.jdt.core.groovy.tests.search.InferencingTests)  Time elapsed: 0.772 s
18-May-2021 00:30:54 testStaticThisAndSuper1(org.eclipse.jdt.core.groovy.tests.search.InferencingTests)  Time elapsed: 1.295 s
18-May-2021 00:30:54 testStaticThisAndSuper2(org.eclipse.jdt.core.groovy.tests.search.InferencingTests)  Time elapsed: 1.308 s
18-May-2021 00:30:54 testMethodOverloadsArgumentMatching10(org.eclipse.jdt.core.groovy.tests.search.InferencingTests)  Time elapsed: 0.716 s
18-May-2021 00:30:54 testMethodOverloadsArgumentMatching11(org.eclipse.jdt.core.groovy.tests.search.InferencingTests)  Time elapsed: 0.707 s
18-May-2021 00:30:54 testMethodOverloadsArgumentMatching12(org.eclipse.jdt.core.groovy.tests.search.InferencingTests)  Time elapsed: 0.713 s
18-May-2021 00:30:54 testMethodOverloadsArgumentMatching13(org.eclipse.jdt.core.groovy.tests.search.InferencingTests)  Time elapsed: 0.727 s
18-May-2021 00:30:54 testMethodOverloadsArgumentMatching14(org.eclipse.jdt.core.groovy.tests.search.InferencingTests)  Time elapsed: 3.129 s
18-May-2021 00:30:54 testMethodOverloadsArgumentMatching15(org.eclipse.jdt.core.groovy.tests.search.InferencingTests)  Time elapsed: 1.896 s
18-May-2021 00:30:54 testMethodOverloadsArgumentMatching16(org.eclipse.jdt.core.groovy.tests.search.InferencingTests)  Time elapsed: 0.719 s
18-May-2021 00:30:54 testMethodOverloadsArgumentMatching4a(org.eclipse.jdt.core.groovy.tests.search.InferencingTests)  Time elapsed: 0.754 s
18-May-2021 00:30:54 testMethodOverloadsArgumentMatching4b(org.eclipse.jdt.core.groovy.tests.search.InferencingTests)  Time elapsed: 0.713 s
18-May-2021 00:30:54 testMethodOverloadsArgumentMatching5a(org.eclipse.jdt.core.groovy.tests.search.InferencingTests)  Time elapsed: 0.707 s
18-May-2021 00:30:54 testMethodOverloadsArgumentMatching5b(org.eclipse.jdt.core.groovy.tests.search.InferencingTests)  Time elapsed: 0.697 s
18-May-2021 00:30:54 testMethodOverloadsArgumentMatching6a(org.eclipse.jdt.core.groovy.tests.search.InferencingTests)  Time elapsed: 0.731 s
18-May-2021 00:30:54 testMethodOverloadsArgumentMatching6b(org.eclipse.jdt.core.groovy.tests.search.InferencingTests)  Time elapsed: 0.722 s
18-May-2021 00:30:54 testMethodOverloadsArgumentMatching8a(org.eclipse.jdt.core.groovy.tests.search.InferencingTests)  Time elapsed: 0.711 s
18-May-2021 00:30:54 testConstructor1(org.eclipse.jdt.core.groovy.tests.search.InferencingTests)  Time elapsed: 2.484 s
18-May-2021 00:30:54 testConstructor2(org.eclipse.jdt.core.groovy.tests.search.InferencingTests)  Time elapsed: 2.329 s
18-May-2021 00:30:54 testConstructor3(org.eclipse.jdt.core.groovy.tests.search.InferencingTests)  Time elapsed: 1.31 s
18-May-2021 00:30:54 testConstructor4(org.eclipse.jdt.core.groovy.tests.search.InferencingTests)  Time elapsed: 2.378 s
18-May-2021 00:30:54 testConstructor5(org.eclipse.jdt.core.groovy.tests.search.InferencingTests)  Time elapsed: 2.493 s
18-May-2021 00:30:54 testConstructor6(org.eclipse.jdt.core.groovy.tests.search.InferencingTests)  Time elapsed: 2.387 s
18-May-2021 00:30:54 testClassWithInitializer1(org.eclipse.jdt.core.groovy.tests.search.InferencingTests)  Time elapsed: 0.714 s
18-May-2021 00:30:54 testClassWithInitializer2(org.eclipse.jdt.core.groovy.tests.search.InferencingTests)  Time elapsed: 0.709 s
18-May-2021 00:30:54 testClassWithInitializer3(org.eclipse.jdt.core.groovy.tests.search.InferencingTests)  Time elapsed: 0.713 s
18-May-2021 00:30:54 testEqualsClassTest1a(org.eclipse.jdt.core.groovy.tests.search.InferencingTests)  Time elapsed: 2.491 s
18-May-2021 00:30:54 testEqualsClassTest2a(org.eclipse.jdt.core.groovy.tests.search.InferencingTests)  Time elapsed: 2.502 s
18-May-2021 00:30:54 testPostfix(org.eclipse.jdt.core.groovy.tests.search.InferencingTests)  Time elapsed: 0.666 s
18-May-2021 00:30:54 testSuperClassMethod4a(org.eclipse.jdt.core.groovy.tests.search.InferencingTests)  Time elapsed: 0.71 s
18-May-2021 00:30:54 testSuperClassMethod4b(org.eclipse.jdt.core.groovy.tests.search.InferencingTests)  Time elapsed: 0.709 s
18-May-2021 00:30:54 testSuperClassMethod4c(org.eclipse.jdt.core.groovy.tests.search.InferencingTests)  Time elapsed: 0.709 s
18-May-2021 00:30:54 testSuperClassMethod5a(org.eclipse.jdt.core.groovy.tests.search.InferencingTests)  Time elapsed: 1.888 s
18-May-2021 00:30:54 testSuperClassMethod5b(org.eclipse.jdt.core.groovy.tests.search.InferencingTests)  Time elapsed: 1.304 s
18-May-2021 00:30:54 testInvokeMethodAndMethodMissing(org.eclipse.jdt.core.groovy.tests.search.InferencingTests)  Time elapsed: 1.258 s
18-May-2021 00:30:54 testStaticPropertyMissing(org.eclipse.jdt.core.groovy.tests.search.InferencingTests)  Time elapsed: 2.497 s
18-May-2021 00:30:54 testListSort1(org.eclipse.jdt.core.groovy.tests.search.InferencingTests)  Time elapsed: 1.294 s
18-May-2021 00:30:54 testListSort2(org.eclipse.jdt.core.groovy.tests.search.InferencingTests)  Time elapsed: 1.254 s
18-May-2021 00:30:54 testListSort3(org.eclipse.jdt.core.groovy.tests.search.InferencingTests)  Time elapsed: 1.299 s
18-May-2021 00:30:54 testLocalVar1(org.eclipse.jdt.core.groovy.tests.search.InferencingTests)  Time elapsed: 0.709 s
18-May-2021 00:30:54 testLocalVar2(org.eclipse.jdt.core.groovy.tests.search.InferencingTests)  Time elapsed: 0.666 s
18-May-2021 00:30:54 testLocalVar3(org.eclipse.jdt.core.groovy.tests.search.InferencingTests)  Time elapsed: 0.747 s
18-May-2021 00:30:54 testLocalVar4(org.eclipse.jdt.core.groovy.tests.search.InferencingTests)  Time elapsed: 0.723 s
18-May-2021 00:30:54 testLocalVar5(org.eclipse.jdt.core.groovy.tests.search.InferencingTests)  Time elapsed: 0.708 s
18-May-2021 00:30:54 testLocalVar6(org.eclipse.jdt.core.groovy.tests.search.InferencingTests)  Time elapsed: 0.674 s
18-May-2021 00:30:54 testLocalVar7(org.eclipse.jdt.core.groovy.tests.search.InferencingTests)  Time elapsed: 0.696 s
18-May-2021 00:30:54 testLocalVar8(org.eclipse.jdt.core.groovy.tests.search.InferencingTests)  Time elapsed: 0.68 s
18-May-2021 00:30:54 testLocalVar9(org.eclipse.jdt.core.groovy.tests.search.InferencingTests)  Time elapsed: 0.72 s
18-May-2021 00:30:54 testIndirectInterfaceMethod(org.eclipse.jdt.core.groovy.tests.search.InferencingTests)  Time elapsed: 1.296 s
18-May-2021 00:30:54 testMapLiteral(org.eclipse.jdt.core.groovy.tests.search.InferencingTests)  Time elapsed: 0.72 s
18-May-2021 00:30:54 testListRemove(org.eclipse.jdt.core.groovy.tests.search.InferencingTests)  Time elapsed: 0.708 s
18-May-2021 00:30:54 testCategoryMethodAsProperty(org.eclipse.jdt.core.groovy.tests.search.InferencingTests)  Time elapsed: 0.695 s
18-May-2021 00:30:54 testSwitchClosureCase1(org.eclipse.jdt.core.groovy.tests.search.InferencingTests)  Time elapsed: 0.72 s
18-May-2021 00:30:54 testSwitchClosureCase2(org.eclipse.jdt.core.groovy.tests.search.InferencingTests)  Time elapsed: 0.695 s
18-May-2021 00:30:54 testSwitchClosureCase3(org.eclipse.jdt.core.groovy.tests.search.InferencingTests)  Time elapsed: 1.295 s
18-May-2021 00:30:54 testNothingIsUnknownWithCategories(org.eclipse.jdt.core.groovy.tests.search.InferencingTests)  Time elapsed: 0.229 s
18-May-2021 00:30:54 testImplicitVar1(org.eclipse.jdt.core.groovy.tests.search.InferencingTests)  Time elapsed: 0.505 s
18-May-2021 00:30:54 testImplicitVar2(org.eclipse.jdt.core.groovy.tests.search.InferencingTests)  Time elapsed: 0.71 s
18-May-2021 00:30:54 testImplicitVar3(org.eclipse.jdt.core.groovy.tests.search.InferencingTests)  Time elapsed: 0.704 s
18-May-2021 00:30:54 testImplicitVar4(org.eclipse.jdt.core.groovy.tests.search.InferencingTests)  Time elapsed: 0.696 s
18-May-2021 00:30:54 testImplicitVar5(org.eclipse.jdt.core.groovy.tests.search.InferencingTests)  Time elapsed: 0.68 s
18-May-2021 00:30:54 testImplicitVar6(org.eclipse.jdt.core.groovy.tests.search.InferencingTests)  Time elapsed: 0.694 s
18-May-2021 00:30:54 testImplicitVar7(org.eclipse.jdt.core.groovy.tests.search.InferencingTests)  Time elapsed: 0.702 s
18-May-2021 00:30:54 testClassLiteral1(org.eclipse.jdt.core.groovy.tests.search.InferencingTests)  Time elapsed: 0.701 s
18-May-2021 00:30:54 testClassLiteral2(org.eclipse.jdt.core.groovy.tests.search.InferencingTests)  Time elapsed: 0.689 s
18-May-2021 00:30:54 testClassLiteral3(org.eclipse.jdt.core.groovy.tests.search.InferencingTests)  Time elapsed: 0.698 s
18-May-2021 00:30:54 testClassLiteral4(org.eclipse.jdt.core.groovy.tests.search.InferencingTests)  Time elapsed: 0.71 s
18-May-2021 00:30:54 testClassLiteral5(org.eclipse.jdt.core.groovy.tests.search.InferencingTests)  Time elapsed: 0.702 s
18-May-2021 00:30:54 testStaticMethodMissing(org.eclipse.jdt.core.groovy.tests.search.InferencingTests)  Time elapsed: 1.299 s
18-May-2021 00:30:54 testInstanceOf10(org.eclipse.jdt.core.groovy.tests.search.InferencingTests)  Time elapsed: 2.97 s
18-May-2021 00:30:54 testInstanceOf11(org.eclipse.jdt.core.groovy.tests.search.InferencingTests)  Time elapsed: 3.666 s
18-May-2021 00:30:54 testInstanceOf12(org.eclipse.jdt.core.groovy.tests.search.InferencingTests)  Time elapsed: 2.384 s
18-May-2021 00:30:54 testInstanceOf13(org.eclipse.jdt.core.groovy.tests.search.InferencingTests)  Time elapsed: 3.1 s
18-May-2021 00:30:54 testInstanceOf14(org.eclipse.jdt.core.groovy.tests.search.InferencingTests)  Time elapsed: 1.286 s
18-May-2021 00:30:54 testInstanceOf15(org.eclipse.jdt.core.groovy.tests.search.InferencingTests)  Time elapsed: 0.715 s
18-May-2021 00:30:54 testInstanceOf16(org.eclipse.jdt.core.groovy.tests.search.InferencingTests)  Time elapsed: 0.709 s
18-May-2021 00:30:54 testInstanceOf17(org.eclipse.jdt.core.groovy.tests.search.InferencingTests)  Time elapsed: 0.706 s
18-May-2021 00:30:54 testInstanceOf1a(org.eclipse.jdt.core.groovy.tests.search.InferencingTests)  Time elapsed: 3.081 s
18-May-2021 00:30:54 testInstanceOf1b(org.eclipse.jdt.core.groovy.tests.search.InferencingTests)  Time elapsed: 3.087 s
18-May-2021 00:30:54 testInstanceOf2a(org.eclipse.jdt.core.groovy.tests.search.InferencingTests) skipped
18-May-2021 00:30:54 testInstanceOf3a(org.eclipse.jdt.core.groovy.tests.search.InferencingTests) skipped
18-May-2021 00:30:54 testThisInInnerClass(org.eclipse.jdt.core.groovy.tests.search.InferencingTests)  Time elapsed: 1.198 s
18-May-2021 00:30:54 testPropertyMissing(org.eclipse.jdt.core.groovy.tests.search.InferencingTests)  Time elapsed: 1.921 s
18-May-2021 00:30:54 testInvokeMethod(org.eclipse.jdt.core.groovy.tests.search.InferencingTests)  Time elapsed: 1.296 s
18-May-2021 00:30:54 testInstanceOf10a(org.eclipse.jdt.core.groovy.tests.search.InferencingTests) skipped
18-May-2021 00:30:54 testMultiDecl1(org.eclipse.jdt.core.groovy.tests.search.InferencingTests)  Time elapsed: 1.24 s
18-May-2021 00:30:54 testMultiDecl2(org.eclipse.jdt.core.groovy.tests.search.InferencingTests)  Time elapsed: 1.299 s
18-May-2021 00:30:54 testMultiDecl3(org.eclipse.jdt.core.groovy.tests.search.InferencingTests)  Time elapsed: 1.294 s
18-May-2021 00:30:54 testMultiDecl4(org.eclipse.jdt.core.groovy.tests.search.InferencingTests)  Time elapsed: 1.295 s
18-May-2021 00:30:54 testMultiDecl6(org.eclipse.jdt.core.groovy.tests.search.InferencingTests)  Time elapsed: 1.294 s
18-May-2021 00:30:54 testMultiDecl7(org.eclipse.jdt.core.groovy.tests.search.InferencingTests)  Time elapsed: 1.344 s
18-May-2021 00:30:54 testMultiDecl8(org.eclipse.jdt.core.groovy.tests.search.InferencingTests)  Time elapsed: 1.241 s
18-May-2021 00:30:54 testMultiDecl9(org.eclipse.jdt.core.groovy.tests.search.InferencingTests)  Time elapsed: 1.295 s
18-May-2021 00:30:54 testLocalMethod1(org.eclipse.jdt.core.groovy.tests.search.InferencingTests)  Time elapsed: 0.76 s
18-May-2021 00:30:54 testLocalMethod2(org.eclipse.jdt.core.groovy.tests.search.InferencingTests)  Time elapsed: 0.712 s
18-May-2021 00:30:54 testLocalMethod3(org.eclipse.jdt.core.groovy.tests.search.InferencingTests)  Time elapsed: 0.699 s
18-May-2021 00:30:54 testLocalMethod4(org.eclipse.jdt.core.groovy.tests.search.InferencingTests)  Time elapsed: 0.704 s
18-May-2021 00:30:54 testLocalMethod5(org.eclipse.jdt.core.groovy.tests.search.InferencingTests)  Time elapsed: 0.753 s
18-May-2021 00:30:54 testLocalVar10(org.eclipse.jdt.core.groovy.tests.search.InferencingTests)  Time elapsed: 0.71 s
18-May-2021 00:30:54 testLocalVar11(org.eclipse.jdt.core.groovy.tests.search.InferencingTests)  Time elapsed: 0.708 s
18-May-2021 00:30:54 testLocalVar12(org.eclipse.jdt.core.groovy.tests.search.InferencingTests)  Time elapsed: 0.708 s
18-May-2021 00:30:54 testLocalVar13(org.eclipse.jdt.core.groovy.tests.search.InferencingTests)  Time elapsed: 0.743 s
18-May-2021 00:30:54 testLocalVar14(org.eclipse.jdt.core.groovy.tests.search.InferencingTests)  Time elapsed: 0.704 s
18-May-2021 00:30:54 testLocalVar15(org.eclipse.jdt.core.groovy.tests.search.InferencingTests)  Time elapsed: 3.071 s
18-May-2021 00:30:54 testLocalVar16(org.eclipse.jdt.core.groovy.tests.search.InferencingTests)  Time elapsed: 2.526 s
18-May-2021 00:30:54 testLocalVar17(org.eclipse.jdt.core.groovy.tests.search.InferencingTests)  Time elapsed: 2.88 s
18-May-2021 00:30:54 testLocalVar18(org.eclipse.jdt.core.groovy.tests.search.InferencingTests)  Time elapsed: 2.125 s
18-May-2021 00:30:54 testLocalVar19(org.eclipse.jdt.core.groovy.tests.search.InferencingTests)  Time elapsed: 2.502 s
18-May-2021 00:30:54 testLocalVar20(org.eclipse.jdt.core.groovy.tests.search.InferencingTests)  Time elapsed: 2.53 s
18-May-2021 00:30:54 testLocalVar21(org.eclipse.jdt.core.groovy.tests.search.InferencingTests)  Time elapsed: 2.452 s
18-May-2021 00:30:54 testLocalVar22(org.eclipse.jdt.core.groovy.tests.search.InferencingTests)  Time elapsed: 3.07 s
18-May-2021 00:30:54 testLocalVar23(org.eclipse.jdt.core.groovy.tests.search.InferencingTests)  Time elapsed: 3.059 s
18-May-2021 00:30:54 testLocalVar24(org.eclipse.jdt.core.groovy.tests.search.InferencingTests)  Time elapsed: 2.936 s
18-May-2021 00:30:54 testLocalVar25(org.eclipse.jdt.core.groovy.tests.search.InferencingTests)  Time elapsed: 3.411 s
18-May-2021 00:30:54 testLocalVar26(org.eclipse.jdt.core.groovy.tests.search.InferencingTests)  Time elapsed: 2.519 s
18-May-2021 00:30:54 testLocalVar27(org.eclipse.jdt.core.groovy.tests.search.InferencingTests)  Time elapsed: 2.425 s
18-May-2021 00:30:54 testLocalVar28(org.eclipse.jdt.core.groovy.tests.search.InferencingTests)  Time elapsed: 2.507 s
18-May-2021 00:30:54 testLocalVar29(org.eclipse.jdt.core.groovy.tests.search.InferencingTests)  Time elapsed: 0.741 s
18-May-2021 00:30:54 testLocalVar30(org.eclipse.jdt.core.groovy.tests.search.InferencingTests)  Time elapsed: 0.712 s
18-May-2021 00:30:54 testLocalVar31(org.eclipse.jdt.core.groovy.tests.search.InferencingTests)  Time elapsed: 0.726 s
18-May-2021 00:30:54 testLocalVar32(org.eclipse.jdt.core.groovy.tests.search.InferencingTests)  Time elapsed: 1.302 s
18-May-2021 00:30:54 testNoGString(org.eclipse.jdt.core.groovy.tests.search.InferencingTests)  Time elapsed: 0.245 s
18-May-2021 00:30:54 testObjectMethodOnInterfaceAsProperty(org.eclipse.jdt.core.groovy.tests.search.InferencingTests)  Time elapsed: 0.464 s
18-May-2021 00:30:54 testMatcher1(org.eclipse.jdt.core.groovy.tests.search.InferencingTests)  Time elapsed: 0.71 s
18-May-2021 00:30:54 testMatcher2(org.eclipse.jdt.core.groovy.tests.search.InferencingTests)  Time elapsed: 0.709 s
18-May-2021 00:30:54 testMethodMissing(org.eclipse.jdt.core.groovy.tests.search.InferencingTests)  Time elapsed: 1.242 s
18-May-2021 00:30:54 testInvokeMethodGroovyInterceptable(org.eclipse.jdt.core.groovy.tests.search.InferencingTests)  Time elapsed: 1.256 s
18-May-2021 00:30:54 testCatchBlock1(org.eclipse.jdt.core.groovy.tests.search.InferencingTests)  Time elapsed: 0.702 s
18-May-2021 00:30:54 testCatchBlock2(org.eclipse.jdt.core.groovy.tests.search.InferencingTests)  Time elapsed: 0.704 s
18-May-2021 00:30:54 testCatchBlock3(org.eclipse.jdt.core.groovy.tests.search.InferencingTests)  Time elapsed: 0.708 s
18-May-2021 00:30:54 testCatchBlock4(org.eclipse.jdt.core.groovy.tests.search.InferencingTests)  Time elapsed: 0.705 s
18-May-2021 00:30:54 testCatchBlock5(org.eclipse.jdt.core.groovy.tests.search.InferencingTests)  Time elapsed: 0.703 s
18-May-2021 00:30:54 testNonStaticCategoryMethod(org.eclipse.jdt.core.groovy.tests.search.InferencingTests)  Time elapsed: 0.712 s
18-May-2021 00:30:54 testInterfaceMethodAsProperty1(org.eclipse.jdt.core.groovy.tests.search.InferencingTests)  Time elapsed: 1.312 s
18-May-2021 00:30:54 testInterfaceMethodAsProperty2(org.eclipse.jdt.core.groovy.tests.search.InferencingTests)  Time elapsed: 1.301 s
18-May-2021 00:30:54 testInterfaceMethodAsProperty3(org.eclipse.jdt.core.groovy.tests.search.InferencingTests)  Time elapsed: 1.294 s
18-May-2021 00:30:54 testGetAt1(org.eclipse.jdt.core.groovy.tests.search.InferencingTests)  Time elapsed: 0.716 s
18-May-2021 00:30:54 testGetAt2(org.eclipse.jdt.core.groovy.tests.search.InferencingTests)  Time elapsed: 0.709 s
18-May-2021 00:30:54 testGetAt3(org.eclipse.jdt.core.groovy.tests.search.InferencingTests)  Time elapsed: 0.712 s
18-May-2021 00:30:54 testGetAt4(org.eclipse.jdt.core.groovy.tests.search.InferencingTests)  Time elapsed: 0.712 s
18-May-2021 00:30:54 testGetAt5(org.eclipse.jdt.core.groovy.tests.search.InferencingTests)  Time elapsed: 1.262 s
18-May-2021 00:30:54 testGetAt6(org.eclipse.jdt.core.groovy.tests.search.InferencingTests)  Time elapsed: 1.301 s
18-May-2021 00:30:54 testGetAt7(org.eclipse.jdt.core.groovy.tests.search.InferencingTests)  Time elapsed: 1.363 s
18-May-2021 00:30:54 testFieldWithInitializer1(org.eclipse.jdt.core.groovy.tests.search.InferencingTests)  Time elapsed: 0.719 s
18-May-2021 00:30:54 testFieldWithInitializer2(org.eclipse.jdt.core.groovy.tests.search.InferencingTests)  Time elapsed: 0.707 s
18-May-2021 00:30:54 testFieldWithInitializer3(org.eclipse.jdt.core.groovy.tests.search.InferencingTests)  Time elapsed: 0.712 s
18-May-2021 00:30:54 testFieldWithInitializer4(org.eclipse.jdt.core.groovy.tests.search.InferencingTests)  Time elapsed: 0.714 s
18-May-2021 00:30:54 testFieldWithInitializer5(org.eclipse.jdt.core.groovy.tests.search.InferencingTests)  Time elapsed: 0.694 s
18-May-2021 00:30:54 testFieldWithInitializer6(org.eclipse.jdt.core.groovy.tests.search.InferencingTests)  Time elapsed: 0.72 s
18-May-2021 00:30:54 testNested1(org.eclipse.jdt.core.groovy.tests.search.InferencingTests)  Time elapsed: 0.698 s
18-May-2021 00:30:54 testNested2(org.eclipse.jdt.core.groovy.tests.search.InferencingTests)  Time elapsed: 0.668 s
18-May-2021 00:30:54 testNested3(org.eclipse.jdt.core.groovy.tests.search.InferencingTests)  Time elapsed: 0.66 s
18-May-2021 00:30:54 testNested4(org.eclipse.jdt.core.groovy.tests.search.InferencingTests)  Time elapsed: 0.701 s
18-May-2021 00:30:54 testIndirectInterfaceConstant(org.eclipse.jdt.core.groovy.tests.search.InferencingTests)  Time elapsed: 1.314 s
18-May-2021 00:30:54 testInstanceOf1(org.eclipse.jdt.core.groovy.tests.search.InferencingTests)  Time elapsed: 2.485 s
18-May-2021 00:30:54 testInstanceOf2(org.eclipse.jdt.core.groovy.tests.search.InferencingTests)  Time elapsed: 2.334 s
18-May-2021 00:30:54 testInstanceOf3(org.eclipse.jdt.core.groovy.tests.search.InferencingTests)  Time elapsed: 3.075 s
18-May-2021 00:30:54 testInstanceOf4(org.eclipse.jdt.core.groovy.tests.search.InferencingTests)  Time elapsed: 4.857 s
18-May-2021 00:30:54 testInstanceOf5(org.eclipse.jdt.core.groovy.tests.search.InferencingTests)  Time elapsed: 3.682 s
18-May-2021 00:30:54 testInstanceOf6(org.eclipse.jdt.core.groovy.tests.search.InferencingTests)  Time elapsed: 3.077 s
18-May-2021 00:30:54 testInstanceOf7(org.eclipse.jdt.core.groovy.tests.search.InferencingTests)  Time elapsed: 3.084 s
18-May-2021 00:30:54 testInstanceOf8(org.eclipse.jdt.core.groovy.tests.search.InferencingTests)  Time elapsed: 3.089 s
18-May-2021 00:30:54 testInstanceOf9(org.eclipse.jdt.core.groovy.tests.search.InferencingTests)  Time elapsed: 3.087 s
18-May-2021 00:30:54 testAnonInner1(org.eclipse.jdt.core.groovy.tests.search.InferencingTests)  Time elapsed: 0.757 s
18-May-2021 00:30:54 testAnonInner2(org.eclipse.jdt.core.groovy.tests.search.InferencingTests)  Time elapsed: 0.712 s
18-May-2021 00:30:54 testAnonInner3(org.eclipse.jdt.core.groovy.tests.search.InferencingTests)  Time elapsed: 0.724 s
18-May-2021 00:30:54 testAnonInner4(org.eclipse.jdt.core.groovy.tests.search.InferencingTests)  Time elapsed: 0.712 s
18-May-2021 00:30:54 testAnonInner5(org.eclipse.jdt.core.groovy.tests.search.InferencingTests)  Time elapsed: 0.719 s
18-May-2021 00:30:54 testAnonInner6(org.eclipse.jdt.core.groovy.tests.search.InferencingTests)  Time elapsed: 0.718 s
18-May-2021 00:30:54 testAnonInner7(org.eclipse.jdt.core.groovy.tests.search.InferencingTests)  Time elapsed: 1.314 s
18-May-2021 00:30:54 testAnonInner8(org.eclipse.jdt.core.groovy.tests.search.InferencingTests)  Time elapsed: 2.486 s
18-May-2021 00:30:54 testFieldWithInitializer1a(org.eclipse.jdt.core.groovy.tests.search.InferencingTests)  Time elapsed: 0.764 s
18-May-2021 00:30:54 testFieldWithInitializer2a(org.eclipse.jdt.core.groovy.tests.search.InferencingTests)  Time elapsed: 0.712 s
18-May-2021 00:30:54 testFieldWithInitializer3a(org.eclipse.jdt.core.groovy.tests.search.InferencingTests)  Time elapsed: 0.715 s
18-May-2021 00:30:54 testFieldWithInitializer3b(org.eclipse.jdt.core.groovy.tests.search.InferencingTests)  Time elapsed: 0.714 s
18-May-2021 00:30:54 testFieldWithInitializer6a(org.eclipse.jdt.core.groovy.tests.search.InferencingTests)  Time elapsed: 0.722 s
18-May-2021 00:30:54 testFieldWithInitializer6b(org.eclipse.jdt.core.groovy.tests.search.InferencingTests)  Time elapsed: 0.713 s
18-May-2021 00:30:54 testSwitchClassCase1(org.eclipse.jdt.core.groovy.tests.search.InferencingTests)  Time elapsed: 2.495 s
18-May-2021 00:30:54 testSwitchClassCase2(org.eclipse.jdt.core.groovy.tests.search.InferencingTests)  Time elapsed: 2.496 s
18-May-2021 00:30:54 testSwitchClassCase3(org.eclipse.jdt.core.groovy.tests.search.InferencingTests)  Time elapsed: 2.479 s
18-May-2021 00:30:54 testSwitchClassCase4(org.eclipse.jdt.core.groovy.tests.search.InferencingTests)  Time elapsed: 2.506 s
18-May-2021 00:30:54 testSwitchClassCase5(org.eclipse.jdt.core.groovy.tests.search.InferencingTests)  Time elapsed: 2.528 s
18-May-2021 00:30:54 testSwitchClassCase6(org.eclipse.jdt.core.groovy.tests.search.InferencingTests)  Time elapsed: 2.486 s
18-May-2021 00:30:54 testNumber1(org.eclipse.jdt.core.groovy.tests.search.InferencingTests)  Time elapsed: 0.71 s
18-May-2021 00:30:54 testNumber2(org.eclipse.jdt.core.groovy.tests.search.InferencingTests)  Time elapsed: 0.711 s
18-May-2021 00:30:54 testNumber3(org.eclipse.jdt.core.groovy.tests.search.InferencingTests)  Time elapsed: 0.672 s
18-May-2021 00:30:54 testNumber4(org.eclipse.jdt.core.groovy.tests.search.InferencingTests)  Time elapsed: 0.698 s
18-May-2021 00:30:54 testNumber5(org.eclipse.jdt.core.groovy.tests.search.InferencingTests)  Time elapsed: 0.71 s
18-May-2021 00:30:54 testNumber6(org.eclipse.jdt.core.groovy.tests.search.InferencingTests)  Time elapsed: 0.715 s
18-May-2021 00:30:54 testSpread1(org.eclipse.jdt.core.groovy.tests.search.InferencingTests)  Time elapsed: 0.709 s
18-May-2021 00:30:54 testSpread2(org.eclipse.jdt.core.groovy.tests.search.InferencingTests)  Time elapsed: 0.762 s
18-May-2021 00:30:54 testSpread3(org.eclipse.jdt.core.groovy.tests.search.InferencingTests)  Time elapsed: 0.71 s
18-May-2021 00:30:54 testSpread4(org.eclipse.jdt.core.groovy.tests.search.InferencingTests)  Time elapsed: 0.715 s
18-May-2021 00:30:54 testSpread5(org.eclipse.jdt.core.groovy.tests.search.InferencingTests)  Time elapsed: 0.723 s
18-May-2021 00:30:54 testSpread6(org.eclipse.jdt.core.groovy.tests.search.InferencingTests)  Time elapsed: 0.713 s
18-May-2021 00:30:54 testSpread7(org.eclipse.jdt.core.groovy.tests.search.InferencingTests)  Time elapsed: 0.71 s
18-May-2021 00:30:54 testSpread8(org.eclipse.jdt.core.groovy.tests.search.InferencingTests)  Time elapsed: 0.691 s
18-May-2021 00:30:54 testSpread9(org.eclipse.jdt.core.groovy.tests.search.InferencingTests)  Time elapsed: 0.712 s
18-May-2021 00:30:54 testMapProperty(org.eclipse.jdt.core.groovy.tests.search.InferencingTests)  Time elapsed: 1.309 s
18-May-2021 00:30:54 testPattern1(org.eclipse.jdt.core.groovy.tests.search.InferencingTests)  Time elapsed: 0.723 s
18-May-2021 00:30:54 testPattern2(org.eclipse.jdt.core.groovy.tests.search.InferencingTests)  Time elapsed: 0.759 s
18-May-2021 00:30:54 testString1(org.eclipse.jdt.core.groovy.tests.search.InferencingTests)  Time elapsed: 0.67 s
18-May-2021 00:30:54 testString2(org.eclipse.jdt.core.groovy.tests.search.InferencingTests)  Time elapsed: 0.708 s
18-May-2021 00:30:54 testString3(org.eclipse.jdt.core.groovy.tests.search.InferencingTests)  Time elapsed: 0.722 s
18-May-2021 00:30:54 testSuperFieldReference1(org.eclipse.jdt.core.groovy.tests.search.InferencingTests)  Time elapsed: 0.712 s
18-May-2021 00:30:54 testSuperFieldReference2(org.eclipse.jdt.core.groovy.tests.search.InferencingTests)  Time elapsed: 0.72 s
18-May-2021 00:30:54 testSuperFieldReference3(org.eclipse.jdt.core.groovy.tests.search.InferencingTests)  Time elapsed: 0.717 s
18-May-2021 00:30:54 testSuperFieldReference4(org.eclipse.jdt.core.groovy.tests.search.InferencingTests)  Time elapsed: 0.719 s
18-May-2021 00:30:54 testSuperFieldReference5(org.eclipse.jdt.core.groovy.tests.search.InferencingTests)  Time elapsed: 0.74 s
18-May-2021 00:30:54 testPropertyNodeFromJava1(org.eclipse.jdt.core.groovy.tests.search.JDTPropertyNodeInferencingTests)  Time elapsed: 1.854 s
18-May-2021 00:30:54 testPropertyNodeFromJava2(org.eclipse.jdt.core.groovy.tests.search.JDTPropertyNodeInferencingTests)  Time elapsed: 0.717 s
18-May-2021 00:30:54 testPropertyNodeFromJava3(org.eclipse.jdt.core.groovy.tests.search.JDTPropertyNodeInferencingTests)  Time elapsed: 0.717 s
18-May-2021 00:30:54 testPropertyNodeFromJava4(org.eclipse.jdt.core.groovy.tests.search.JDTPropertyNodeInferencingTests)  Time elapsed: 0.774 s
18-May-2021 00:30:54 testNodeFromJava1(org.eclipse.jdt.core.groovy.tests.search.JDTPropertyNodeInferencingTests)  Time elapsed: 0.678 s
18-May-2021 00:30:54 testPropertyNodeReferenceInBinary1(org.eclipse.jdt.core.groovy.tests.search.JDTPropertyNodeInferencingTests)  Time elapsed: 0.7 s
18-May-2021 00:30:54 testVarReferenceInGString1(org.eclipse.jdt.core.groovy.tests.search.LocalVariableReferenceSearchTests)  Time elapsed: 0.666 s
18-May-2021 00:30:54 testVarReferenceInGString2(org.eclipse.jdt.core.groovy.tests.search.LocalVariableReferenceSearchTests)  Time elapsed: 0.737 s
18-May-2021 00:30:54 testVarReferenceInGString3(org.eclipse.jdt.core.groovy.tests.search.LocalVariableReferenceSearchTests)  Time elapsed: 0.661 s
18-May-2021 00:30:54 testVarReferenceInGString4(org.eclipse.jdt.core.groovy.tests.search.LocalVariableReferenceSearchTests)  Time elapsed: 0.659 s
18-May-2021 00:30:54 testVarReferenceInGString5(org.eclipse.jdt.core.groovy.tests.search.LocalVariableReferenceSearchTests)  Time elapsed: 0.727 s
18-May-2021 00:30:54 testVarReference10(org.eclipse.jdt.core.groovy.tests.search.LocalVariableReferenceSearchTests)  Time elapsed: 0.671 s
18-May-2021 00:30:54 testVarReference1(org.eclipse.jdt.core.groovy.tests.search.LocalVariableReferenceSearchTests)  Time elapsed: 0.669 s
18-May-2021 00:30:54 testVarReference2(org.eclipse.jdt.core.groovy.tests.search.LocalVariableReferenceSearchTests)  Time elapsed: 0.67 s
18-May-2021 00:30:54 testVarReference3(org.eclipse.jdt.core.groovy.tests.search.LocalVariableReferenceSearchTests)  Time elapsed: 0.672 s
18-May-2021 00:30:54 testVarReference4(org.eclipse.jdt.core.groovy.tests.search.LocalVariableReferenceSearchTests)  Time elapsed: 0.704 s
18-May-2021 00:30:54 testVarReference5(org.eclipse.jdt.core.groovy.tests.search.LocalVariableReferenceSearchTests)  Time elapsed: 0.671 s
18-May-2021 00:30:54 testVarReference6(org.eclipse.jdt.core.groovy.tests.search.LocalVariableReferenceSearchTests)  Time elapsed: 0.689 s
18-May-2021 00:30:54 testVarReference7(org.eclipse.jdt.core.groovy.tests.search.LocalVariableReferenceSearchTests)  Time elapsed: 0.662 s
18-May-2021 00:30:54 testVarReference8(org.eclipse.jdt.core.groovy.tests.search.LocalVariableReferenceSearchTests)  Time elapsed: 0.688 s
18-May-2021 00:30:54 testVarReference9(org.eclipse.jdt.core.groovy.tests.search.LocalVariableReferenceSearchTests)  Time elapsed: 0.66 s
18-May-2021 00:30:54 testExplicitPropertySetterSearch1(org.eclipse.jdt.core.groovy.tests.search.MethodReferenceSearchTests)  Time elapsed: 0.74 s
18-May-2021 00:30:54 testExplicitPropertySetterSearch2(org.eclipse.jdt.core.groovy.tests.search.MethodReferenceSearchTests)  Time elapsed: 0.794 s
18-May-2021 00:30:54 testExplicitPropertySetterSearch3(org.eclipse.jdt.core.groovy.tests.search.MethodReferenceSearchTests)  Time elapsed: 0.701 s
18-May-2021 00:30:54 testOverloadedMethodReferences1(org.eclipse.jdt.core.groovy.tests.search.MethodReferenceSearchTests)  Time elapsed: 0.693 s
18-May-2021 00:30:54 testOverloadedMethodReferences2(org.eclipse.jdt.core.groovy.tests.search.MethodReferenceSearchTests)  Time elapsed: 0.681 s
18-May-2021 00:30:54 testOverloadedMethodReferences3(org.eclipse.jdt.core.groovy.tests.search.MethodReferenceSearchTests)  Time elapsed: 0.709 s
18-May-2021 00:30:54 testOverloadedMethodReferences4(org.eclipse.jdt.core.groovy.tests.search.MethodReferenceSearchTests)  Time elapsed: 0.698 s
18-May-2021 00:30:54 testOverloadedMethodReferences5(org.eclipse.jdt.core.groovy.tests.search.MethodReferenceSearchTests)  Time elapsed: 0.69 s
18-May-2021 00:30:54 testMethodReferencesInClass1(org.eclipse.jdt.core.groovy.tests.search.MethodReferenceSearchTests)  Time elapsed: 0.682 s
18-May-2021 00:30:54 testMethodReferencesInClass2(org.eclipse.jdt.core.groovy.tests.search.MethodReferenceSearchTests)  Time elapsed: 0.72 s
18-May-2021 00:30:54 testMethodReferencesInClass3(org.eclipse.jdt.core.groovy.tests.search.MethodReferenceSearchTests)  Time elapsed: 0.679 s
18-May-2021 00:30:54 testGenericsMethodReferenceSearch(org.eclipse.jdt.core.groovy.tests.search.MethodReferenceSearchTests)  Time elapsed: 0.545 s
18-May-2021 00:30:54 testObjectMethodReferenceSearch1(org.eclipse.jdt.core.groovy.tests.search.MethodReferenceSearchTests)  Time elapsed: 0.679 s
18-May-2021 00:30:54 testObjectMethodReferenceSearch2(org.eclipse.jdt.core.groovy.tests.search.MethodReferenceSearchTests)  Time elapsed: 0.689 s
18-May-2021 00:30:54 testMethodReferencesInScript1(org.eclipse.jdt.core.groovy.tests.search.MethodReferenceSearchTests)  Time elapsed: 0.692 s
18-May-2021 00:30:54 testMethodReferencesInScript2(org.eclipse.jdt.core.groovy.tests.search.MethodReferenceSearchTests)  Time elapsed: 0.724 s
18-May-2021 00:30:54 testMethodReferencesInScript3(org.eclipse.jdt.core.groovy.tests.search.MethodReferenceSearchTests)  Time elapsed: 0.679 s
18-May-2021 00:30:54 testMethodReferencesInScript4(org.eclipse.jdt.core.groovy.tests.search.MethodReferenceSearchTests)  Time elapsed: 0.686 s
18-May-2021 00:30:54 testMethodReferencesInScript5(org.eclipse.jdt.core.groovy.tests.search.MethodReferenceSearchTests)  Time elapsed: 0.69 s
18-May-2021 00:30:54 testMethodReferencesInScript6(org.eclipse.jdt.core.groovy.tests.search.MethodReferenceSearchTests)  Time elapsed: 0.726 s
18-May-2021 00:30:54 testMethodReferencesInScript7(org.eclipse.jdt.core.groovy.tests.search.MethodReferenceSearchTests)  Time elapsed: 0.677 s
18-May-2021 00:30:54 testMethodReferencesInScript8(org.eclipse.jdt.core.groovy.tests.search.MethodReferenceSearchTests)  Time elapsed: 0.704 s
18-May-2021 00:30:54 testMethodReferencesInScript9(org.eclipse.jdt.core.groovy.tests.search.MethodReferenceSearchTests)  Time elapsed: 0.699 s
18-May-2021 00:30:54 testOverloadedMethodReferences5a(org.eclipse.jdt.core.groovy.tests.search.MethodReferenceSearchTests) skipped
18-May-2021 00:30:54 testOverloadedMethodReferences5b(org.eclipse.jdt.core.groovy.tests.search.MethodReferenceSearchTests)  Time elapsed: 0.687 s
18-May-2021 00:30:54 testMethodWithDefaultParameters1(org.eclipse.jdt.core.groovy.tests.search.MethodReferenceSearchTests)  Time elapsed: 0.721 s
18-May-2021 00:30:54 testMethodWithDefaultParameters2(org.eclipse.jdt.core.groovy.tests.search.MethodReferenceSearchTests)  Time elapsed: 0.705 s
18-May-2021 00:30:54 testMethodWithDefaultParameters3(org.eclipse.jdt.core.groovy.tests.search.MethodReferenceSearchTests)  Time elapsed: 0.544 s
18-May-2021 00:30:54 testMethodWithDefaultParameters4(org.eclipse.jdt.core.groovy.tests.search.MethodReferenceSearchTests)  Time elapsed: 0.522 s
18-May-2021 00:30:54 testExplicitPropertyGetterSearch1(org.eclipse.jdt.core.groovy.tests.search.MethodReferenceSearchTests)  Time elapsed: 0.718 s
18-May-2021 00:30:54 testExplicitPropertyGetterSearch2(org.eclipse.jdt.core.groovy.tests.search.MethodReferenceSearchTests)  Time elapsed: 0.714 s
18-May-2021 00:30:54 testExplicitPropertyGetterSearch3(org.eclipse.jdt.core.groovy.tests.search.MethodReferenceSearchTests)  Time elapsed: 0.716 s
18-May-2021 00:30:54 testExplicitPropertyGetterSearch4(org.eclipse.jdt.core.groovy.tests.search.MethodReferenceSearchTests)  Time elapsed: 0.701 s
18-May-2021 00:30:54 testStaticMethodReferenceSearch1(org.eclipse.jdt.core.groovy.tests.search.MethodReferenceSearchTests)  Time elapsed: 0.59 s
18-May-2021 00:30:54 testStaticMethodReferenceSearch2(org.eclipse.jdt.core.groovy.tests.search.MethodReferenceSearchTests)  Time elapsed: 0.592 s
18-May-2021 00:30:54 testStaticMethodReferenceSearch3(org.eclipse.jdt.core.groovy.tests.search.MethodReferenceSearchTests)  Time elapsed: 0.639 s
18-May-2021 00:30:54 testStaticMethodReferenceSearch4(org.eclipse.jdt.core.groovy.tests.search.MethodReferenceSearchTests)  Time elapsed: 0.59 s
18-May-2021 00:30:54 testRightShift(org.eclipse.jdt.core.groovy.tests.search.OperatorOverloadingInferencingTests)  Time elapsed: 0.674 s
18-May-2021 00:30:54 testLeftShift(org.eclipse.jdt.core.groovy.tests.search.OperatorOverloadingInferencingTests)  Time elapsed: 0.672 s
18-May-2021 00:30:54 testAnd(org.eclipse.jdt.core.groovy.tests.search.OperatorOverloadingInferencingTests)  Time elapsed: 0.673 s
18-May-2021 00:30:54 testMod(org.eclipse.jdt.core.groovy.tests.search.OperatorOverloadingInferencingTests)  Time elapsed: 0.679 s
18-May-2021 00:30:54 testXor(org.eclipse.jdt.core.groovy.tests.search.OperatorOverloadingInferencingTests)  Time elapsed: 0.708 s
18-May-2021 00:30:54 testPlus1(org.eclipse.jdt.core.groovy.tests.search.OperatorOverloadingInferencingTests)  Time elapsed: 0.675 s
18-May-2021 00:30:54 testPlus2(org.eclipse.jdt.core.groovy.tests.search.OperatorOverloadingInferencingTests)  Time elapsed: 0.721 s
18-May-2021 00:30:54 testPlus3(org.eclipse.jdt.core.groovy.tests.search.OperatorOverloadingInferencingTests)  Time elapsed: 0.715 s
18-May-2021 00:30:54 testNumberPlusGString(org.eclipse.jdt.core.groovy.tests.search.OperatorOverloadingInferencingTests)  Time elapsed: 0.684 s
18-May-2021 00:30:54 testOr(org.eclipse.jdt.core.groovy.tests.search.OperatorOverloadingInferencingTests)  Time elapsed: 0.716 s
18-May-2021 00:30:54 testPrefix1(org.eclipse.jdt.core.groovy.tests.search.OperatorOverloadingInferencingTests)  Time elapsed: 0.719 s
18-May-2021 00:30:54 testPrefix2(org.eclipse.jdt.core.groovy.tests.search.OperatorOverloadingInferencingTests)  Time elapsed: 0.737 s
18-May-2021 00:30:54 testPrefix3(org.eclipse.jdt.core.groovy.tests.search.OperatorOverloadingInferencingTests)  Time elapsed: 0.657 s
18-May-2021 00:30:54 testPrefix4(org.eclipse.jdt.core.groovy.tests.search.OperatorOverloadingInferencingTests)  Time elapsed: 0.668 s
18-May-2021 00:30:54 testPrefix5(org.eclipse.jdt.core.groovy.tests.search.OperatorOverloadingInferencingTests)  Time elapsed: 0.676 s
18-May-2021 00:30:54 testPrefix6(org.eclipse.jdt.core.groovy.tests.search.OperatorOverloadingInferencingTests)  Time elapsed: 0.665 s
18-May-2021 00:30:54 testLongExpr1(org.eclipse.jdt.core.groovy.tests.search.OperatorOverloadingInferencingTests)  Time elapsed: 0.721 s
18-May-2021 00:30:54 testLongExpr2(org.eclipse.jdt.core.groovy.tests.search.OperatorOverloadingInferencingTests)  Time elapsed: 0.709 s
18-May-2021 00:30:54 testLongExpr3(org.eclipse.jdt.core.groovy.tests.search.OperatorOverloadingInferencingTests)  Time elapsed: 0.675 s
18-May-2021 00:30:54 testAttributeExpr1(org.eclipse.jdt.core.groovy.tests.search.OperatorOverloadingInferencingTests)  Time elapsed: 0.666 s
18-May-2021 00:30:54 testAttributeExpr2(org.eclipse.jdt.core.groovy.tests.search.OperatorOverloadingInferencingTests)  Time elapsed: 0.671 s
18-May-2021 00:30:54 testNumberPlusString(org.eclipse.jdt.core.groovy.tests.search.OperatorOverloadingInferencingTests)  Time elapsed: 0.7 s
18-May-2021 00:30:54 testDivide(org.eclipse.jdt.core.groovy.tests.search.OperatorOverloadingInferencingTests)  Time elapsed: 0.716 s
18-May-2021 00:30:54 testMultiply(org.eclipse.jdt.core.groovy.tests.search.OperatorOverloadingInferencingTests)  Time elapsed: 0.724 s
18-May-2021 00:30:54 testGetAt1(org.eclipse.jdt.core.groovy.tests.search.OperatorOverloadingInferencingTests)  Time elapsed: 0.664 s
18-May-2021 00:30:54 testGetAt2(org.eclipse.jdt.core.groovy.tests.search.OperatorOverloadingInferencingTests)  Time elapsed: 0.709 s
18-May-2021 00:30:54 testGetAt3(org.eclipse.jdt.core.groovy.tests.search.OperatorOverloadingInferencingTests)  Time elapsed: 0.678 s
18-May-2021 00:30:54 testGetAt4(org.eclipse.jdt.core.groovy.tests.search.OperatorOverloadingInferencingTests)  Time elapsed: 0.668 s
18-May-2021 00:30:54 testGetAt5(org.eclipse.jdt.core.groovy.tests.search.OperatorOverloadingInferencingTests)  Time elapsed: 0.672 s
18-May-2021 00:30:54 testGetAt6(org.eclipse.jdt.core.groovy.tests.search.OperatorOverloadingInferencingTests)  Time elapsed: 0.673 s
18-May-2021 00:30:54 testGetAt7(org.eclipse.jdt.core.groovy.tests.search.OperatorOverloadingInferencingTests)  Time elapsed: 0.768 s
18-May-2021 00:30:54 testGetAt8(org.eclipse.jdt.core.groovy.tests.search.OperatorOverloadingInferencingTests)  Time elapsed: 0.669 s
18-May-2021 00:30:54 testGetAt9(org.eclipse.jdt.core.groovy.tests.search.OperatorOverloadingInferencingTests)  Time elapsed: 0.717 s
18-May-2021 00:30:54 testPostfix1(org.eclipse.jdt.core.groovy.tests.search.OperatorOverloadingInferencingTests)  Time elapsed: 0.713 s
18-May-2021 00:30:54 testPostfix2(org.eclipse.jdt.core.groovy.tests.search.OperatorOverloadingInferencingTests)  Time elapsed: 0.667 s
18-May-2021 00:30:54 testMinus1(org.eclipse.jdt.core.groovy.tests.search.OperatorOverloadingInferencingTests)  Time elapsed: 0.737 s
18-May-2021 00:30:54 testMinus2(org.eclipse.jdt.core.groovy.tests.search.OperatorOverloadingInferencingTests)  Time elapsed: 0.715 s
18-May-2021 00:30:54 testCompleteExpr1(org.eclipse.jdt.core.groovy.tests.search.OperatorOverloadingInferencingTests)  Time elapsed: 0.672 s
18-May-2021 00:30:54 testCompleteExpr2(org.eclipse.jdt.core.groovy.tests.search.OperatorOverloadingInferencingTests)  Time elapsed: 0.726 s
18-May-2021 00:30:54 testCompleteExpr3(org.eclipse.jdt.core.groovy.tests.search.OperatorOverloadingInferencingTests)  Time elapsed: 0.732 s
18-May-2021 00:30:54 testCompleteExpr4(org.eclipse.jdt.core.groovy.tests.search.OperatorOverloadingInferencingTests)  Time elapsed: 0.714 s
18-May-2021 00:30:54 testCompleteExpr5(org.eclipse.jdt.core.groovy.tests.search.OperatorOverloadingInferencingTests)  Time elapsed: 0.722 s
18-May-2021 00:30:54 testCompleteExpr6(org.eclipse.jdt.core.groovy.tests.search.OperatorOverloadingInferencingTests)  Time elapsed: 0.728 s
18-May-2021 00:30:54 testCompleteExpr7(org.eclipse.jdt.core.groovy.tests.search.OperatorOverloadingInferencingTests)  Time elapsed: 0.714 s
18-May-2021 00:30:54 testCompleteExpr8(org.eclipse.jdt.core.groovy.tests.search.OperatorOverloadingInferencingTests)  Time elapsed: 0.721 s
18-May-2021 00:30:54 testEqualsCheck(org.eclipse.jdt.core.groovy.tests.search.SpockInferencingTests)  Time elapsed: 1.252 s
18-May-2021 00:30:54 testDataTableChecks(org.eclipse.jdt.core.groovy.tests.search.SpockInferencingTests) skipped
18-May-2021 00:30:54 testGetterCheck(org.eclipse.jdt.core.groovy.tests.search.SpockInferencingTests)  Time elapsed: 0.709 s  <<< FAILURE!
18-May-2021 00:30:54 java.lang.AssertionError:
18-May-2021 00:30:54 Expected type not found.
18-May-2021 00:30:54 Expected: java.lang.Integer
18-May-2021 00:30:54 Found: java.lang.Object
18-May-2021 00:30:54 Declaring type: foo.Bar
18-May-2021 00:30:54 ASTNode: [email protected][getBaz]
18-May-2021 00:30:54 Confidence: UNKNOWN
18-May-2021 00:30:54
18-May-2021 00:30:54         at org.eclipse.jdt.core.groovy.tests.search.SpockInferencingTests.testGetterCheck(SpockInferencingTests.java:107)
18-May-2021 00:30:54
18-May-2021 00:30:54 testPropertyCheck(org.eclipse.jdt.core.groovy.tests.search.SpockInferencingTests)  Time elapsed: 0.752 s
18-May-2021 00:30:54 testBasics(org.eclipse.jdt.core.groovy.tests.search.SpockInferencingTests)  Time elapsed: 1.301 s
18-May-2021 00:30:54 testNonStaticReference1(org.eclipse.jdt.core.groovy.tests.search.StaticInferencingTests)  Time elapsed: 0.72 s
18-May-2021 00:30:54 testNonStaticReference2(org.eclipse.jdt.core.groovy.tests.search.StaticInferencingTests)  Time elapsed: 0.719 s
18-May-2021 00:30:54 testNonStaticReference3(org.eclipse.jdt.core.groovy.tests.search.StaticInferencingTests)  Time elapsed: 0.726 s
18-May-2021 00:30:54 testNonStaticReference4(org.eclipse.jdt.core.groovy.tests.search.StaticInferencingTests)  Time elapsed: 0.719 s
18-May-2021 00:30:54 testNonStaticReference5(org.eclipse.jdt.core.groovy.tests.search.StaticInferencingTests)  Time elapsed: 0.725 s
18-May-2021 00:30:54 testNonStaticReference6(org.eclipse.jdt.core.groovy.tests.search.StaticInferencingTests)  Time elapsed: 0.68 s
18-May-2021 00:30:54 testNonStaticReference7(org.eclipse.jdt.core.groovy.tests.search.StaticInferencingTests)  Time elapsed: 0.731 s
18-May-2021 00:30:54 testNonStaticReference8(org.eclipse.jdt.core.groovy.tests.search.StaticInferencingTests)  Time elapsed: 0.678 s
18-May-2021 00:30:54 testNonStaticReference9(org.eclipse.jdt.core.groovy.tests.search.StaticInferencingTests)  Time elapsed: 0.686 s
18-May-2021 00:30:54 testStaticReference1(org.eclipse.jdt.core.groovy.tests.search.StaticInferencingTests)  Time elapsed: 0.686 s
18-May-2021 00:30:54 testStaticReference2(org.eclipse.jdt.core.groovy.tests.search.StaticInferencingTests)  Time elapsed: 0.682 s
18-May-2021 00:30:54 testStaticReference3(org.eclipse.jdt.core.groovy.tests.search.StaticInferencingTests)  Time elapsed: 0.732 s
18-May-2021 00:30:54 testStaticReference4(org.eclipse.jdt.core.groovy.tests.search.StaticInferencingTests)  Time elapsed: 0.678 s
18-May-2021 00:30:54 testStaticReference5(org.eclipse.jdt.core.groovy.tests.search.StaticInferencingTests)  Time elapsed: 0.719 s
18-May-2021 00:30:54 testStaticReference6(org.eclipse.jdt.core.groovy.tests.search.StaticInferencingTests)  Time elapsed: 0.722 s
18-May-2021 00:30:54 testStaticReference7(org.eclipse.jdt.core.groovy.tests.search.StaticInferencingTests)  Time elapsed: 0.768 s
18-May-2021 00:30:54 testStaticReference8(org.eclipse.jdt.core.groovy.tests.search.StaticInferencingTests)  Time elapsed: 0.719 s
18-May-2021 00:30:54 testStaticReference9(org.eclipse.jdt.core.groovy.tests.search.StaticInferencingTests)  Time elapsed: 0.679 s
18-May-2021 00:30:54 testStaticImport1(org.eclipse.jdt.core.groovy.tests.search.StaticInferencingTests)  Time elapsed: 0.677 s
18-May-2021 00:30:54 testStaticImport2(org.eclipse.jdt.core.groovy.tests.search.StaticInferencingTests)  Time elapsed: 0.746 s
18-May-2021 00:30:54 testStaticImport3(org.eclipse.jdt.core.groovy.tests.search.StaticInferencingTests)  Time elapsed: 0.704 s
18-May-2021 00:30:54 testStaticImport4(org.eclipse.jdt.core.groovy.tests.search.StaticInferencingTests)  Time elapsed: 0.736 s
18-May-2021 00:30:54 testStaticImport5(org.eclipse.jdt.core.groovy.tests.search.StaticInferencingTests)  Time elapsed: 0.679 s
18-May-2021 00:30:54 testStaticImport6(org.eclipse.jdt.core.groovy.tests.search.StaticInferencingTests)  Time elapsed: 1.316 s
18-May-2021 00:30:54 testStaticImport7(org.eclipse.jdt.core.groovy.tests.search.StaticInferencingTests)  Time elapsed: 0.717 s
18-May-2021 00:30:54 testStaticImport8(org.eclipse.jdt.core.groovy.tests.search.StaticInferencingTests)  Time elapsed: 0.667 s
18-May-2021 00:30:54 testStaticImport9(org.eclipse.jdt.core.groovy.tests.search.StaticInferencingTests)  Time elapsed: 0.719 s
18-May-2021 00:30:54 testStaticImport10(org.eclipse.jdt.core.groovy.tests.search.StaticInferencingTests)  Time elapsed: 1.723 s
18-May-2021 00:30:54 testStaticImport11(org.eclipse.jdt.core.groovy.tests.search.StaticInferencingTests)  Time elapsed: 0.656 s
18-May-2021 00:30:54 testStaticImport12(org.eclipse.jdt.core.groovy.tests.search.StaticInferencingTests)  Time elapsed: 0.71 s
18-May-2021 00:30:54 testStaticImport13(org.eclipse.jdt.core.groovy.tests.search.StaticInferencingTests) skipped
18-May-2021 00:30:54 testStaticImport14(org.eclipse.jdt.core.groovy.tests.search.StaticInferencingTests) skipped
18-May-2021 00:30:54 testStaticImport15(org.eclipse.jdt.core.groovy.tests.search.StaticInferencingTests) skipped
18-May-2021 00:30:54 testStaticImport16(org.eclipse.jdt.core.groovy.tests.search.StaticInferencingTests)  Time elapsed: 0.712 s
18-May-2021 00:30:54 testStaticImport17(org.eclipse.jdt.core.groovy.tests.search.StaticInferencingTests)  Time elapsed: 0.705 s
18-May-2021 00:30:54 testStaticImport18(org.eclipse.jdt.core.groovy.tests.search.StaticInferencingTests)  Time elapsed: 0.68 s
18-May-2021 00:30:54 testStaticImport19(org.eclipse.jdt.core.groovy.tests.search.StaticInferencingTests)  Time elapsed: 0.705 s
18-May-2021 00:30:54 testClassReference10(org.eclipse.jdt.core.groovy.tests.search.StaticInferencingTests)  Time elapsed: 0.712 s
18-May-2021 00:30:54 testClassReference11(org.eclipse.jdt.core.groovy.tests.search.StaticInferencingTests)  Time elapsed: 0.725 s
18-May-2021 00:30:54 testClassReference12(org.eclipse.jdt.core.groovy.tests.search.StaticInferencingTests)  Time elapsed: 0.709 s
18-May-2021 00:30:54 testClassReference13(org.eclipse.jdt.core.groovy.tests.search.StaticInferencingTests)  Time elapsed: 0.735 s
18-May-2021 00:30:54 testClassReference14(org.eclipse.jdt.core.groovy.tests.search.StaticInferencingTests)  Time elapsed: 0.708 s
18-May-2021 00:30:54 testClassReference15(org.eclipse.jdt.core.groovy.tests.search.StaticInferencingTests)  Time elapsed: 0.708 s
18-May-2021 00:30:54 testClassReference16(org.eclipse.jdt.core.groovy.tests.search.StaticInferencingTests)  Time elapsed: 0.705 s
18-May-2021 00:30:54 testClassReference17(org.eclipse.jdt.core.groovy.tests.search.StaticInferencingTests)  Time elapsed: 0.731 s
18-May-2021 00:30:54 testClassReference18(org.eclipse.jdt.core.groovy.tests.search.StaticInferencingTests)  Time elapsed: 0.704 s
18-May-2021 00:30:54 testClassReference19(org.eclipse.jdt.core.groovy.tests.search.StaticInferencingTests)  Time elapsed: 0.706 s
18-May-2021 00:30:54 testClassReference20(org.eclipse.jdt.core.groovy.tests.search.StaticInferencingTests)  Time elapsed: 0.718 s
18-May-2021 00:30:54 testClassReference22(org.eclipse.jdt.core.groovy.tests.search.StaticInferencingTests)  Time elapsed: 1.29 s
18-May-2021 00:30:54 testClassReference23(org.eclipse.jdt.core.groovy.tests.search.StaticInferencingTests)  Time elapsed: 1.261 s
18-May-2021 00:30:54 testClassReference24(org.eclipse.jdt.core.groovy.tests.search.StaticInferencingTests)  Time elapsed: 1.255 s
18-May-2021 00:30:54 testClassReference25(org.eclipse.jdt.core.groovy.tests.search.StaticInferencingTests)  Time elapsed: 1.328 s
18-May-2021 00:30:54 testClassReference26(org.eclipse.jdt.core.groovy.tests.search.StaticInferencingTests)  Time elapsed: 1.294 s
18-May-2021 00:30:54 testClassReference27(org.eclipse.jdt.core.groovy.tests.search.StaticInferencingTests)  Time elapsed: 1.304 s
18-May-2021 00:30:54 testClassReference28(org.eclipse.jdt.core.groovy.tests.search.StaticInferencingTests)  Time elapsed: 1.311 s
18-May-2021 00:30:54 testStaticReference10(org.eclipse.jdt.core.groovy.tests.search.StaticInferencingTests)  Time elapsed: 0.688 s
18-May-2021 00:30:54 testStaticReference11(org.eclipse.jdt.core.groovy.tests.search.StaticInferencingTests)  Time elapsed: 0.667 s
18-May-2021 00:30:54 testStaticReference12(org.eclipse.jdt.core.groovy.tests.search.StaticInferencingTests)  Time elapsed: 0.713 s
18-May-2021 00:30:54 testStaticReference13(org.eclipse.jdt.core.groovy.tests.search.StaticInferencingTests)  Time elapsed: 0.688 s
18-May-2021 00:30:54 testStaticReference14(org.eclipse.jdt.core.groovy.tests.search.StaticInferencingTests)  Time elapsed: 0.673 s
18-May-2021 00:30:54 testStaticReference15(org.eclipse.jdt.core.groovy.tests.search.StaticInferencingTests)  Time elapsed: 0.712 s
18-May-2021 00:30:54 testStaticReference16(org.eclipse.jdt.core.groovy.tests.search.StaticInferencingTests)  Time elapsed: 0.631 s
18-May-2021 00:30:54 testStaticReference17(org.eclipse.jdt.core.groovy.tests.search.StaticInferencingTests)  Time elapsed: 0.715 s
18-May-2021 00:30:54 testStaticReference18(org.eclipse.jdt.core.groovy.tests.search.StaticInferencingTests)  Time elapsed: 0.608 s
18-May-2021 00:30:54 testStaticReference19(org.eclipse.jdt.core.groovy.tests.search.StaticInferencingTests)  Time elapsed: 0.634 s
18-May-2021 00:30:54 testStaticReference20(org.eclipse.jdt.core.groovy.tests.search.StaticInferencingTests)  Time elapsed: 0.666 s
18-May-2021 00:30:54 testStaticReference21(org.eclipse.jdt.core.groovy.tests.search.StaticInferencingTests)  Time elapsed: 0.717 s
18-May-2021 00:30:54 testStaticReference22(org.eclipse.jdt.core.groovy.tests.search.StaticInferencingTests)  Time elapsed: 0.746 s
18-May-2021 00:30:54 testStaticReference23(org.eclipse.jdt.core.groovy.tests.search.StaticInferencingTests)  Time elapsed: 0.665 s
18-May-2021 00:30:54 testStaticReference24(org.eclipse.jdt.core.groovy.tests.search.StaticInferencingTests)  Time elapsed: 0.668 s
18-May-2021 00:30:54 testStaticReference25(org.eclipse.jdt.core.groovy.tests.search.StaticInferencingTests)  Time elapsed: 0.716 s
18-May-2021 00:30:54 testStaticReference26(org.eclipse.jdt.core.groovy.tests.search.StaticInferencingTests)  Time elapsed: 0.745 s
18-May-2021 00:30:54 testStaticReference27(org.eclipse.jdt.core.groovy.tests.search.StaticInferencingTests)  Time elapsed: 0.659 s
18-May-2021 00:30:54 testClassReference1(org.eclipse.jdt.core.groovy.tests.search.StaticInferencingTests)  Time elapsed: 0.71 s
18-May-2021 00:30:54 testClassReference2(org.eclipse.jdt.core.groovy.tests.search.StaticInferencingTests)  Time elapsed: 0.724 s
18-May-2021 00:30:54 testClassReference3(org.eclipse.jdt.core.groovy.tests.search.StaticInferencingTests)  Time elapsed: 0.66 s
18-May-2021 00:30:54 testClassReference4(org.eclipse.jdt.core.groovy.tests.search.StaticInferencingTests)  Time elapsed: 0.693 s
18-May-2021 00:30:54 testClassReference5(org.eclipse.jdt.core.groovy.tests.search.StaticInferencingTests)  Time elapsed: 0.67 s
18-May-2021 00:30:54 testClassReference6(org.eclipse.jdt.core.groovy.tests.search.StaticInferencingTests)  Time elapsed: 0.668 s
18-May-2021 00:30:54 testClassReference7(org.eclipse.jdt.core.groovy.tests.search.StaticInferencingTests)  Time elapsed: 0.659 s
18-May-2021 00:30:54 testClassReference8(org.eclipse.jdt.core.groovy.tests.search.StaticInferencingTests)  Time elapsed: 0.7 s
18-May-2021 00:30:54 testClassReference9(org.eclipse.jdt.core.groovy.tests.search.StaticInferencingTests)  Time elapsed: 0.71 s
18-May-2021 00:30:54 testSyntheticAccessors1(org.eclipse.jdt.core.groovy.tests.search.SyntheticAccessorInferencingTests)  Time elapsed: 1.888 s
18-May-2021 00:30:54 testSyntheticAccessors2(org.eclipse.jdt.core.groovy.tests.search.SyntheticAccessorInferencingTests)  Time elapsed: 1.89 s
18-May-2021 00:30:54 testSyntheticAccessors3(org.eclipse.jdt.core.groovy.tests.search.SyntheticAccessorInferencingTests)  Time elapsed: 1.748 s
18-May-2021 00:30:54 testSyntheticAccessors4(org.eclipse.jdt.core.groovy.tests.search.SyntheticAccessorInferencingTests)  Time elapsed: 7.697 s
18-May-2021 00:30:54 testSyntheticAccessors5(org.eclipse.jdt.core.groovy.tests.search.SyntheticAccessorInferencingTests)  Time elapsed: 8.589 s
18-May-2021 00:30:54 testPublicStaticSuperMethod1(org.eclipse.jdt.core.groovy.tests.search.TraitInferencingTests)  Time elapsed: 1.29 s
18-May-2021 00:30:54 testPublicStaticSuperMethod2(org.eclipse.jdt.core.groovy.tests.search.TraitInferencingTests)  Time elapsed: 1.308 s
18-May-2021 00:30:54 testProperty10(org.eclipse.jdt.core.groovy.tests.search.TraitInferencingTests)  Time elapsed: 1.305 s
18-May-2021 00:30:54 testProperty11(org.eclipse.jdt.core.groovy.tests.search.TraitInferencingTests)  Time elapsed: 1.34 s
18-May-2021 00:30:54 testProperty12(org.eclipse.jdt.core.groovy.tests.search.TraitInferencingTests)  Time elapsed: 1.306 s
18-May-2021 00:30:54 testProperty13(org.eclipse.jdt.core.groovy.tests.search.TraitInferencingTests)  Time elapsed: 1.32 s
18-May-2021 00:30:54 testProperty14(org.eclipse.jdt.core.groovy.tests.search.TraitInferencingTests)  Time elapsed: 1.351 s
18-May-2021 00:30:54 testProperty15(org.eclipse.jdt.core.groovy.tests.search.TraitInferencingTests)  Time elapsed: 1.315 s
18-May-2021 00:30:54 testProperty16(org.eclipse.jdt.core.groovy.tests.search.TraitInferencingTests)  Time elapsed: 1.208 s
18-May-2021 00:30:54 testProperty17(org.eclipse.jdt.core.groovy.tests.search.TraitInferencingTests)  Time elapsed: 1.207 s
18-May-2021 00:30:54 testProperty18(org.eclipse.jdt.core.groovy.tests.search.TraitInferencingTests)  Time elapsed: 1.315 s
18-May-2021 00:30:54 testProperty19(org.eclipse.jdt.core.groovy.tests.search.TraitInferencingTests)  Time elapsed: 1.31 s
18-May-2021 00:30:54 testPrivateStaticField(org.eclipse.jdt.core.groovy.tests.search.TraitInferencingTests)  Time elapsed: 1.309 s
18-May-2021 00:30:54 testPrivateMethod1(org.eclipse.jdt.core.groovy.tests.search.TraitInferencingTests)  Time elapsed: 1.299 s
18-May-2021 00:30:54 testPrivateMethod2(org.eclipse.jdt.core.groovy.tests.search.TraitInferencingTests)  Time elapsed: 1.311 s
18-May-2021 00:30:54 testPrivateMethod3(org.eclipse.jdt.core.groovy.tests.search.TraitInferencingTests)  Time elapsed: 1.322 s
18-May-2021 00:30:54 testPrivateMethod4(org.eclipse.jdt.core.groovy.tests.search.TraitInferencingTests)  Time elapsed: 1.33 s
18-May-2021 00:30:54 testPublicStaticField(org.eclipse.jdt.core.groovy.tests.search.TraitInferencingTests)  Time elapsed: 1.256 s
18-May-2021 00:30:54 testPublicMethod1(org.eclipse.jdt.core.groovy.tests.search.TraitInferencingTests)  Time elapsed: 1.309 s
18-May-2021 00:30:54 testPublicMethod2(org.eclipse.jdt.core.groovy.tests.search.TraitInferencingTests)  Time elapsed: 1.336 s
18-May-2021 00:30:54 testPublicMethod3(org.eclipse.jdt.core.groovy.tests.search.TraitInferencingTests)  Time elapsed: 1.317 s
18-May-2021 00:30:54 testPublicMethod4(org.eclipse.jdt.core.groovy.tests.search.TraitInferencingTests)  Time elapsed: 1.32 s
18-May-2021 00:30:54 testPublicMethod5(org.eclipse.jdt.core.groovy.tests.search.TraitInferencingTests)  Time elapsed: 1.317 s
18-May-2021 00:30:54 testPrivateStaticMethod(org.eclipse.jdt.core.groovy.tests.search.TraitInferencingTests)  Time elapsed: 1.253 s
18-May-2021 00:30:54 testProperty1(org.eclipse.jdt.core.groovy.tests.search.TraitInferencingTests)  Time elapsed: 1.304 s
18-May-2021 00:30:54 testProperty2(org.eclipse.jdt.core.groovy.tests.search.TraitInferencingTests)  Time elapsed: 1.21 s
18-May-2021 00:30:54 testProperty3(org.eclipse.jdt.core.groovy.tests.search.TraitInferencingTests)  Time elapsed: 1.246 s
18-May-2021 00:30:54 testProperty4(org.eclipse.jdt.core.groovy.tests.search.TraitInferencingTests)  Time elapsed: 1.3 s
18-May-2021 00:30:54 testProperty5(org.eclipse.jdt.core.groovy.tests.search.TraitInferencingTests)  Time elapsed: 1.302 s
18-May-2021 00:30:54 testProperty6(org.eclipse.jdt.core.groovy.tests.search.TraitInferencingTests)  Time elapsed: 1.261 s
18-May-2021 00:30:54 testProperty7(org.eclipse.jdt.core.groovy.tests.search.TraitInferencingTests)  Time elapsed: 1.36 s
18-May-2021 00:30:54 testProperty8(org.eclipse.jdt.core.groovy.tests.search.TraitInferencingTests)  Time elapsed: 1.316 s
18-May-2021 00:30:54 testProperty9(org.eclipse.jdt.core.groovy.tests.search.TraitInferencingTests)  Time elapsed: 1.265 s
18-May-2021 00:30:54 testPublicStaticFinalField(org.eclipse.jdt.core.groovy.tests.search.TraitInferencingTests)  Time elapsed: 1.351 s
18-May-2021 00:30:54 testPublicStaticMethod1(org.eclipse.jdt.core.groovy.tests.search.TraitInferencingTests)  Time elapsed: 1.255 s
18-May-2021 00:30:54 testPublicStaticMethod2(org.eclipse.jdt.core.groovy.tests.search.TraitInferencingTests)  Time elapsed: 1.911 s
18-May-2021 00:30:54 testPublicStaticMethod3(org.eclipse.jdt.core.groovy.tests.search.TraitInferencingTests)  Time elapsed: 1.305 s
18-May-2021 00:30:54 testPublicStaticMethod4(org.eclipse.jdt.core.groovy.tests.search.TraitInferencingTests)  Time elapsed: 0.703 s
18-May-2021 00:30:54 testPublicField1(org.eclipse.jdt.core.groovy.tests.search.TraitInferencingTests)  Time elapsed: 1.257 s
18-May-2021 00:30:54 testPublicField2(org.eclipse.jdt.core.groovy.tests.search.TraitInferencingTests)  Time elapsed: 1.313 s
18-May-2021 00:30:54 testPrivateStaticFinalField(org.eclipse.jdt.core.groovy.tests.search.TraitInferencingTests)  Time elapsed: 1.21 s
18-May-2021 00:30:54 testPrivateField1(org.eclipse.jdt.core.groovy.tests.search.TraitInferencingTests)  Time elapsed: 1.292 s
18-May-2021 00:30:54 testPrivateField2(org.eclipse.jdt.core.groovy.tests.search.TraitInferencingTests)  Time elapsed: 1.217 s
18-May-2021 00:30:54 testFindClassDeclarationWithPattern(org.eclipse.jdt.core.groovy.tests.search.TypeReferenceSearchTests)  Time elapsed: 0.719 s
18-May-2021 00:30:54 testInnerTypes1(org.eclipse.jdt.core.groovy.tests.search.TypeReferenceSearchTests)  Time elapsed: 0.674 s
18-May-2021 00:30:54 testInnerTypes2(org.eclipse.jdt.core.groovy.tests.search.TypeReferenceSearchTests)  Time elapsed: 0.719 s
18-May-2021 00:30:54 testInnerTypes3(org.eclipse.jdt.core.groovy.tests.search.TypeReferenceSearchTests)  Time elapsed: 0.686 s
18-May-2021 00:30:54 testSearchForTypesScript1(org.eclipse.jdt.core.groovy.tests.search.TypeReferenceSearchTests)  Time elapsed: 0.667 s
18-May-2021 00:30:54 testSearchForTypesScript2(org.eclipse.jdt.core.groovy.tests.search.TypeReferenceSearchTests)  Time elapsed: 0.667 s
18-May-2021 00:30:54 testSearchForTypesScript3(org.eclipse.jdt.core.groovy.tests.search.TypeReferenceSearchTests)  Time elapsed: 0.668 s
18-May-2021 00:30:54 testSearchForTypesScript4(org.eclipse.jdt.core.groovy.tests.search.TypeReferenceSearchTests)  Time elapsed: 0.669 s
18-May-2021 00:30:54 testSearchForTypesScript5(org.eclipse.jdt.core.groovy.tests.search.TypeReferenceSearchTests)  Time elapsed: 0.676 s
18-May-2021 00:30:54 testSearchForTypesScript6(org.eclipse.jdt.core.groovy.tests.search.TypeReferenceSearchTests)  Time elapsed: 0.67 s
18-May-2021 00:30:54 testShouldntFindClassDeclarationInScript(org.eclipse.jdt.core.groovy.tests.search.TypeReferenceSearchTests)  Time elapsed: 0.744 s
18-May-2021 00:30:54 testSearchForTypesArray1(org.eclipse.jdt.core.groovy.tests.search.TypeReferenceSearchTests)  Time elapsed: 0.704 s
18-May-2021 00:30:54 testSearchForTypesClass1(org.eclipse.jdt.core.groovy.tests.search.TypeReferenceSearchTests)  Time elapsed: 0.519 s
18-May-2021 00:30:54 testSearchForTypesClass2(org.eclipse.jdt.core.groovy.tests.search.TypeReferenceSearchTests)  Time elapsed: 0.593 s
18-May-2021 00:30:54 testSearchForTypesClass3(org.eclipse.jdt.core.groovy.tests.search.TypeReferenceSearchTests)  Time elapsed: 0.585 s
18-May-2021 00:30:54 testSearchForTypesClass4(org.eclipse.jdt.core.groovy.tests.search.TypeReferenceSearchTests)  Time elapsed: 0.595 s
18-May-2021 00:30:54 testSearchForTypesClass5(org.eclipse.jdt.core.groovy.tests.search.TypeReferenceSearchTests)  Time elapsed: 0.68 s
18-May-2021 00:30:54 testSearchForTypesClass6(org.eclipse.jdt.core.groovy.tests.search.TypeReferenceSearchTests)  Time elapsed: 0.592 s
18-May-2021 00:30:54 testSearchForTypesClass7(org.eclipse.jdt.core.groovy.tests.search.TypeReferenceSearchTests)  Time elapsed: 0.747 s
18-May-2021 00:30:54 testSearchForTypesClosure1(org.eclipse.jdt.core.groovy.tests.search.TypeReferenceSearchTests)  Time elapsed: 0.673 s
18-May-2021 00:30:54 testSearchForTypesClosure2(org.eclipse.jdt.core.groovy.tests.search.TypeReferenceSearchTests)  Time elapsed: 0.678 s
18-May-2021 00:30:54 testSearchForTypesClosure3(org.eclipse.jdt.core.groovy.tests.search.TypeReferenceSearchTests)  Time elapsed: 0.672 s
18-May-2021 00:30:54 testCoercion1(org.eclipse.jdt.core.groovy.tests.search.TypeReferenceSearchTests)  Time elapsed: 0.595 s
18-May-2021 00:30:54 testGenerics1(org.eclipse.jdt.core.groovy.tests.search.TypeReferenceSearchTests)  Time elapsed: 0.52 s
18-May-2021 00:30:54 testFindClassDeclaration(org.eclipse.jdt.core.groovy.tests.search.TypeReferenceSearchTests)  Time elapsed: 0.515 s
18-May-2021 00:30:54 testConstructorWithDefaultArgsInCompileStatic(org.eclipse.jdt.core.groovy.tests.search.TypeReferenceSearchTests)  Time elapsed: 0.682 s
18-May-2021 00:30:54
18-May-2021 00:30:54 Results:
18-May-2021 00:30:54
18-May-2021 00:30:54 Failures:
18-May-2021 00:30:54   BasicGroovyBuildTests.testBuildJavaHelloWorld:205->BuilderTestSuite.expectingCompiledClasses:207 array lengths differed, expected.length=1 actual.length=2; arrays first differed at element [1]; expected:<end of array> but was:<p1.Hello>
18-May-2021 00:30:54   SpockInferencingTests.testGetterCheck:107->InferencingTestSuite.assertType:63->InferencingTestSuite.assertType:82 Expected type not found.
18-May-2021 00:30:54 Expected: java.lang.Integer
18-May-2021 00:30:54 Found: java.lang.Object
18-May-2021 00:30:54 Declaring type: foo.Bar
18-May-2021 00:30:54 ASTNode: [email protected][getBaz]
18-May-2021 00:30:54 Confidence: UNKNOWN
18-May-2021 00:30:54
18-May-2021 00:30:54
18-May-2021 00:30:54 Tests run: 6103, Failures: 2, Errors: 0, Skipped: 98
18-May-2021 00:30:54
18-May-2021 00:30:57
18-May-2021 00:30:57 !ENTRY org.eclipse.core.resources 2 10035 2021-05-18 00:30:57.048
18-May-2021 00:30:57 !MESSAGE The workspace will exit with unsaved changes in this session.
18-May-2021 00:30:57 [ERROR] There are test failures.
18-May-2021 00:30:57
18-May-2021 00:30:57 Please refer to /opt/bamboo-home/xml-data/build-dir/GRECLIPSE-E416-JOB1/ide-test/org.codehaus.groovy.alltests/target/surefire-reports for the individual test results.
18-May-2021 00:30:57 [INFO]
18-May-2021 00:30:57 [INFO] --- maven-install-plugin:2.3.1:install (default-install) @ org.codehaus.groovy.alltests ---
18-May-2021 00:30:57 [INFO] Installing /opt/bamboo-home/xml-data/build-dir/GRECLIPSE-E416-JOB1/ide-test/org.codehaus.groovy.alltests/target/org.codehaus.groovy.alltests-4.2.0-SNAPSHOT.jar to /home/bamboo/.m2/repository/org/codehaus/groovy/eclipse/org.codehaus.groovy.alltests/4.2.0-SNAPSHOT/org.codehaus.groovy.alltests-4.2.0-SNAPSHOT.jar
18-May-2021 00:30:57 [INFO] Installing /opt/bamboo-home/xml-data/build-dir/GRECLIPSE-E416-JOB1/ide-test/org.codehaus.groovy.alltests/pom.xml to /home/bamboo/.m2/repository/org/codehaus/groovy/eclipse/org.codehaus.groovy.alltests/4.2.0-SNAPSHOT/org.codehaus.groovy.alltests-4.2.0-SNAPSHOT.pom
18-May-2021 00:30:57 [INFO] Installing /opt/bamboo-home/xml-data/build-dir/GRECLIPSE-E416-JOB1/ide-test/org.codehaus.groovy.alltests/target/org.codehaus.groovy.alltests-4.2.0-SNAPSHOT-sources.jar to /home/bamboo/.m2/repository/org/codehaus/groovy/eclipse/org.codehaus.groovy.alltests/4.2.0-SNAPSHOT/org.codehaus.groovy.alltests-4.2.0-SNAPSHOT-sources.jar
18-May-2021 00:30:57 [INFO] Installing /opt/bamboo-home/xml-data/build-dir/GRECLIPSE-E416-JOB1/ide-test/org.codehaus.groovy.alltests/target/p2content.xml to /home/bamboo/.m2/repository/org/codehaus/groovy/eclipse/org.codehaus.groovy.alltests/4.2.0-SNAPSHOT/org.codehaus.groovy.alltests-4.2.0-SNAPSHOT-p2metadata.xml
18-May-2021 00:30:57 [INFO] Installing /opt/bamboo-home/xml-data/build-dir/GRECLIPSE-E416-JOB1/ide-test/org.codehaus.groovy.alltests/target/p2artifacts.xml to /home/bamboo/.m2/repository/org/codehaus/groovy/eclipse/org.codehaus.groovy.alltests/4.2.0-SNAPSHOT/org.codehaus.groovy.alltests-4.2.0-SNAPSHOT-p2artifacts.xml
18-May-2021 00:30:57 [INFO] Installing /opt/bamboo-home/xml-data/build-dir/GRECLIPSE-E416-JOB1/ide-test/org.codehaus.groovy.alltests/target/p2content.xml to /home/bamboo/.m2/repository/org/codehaus/groovy/eclipse/org.codehaus.groovy.alltests/4.2.0-SNAPSHOT/org.codehaus.groovy.alltests-4.2.0-SNAPSHOT-p2metadata.xml
18-May-2021 00:30:57 [INFO] Installing /opt/bamboo-home/xml-data/build-dir/GRECLIPSE-E416-JOB1/ide-test/org.codehaus.groovy.alltests/target/p2artifacts.xml to /home/bamboo/.m2/repository/org/codehaus/groovy/eclipse/org.codehaus.groovy.alltests/4.2.0-SNAPSHOT/org.codehaus.groovy.alltests-4.2.0-SNAPSHOT-p2artifacts.xml
18-May-2021 00:30:57 [INFO]
18-May-2021 00:30:57 [INFO] --- tycho-p2-plugin:1.7.0:update-local-index (default-update-local-index) @ org.codehaus.groovy.alltests ---
18-May-2021 00:30:57 [INFO]
18-May-2021 00:30:57 [INFO] --- maven-deploy-plugin:2.8.2:deploy (default-deploy) @ org.codehaus.groovy.alltests ---
18-May-2021 00:30:57 [INFO] Skipping artifact deployment
18-May-2021 00:30:57 [INFO]
18-May-2021 00:30:57 [INFO] -----< org.codehaus.groovy.eclipse:org.codehaus.groovy.m2eclipse >------
18-May-2021 00:30:57 [INFO] Building org.codehaus.groovy.m2eclipse 4.2.0-SNAPSHOT            [38/40]
18-May-2021 00:30:57 [INFO] ---------------------------[ eclipse-plugin ]---------------------------
18-May-2021 00:30:57 [INFO]
18-May-2021 00:30:57 [INFO] --- maven-clean-plugin:2.5:clean (default-clean) @ org.codehaus.groovy.m2eclipse ---
18-May-2021 00:30:57 [INFO]
18-May-2021 00:30:57 [INFO] --- tycho-packaging-plugin:1.7.0:build-qualifier (default-build-qualifier) @ org.codehaus.groovy.m2eclipse ---
18-May-2021 00:30:57 [INFO] The project's OSGi version is 4.2.0.v202105172316-e2006
18-May-2021 00:30:57 [INFO]
18-May-2021 00:30:57 [INFO] --- tycho-packaging-plugin:1.7.0:validate-id (default-validate-id) @ org.codehaus.groovy.m2eclipse ---
18-May-2021 00:30:57 [INFO]
18-May-2021 00:30:57 [INFO] --- tycho-packaging-plugin:1.7.0:validate-version (default-validate-version) @ org.codehaus.groovy.m2eclipse ---
18-May-2021 00:30:57 [INFO]
18-May-2021 00:30:57 [INFO] --- properties-maven-plugin:1.0.0:read-project-properties (default) @ org.codehaus.groovy.m2eclipse ---
18-May-2021 00:30:57 [INFO]
18-May-2021 00:30:57 [INFO] --- maven-resources-plugin:2.4.3:resources (default-resources) @ org.codehaus.groovy.m2eclipse ---
18-May-2021 00:30:57 [INFO] Using 'UTF-8' encoding to copy filtered resources.
18-May-2021 00:30:57 [INFO] skip non existing resourceDirectory /opt/bamboo-home/xml-data/build-dir/GRECLIPSE-E416-JOB1/extras/org.codehaus.groovy.m2eclipse/src/main/resources
18-May-2021 00:30:57 [INFO]
18-May-2021 00:30:57 [INFO] --- tycho-compiler-plugin:1.7.0:compile (default-compile) @ org.codehaus.groovy.m2eclipse ---
18-May-2021 00:30:57 [INFO] Compiling 2 source files to /opt/bamboo-home/xml-data/build-dir/GRECLIPSE-E416-JOB1/extras/org.codehaus.groovy.m2eclipse/target/classes
18-May-2021 00:30:57 [INFO]
18-May-2021 00:30:57 [INFO] --- maven-resources-plugin:2.4.3:testResources (default-testResources) @ org.codehaus.groovy.m2eclipse ---
18-May-2021 00:30:57 [INFO] Using 'UTF-8' encoding to copy filtered resources.
18-May-2021 00:30:57 [INFO] skip non existing resourceDirectory /opt/bamboo-home/xml-data/build-dir/GRECLIPSE-E416-JOB1/extras/org.codehaus.groovy.m2eclipse/src/test/resources
18-May-2021 00:30:57 [INFO]
18-May-2021 00:30:57 [INFO] --- tycho-source-plugin:1.7.0:plugin-source (plugin-source) @ org.codehaus.groovy.m2eclipse ---
18-May-2021 00:30:57 [INFO] Building jar: /opt/bamboo-home/xml-data/build-dir/GRECLIPSE-E416-JOB1/extras/org.codehaus.groovy.m2eclipse/target/org.codehaus.groovy.m2eclipse-4.2.0-SNAPSHOT-sources.jar
18-May-2021 00:30:57 [INFO]
18-May-2021 00:30:57 [INFO] --- target-platform-configuration:1.7.0:target-platform (default-target-platform) @ org.codehaus.groovy.m2eclipse ---
18-May-2021 00:30:57 [INFO]
18-May-2021 00:30:57 [INFO] --- tycho-packaging-plugin:1.7.0:package-plugin (default-package-plugin) @ org.codehaus.groovy.m2eclipse ---
18-May-2021 00:30:57 [INFO] Building jar: /opt/bamboo-home/xml-data/build-dir/GRECLIPSE-E416-JOB1/extras/org.codehaus.groovy.m2eclipse/target/org.codehaus.groovy.m2eclipse-4.2.0-SNAPSHOT.jar
18-May-2021 00:30:57 [INFO]
18-May-2021 00:30:57 [INFO] --- tycho-p2-plugin:1.7.0:p2-metadata-default (default-p2-metadata-default) @ org.codehaus.groovy.m2eclipse ---
18-May-2021 00:30:57 [INFO]
18-May-2021 00:30:57 [INFO] --- maven-jarsigner-plugin:3.0.0:sign (sign) @ org.codehaus.groovy.m2eclipse ---
18-May-2021 00:30:58 [INFO] 2 archive(s) processed
18-May-2021 00:30:58 [INFO]
18-May-2021 00:30:58 [INFO] --- tycho-source-feature-plugin:1.7.0:source-feature (source-feature) @ org.codehaus.groovy.m2eclipse ---
18-May-2021 00:30:58 [INFO]
18-May-2021 00:30:58 [INFO] --- tycho-p2-plugin:1.7.0:p2-metadata (attach-p2-metadata) @ org.codehaus.groovy.m2eclipse ---
18-May-2021 00:30:58 [INFO]
18-May-2021 00:30:58 [INFO] --- maven-install-plugin:2.3.1:install (default-install) @ org.codehaus.groovy.m2eclipse ---
18-May-2021 00:30:58 [INFO] Installing /opt/bamboo-home/xml-data/build-dir/GRECLIPSE-E416-JOB1/extras/org.codehaus.groovy.m2eclipse/target/org.codehaus.groovy.m2eclipse-4.2.0-SNAPSHOT.jar to /home/bamboo/.m2/repository/org/codehaus/groovy/eclipse/org.codehaus.groovy.m2eclipse/4.2.0-SNAPSHOT/org.codehaus.groovy.m2eclipse-4.2.0-SNAPSHOT.jar
18-May-2021 00:30:58 [INFO] Installing /opt/bamboo-home/xml-data/build-dir/GRECLIPSE-E416-JOB1/extras/org.codehaus.groovy.m2eclipse/pom.xml to /home/bamboo/.m2/repository/org/codehaus/groovy/eclipse/org.codehaus.groovy.m2eclipse/4.2.0-SNAPSHOT/org.codehaus.groovy.m2eclipse-4.2.0-SNAPSHOT.pom
18-May-2021 00:30:58 [INFO] Installing /opt/bamboo-home/xml-data/build-dir/GRECLIPSE-E416-JOB1/extras/org.codehaus.groovy.m2eclipse/target/org.codehaus.groovy.m2eclipse-4.2.0-SNAPSHOT-sources.jar to /home/bamboo/.m2/repository/org/codehaus/groovy/eclipse/org.codehaus.groovy.m2eclipse/4.2.0-SNAPSHOT/org.codehaus.groovy.m2eclipse-4.2.0-SNAPSHOT-sources.jar
18-May-2021 00:30:58 [INFO] Installing /opt/bamboo-home/xml-data/build-dir/GRECLIPSE-E416-JOB1/extras/org.codehaus.groovy.m2eclipse/target/p2content.xml to /home/bamboo/.m2/repository/org/codehaus/groovy/eclipse/org.codehaus.groovy.m2eclipse/4.2.0-SNAPSHOT/org.codehaus.groovy.m2eclipse-4.2.0-SNAPSHOT-p2metadata.xml
18-May-2021 00:30:58 [INFO] Installing /opt/bamboo-home/xml-data/build-dir/GRECLIPSE-E416-JOB1/extras/org.codehaus.groovy.m2eclipse/target/p2artifacts.xml to /home/bamboo/.m2/repository/org/codehaus/groovy/eclipse/org.codehaus.groovy.m2eclipse/4.2.0-SNAPSHOT/org.codehaus.groovy.m2eclipse-4.2.0-SNAPSHOT-p2artifacts.xml
18-May-2021 00:30:58 [INFO] Installing /opt/bamboo-home/xml-data/build-dir/GRECLIPSE-E416-JOB1/extras/org.codehaus.groovy.m2eclipse/target/p2content.xml to /home/bamboo/.m2/repository/org/codehaus/groovy/eclipse/org.codehaus.groovy.m2eclipse/4.2.0-SNAPSHOT/org.codehaus.groovy.m2eclipse-4.2.0-SNAPSHOT-p2metadata.xml
18-May-2021 00:30:58 [INFO] Installing /opt/bamboo-home/xml-data/build-dir/GRECLIPSE-E416-JOB1/extras/org.codehaus.groovy.m2eclipse/target/p2artifacts.xml to /home/bamboo/.m2/repository/org/codehaus/groovy/eclipse/org.codehaus.groovy.m2eclipse/4.2.0-SNAPSHOT/org.codehaus.groovy.m2eclipse-4.2.0-SNAPSHOT-p2artifacts.xml
18-May-2021 00:30:58 [INFO]
18-May-2021 00:30:58 [INFO] --- tycho-p2-plugin:1.7.0:update-local-index (default-update-local-index) @ org.codehaus.groovy.m2eclipse ---
18-May-2021 00:30:58 [INFO]
18-May-2021 00:30:58 [INFO] --- maven-deploy-plugin:2.8.2:deploy (default-deploy) @ org.codehaus.groovy.m2eclipse ---
18-May-2021 00:30:58 [INFO] Skipping artifact deployment
18-May-2021 00:30:58 [INFO]
18-May-2021 00:30:58 [INFO] --< org.codehaus.groovy.eclipse:org.codehaus.groovy.m2eclipse.feature >--
18-May-2021 00:30:58 [INFO] Building org.codehaus.groovy.m2eclipse.feature 4.2.0-SNAPSHOT    [39/40]
18-May-2021 00:30:58 [INFO] --------------------------[ eclipse-feature ]---------------------------
18-May-2021 00:30:58 [INFO]
18-May-2021 00:30:58 [INFO] --- maven-clean-plugin:2.5:clean (default-clean) @ org.codehaus.groovy.m2eclipse.feature ---
18-May-2021 00:30:58 [INFO] Deleting /opt/bamboo-home/xml-data/build-dir/GRECLIPSE-E416-JOB1/extras/Feature-org.codehaus.groovy.m2eclipse/target
18-May-2021 00:30:58 [INFO]
18-May-2021 00:30:58 [INFO] --- tycho-packaging-plugin:1.7.0:build-qualifier-aggregator (default-build-qualifier-aggregator) @ org.codehaus.groovy.m2eclipse.feature ---
18-May-2021 00:30:58 [INFO] The project's OSGi version is 4.2.0.v202105172316-e2006
18-May-2021 00:30:58 [INFO]
18-May-2021 00:30:58 [INFO] --- tycho-packaging-plugin:1.7.0:validate-id (default-validate-id) @ org.codehaus.groovy.m2eclipse.feature ---
18-May-2021 00:30:58 [INFO]
18-May-2021 00:30:58 [INFO] --- tycho-packaging-plugin:1.7.0:validate-version (default-validate-version) @ org.codehaus.groovy.m2eclipse.feature ---
18-May-2021 00:30:58 [INFO]
18-May-2021 00:30:58 [INFO] --- properties-maven-plugin:1.0.0:read-project-properties (default) @ org.codehaus.groovy.m2eclipse.feature ---
18-May-2021 00:30:58 [INFO]
18-May-2021 00:30:58 [INFO] --- tycho-source-plugin:1.7.0:plugin-source (plugin-source) @ org.codehaus.groovy.m2eclipse.feature ---
18-May-2021 00:30:58 [INFO]
18-May-2021 00:30:58 [INFO] --- target-platform-configuration:1.7.0:target-platform (default-target-platform) @ org.codehaus.groovy.m2eclipse.feature ---
18-May-2021 00:30:58 [INFO]
18-May-2021 00:30:58 [INFO] --- tycho-packaging-plugin:1.7.0:package-feature (default-package-feature) @ org.codehaus.groovy.m2eclipse.feature ---
18-May-2021 00:30:58 [INFO] Building jar: /opt/bamboo-home/xml-data/build-dir/GRECLIPSE-E416-JOB1/extras/Feature-org.codehaus.groovy.m2eclipse/target/org.codehaus.groovy.m2eclipse.feature-4.2.0-SNAPSHOT.jar
18-May-2021 00:30:58 [INFO]
18-May-2021 00:30:58 [INFO] --- tycho-p2-plugin:1.7.0:p2-metadata-default (default-p2-metadata-default) @ org.codehaus.groovy.m2eclipse.feature ---
18-May-2021 00:30:58 [INFO]
18-May-2021 00:30:58 [INFO] --- tycho-p2-plugin:1.7.0:feature-p2-metadata (default-feature-p2-metadata) @ org.codehaus.groovy.m2eclipse.feature ---
18-May-2021 00:30:58 [INFO]
18-May-2021 00:30:58 [INFO] --- maven-jarsigner-plugin:3.0.0:sign (sign) @ org.codehaus.groovy.m2eclipse.feature ---
18-May-2021 00:30:59 [INFO] 1 archive(s) processed
18-May-2021 00:30:59 [INFO]
18-May-2021 00:30:59 [INFO] --- tycho-source-feature-plugin:1.7.0:source-feature (source-feature) @ org.codehaus.groovy.m2eclipse.feature ---
18-May-2021 00:30:59 [INFO] Building jar: /opt/bamboo-home/xml-data/build-dir/GRECLIPSE-E416-JOB1/extras/Feature-org.codehaus.groovy.m2eclipse/target/org.codehaus.groovy.m2eclipse.feature-4.2.0-SNAPSHOT-sources-feature.jar
18-May-2021 00:30:59 [INFO]
18-May-2021 00:30:59 [INFO] --- tycho-p2-plugin:1.7.0:p2-metadata (attach-p2-metadata) @ org.codehaus.groovy.m2eclipse.feature ---
18-May-2021 00:30:59 [INFO]
18-May-2021 00:30:59 [INFO] --- maven-install-plugin:2.3.1:install (default-install) @ org.codehaus.groovy.m2eclipse.feature ---
18-May-2021 00:30:59 [INFO] Installing /opt/bamboo-home/xml-data/build-dir/GRECLIPSE-E416-JOB1/extras/Feature-org.codehaus.groovy.m2eclipse/target/org.codehaus.groovy.m2eclipse.feature-4.2.0-SNAPSHOT.jar to /home/bamboo/.m2/repository/org/codehaus/groovy/eclipse/org.codehaus.groovy.m2eclipse.feature/4.2.0-SNAPSHOT/org.codehaus.groovy.m2eclipse.feature-4.2.0-SNAPSHOT.jar
18-May-2021 00:30:59 [INFO] Installing /opt/bamboo-home/xml-data/build-dir/GRECLIPSE-E416-JOB1/extras/Feature-org.codehaus.groovy.m2eclipse/pom.xml to /home/bamboo/.m2/repository/org/codehaus/groovy/eclipse/org.codehaus.groovy.m2eclipse.feature/4.2.0-SNAPSHOT/org.codehaus.groovy.m2eclipse.feature-4.2.0-SNAPSHOT.pom
18-May-2021 00:30:59 [INFO] Installing /opt/bamboo-home/xml-data/build-dir/GRECLIPSE-E416-JOB1/extras/Feature-org.codehaus.groovy.m2eclipse/target/p2content.xml to /home/bamboo/.m2/repository/org/codehaus/groovy/eclipse/org.codehaus.groovy.m2eclipse.feature/4.2.0-SNAPSHOT/org.codehaus.groovy.m2eclipse.feature-4.2.0-SNAPSHOT-p2metadata.xml
18-May-2021 00:30:59 [INFO] Installing /opt/bamboo-home/xml-data/build-dir/GRECLIPSE-E416-JOB1/extras/Feature-org.codehaus.groovy.m2eclipse/target/p2artifacts.xml to /home/bamboo/.m2/repository/org/codehaus/groovy/eclipse/org.codehaus.groovy.m2eclipse.feature/4.2.0-SNAPSHOT/org.codehaus.groovy.m2eclipse.feature-4.2.0-SNAPSHOT-p2artifacts.xml
18-May-2021 00:30:59 [INFO] Installing /opt/bamboo-home/xml-data/build-dir/GRECLIPSE-E416-JOB1/extras/Feature-org.codehaus.groovy.m2eclipse/target/org.codehaus.groovy.m2eclipse.feature-4.2.0-SNAPSHOT-sources-feature.jar to /home/bamboo/.m2/repository/org/codehaus/groovy/eclipse/org.codehaus.groovy.m2eclipse.feature/4.2.0-SNAPSHOT/org.codehaus.groovy.m2eclipse.feature-4.2.0-SNAPSHOT-sources-feature.jar
18-May-2021 00:30:59 [INFO] Installing /opt/bamboo-home/xml-data/build-dir/GRECLIPSE-E416-JOB1/extras/Feature-org.codehaus.groovy.m2eclipse/target/p2content.xml to /home/bamboo/.m2/repository/org/codehaus/groovy/eclipse/org.codehaus.groovy.m2eclipse.feature/4.2.0-SNAPSHOT/org.codehaus.groovy.m2eclipse.feature-4.2.0-SNAPSHOT-p2metadata.xml
18-May-2021 00:30:59 [INFO] Installing /opt/bamboo-home/xml-data/build-dir/GRECLIPSE-E416-JOB1/extras/Feature-org.codehaus.groovy.m2eclipse/target/p2artifacts.xml to /home/bamboo/.m2/repository/org/codehaus/groovy/eclipse/org.codehaus.groovy.m2eclipse.feature/4.2.0-SNAPSHOT/org.codehaus.groovy.m2eclipse.feature-4.2.0-SNAPSHOT-p2artifacts.xml
18-May-2021 00:30:59 [INFO]
18-May-2021 00:30:59 [INFO] --- tycho-p2-plugin:1.7.0:update-local-index (default-update-local-index) @ org.codehaus.groovy.m2eclipse.feature ---
18-May-2021 00:30:59 [INFO]
18-May-2021 00:30:59 [INFO] --- maven-deploy-plugin:2.8.2:deploy (default-deploy) @ org.codehaus.groovy.m2eclipse.feature ---
18-May-2021 00:30:59 [INFO] Skipping artifact deployment
18-May-2021 00:30:59 [INFO]
18-May-2021 00:30:59 [INFO] ----< org.codehaus.groovy.eclipse:org.codehaus.groovy.eclipse.site >----
18-May-2021 00:30:59 [INFO] Building org.codehaus.groovy.eclipse.site 4.2.0-SNAPSHOT         [40/40]
18-May-2021 00:30:59 [INFO] ------------------------[ eclipse-update-site ]-------------------------
18-May-2021 00:30:59 [INFO]
18-May-2021 00:30:59 [INFO] --- maven-clean-plugin:2.5:clean (default-clean) @ org.codehaus.groovy.eclipse.site ---
18-May-2021 00:30:59 [INFO]
18-May-2021 00:30:59 [INFO] --- tycho-packaging-plugin:1.7.0:build-qualifier (default-build-qualifier) @ org.codehaus.groovy.eclipse.site ---
18-May-2021 00:30:59 [INFO] The project's OSGi version is 4.2.0.v202105172316-e2006
18-May-2021 00:30:59 [INFO]
18-May-2021 00:30:59 [INFO] --- properties-maven-plugin:1.0.0:read-project-properties (default) @ org.codehaus.groovy.eclipse.site ---
18-May-2021 00:30:59 [INFO]
18-May-2021 00:30:59 [INFO] --- tycho-source-plugin:1.7.0:plugin-source (plugin-source) @ org.codehaus.groovy.eclipse.site ---
18-May-2021 00:30:59 [INFO]
18-May-2021 00:30:59 [INFO] --- tycho-packaging-plugin:1.7.0:update-site (default-update-site) @ org.codehaus.groovy.eclipse.site ---
18-May-2021 00:30:59 [INFO]
18-May-2021 00:30:59 [INFO] --- tycho-p2-plugin:1.7.0:update-site-p2-metadata (default-update-site-p2-metadata) @ org.codehaus.groovy.eclipse.site ---
18-May-2021 00:30:59 [INFO] Command line:
18-May-2021 00:30:59         [/opt/jdk8u292-b10/jre/bin/java, -jar, /opt/users/bamboo/.m2/repository/org/eclipse/tycho/tycho-bundles-external/1.7.0/eclipse/plugins/org.eclipse.equinox.launcher_1.5.700.v20200207-2156.jar, -configuration, /tmp/GRECLIPSE-E416-JOB1/tycho-p2-runtime787078875044817304.tmp/configuration, -nosplash, -application, org.eclipse.equinox.p2.publisher.UpdateSitePublisher, -source, /opt/bamboo-home/xml-data/build-dir/GRECLIPSE-E416-JOB1/Site-org.codehaus.groovy.eclipse/target/site, -metadataRepository, file:/opt/bamboo-home/xml-data/build-dir/GRECLIPSE-E416-JOB1/Site-org.codehaus.groovy.eclipse/target/site/, -metadataRepositoryName, org.codehaus.groovy.eclipse.site, -artifactRepository, file:/opt/bamboo-home/xml-data/build-dir/GRECLIPSE-E416-JOB1/Site-org.codehaus.groovy.eclipse/target/site/, -artifactRepositoryName, org.codehaus.groovy.eclipse.site Artifacts, -noDefaultIUs, -compress]
18-May-2021 00:31:00 Generating metadata for ..
18-May-2021 00:31:01 Generation completed with success [0 seconds].
18-May-2021 00:31:02 [INFO]
18-May-2021 00:31:02 [INFO] --- tycho-packaging-plugin:1.7.0:update-site-packaging (default-update-site-packaging) @ org.codehaus.groovy.eclipse.site ---
18-May-2021 00:31:02 [INFO] Building zip: /opt/bamboo-home/xml-data/build-dir/GRECLIPSE-E416-JOB1/Site-org.codehaus.groovy.eclipse/target/site.zip
18-May-2021 00:31:02 [INFO]
18-May-2021 00:31:02 [INFO] --- maven-jarsigner-plugin:3.0.0:sign (sign) @ org.codehaus.groovy.eclipse.site ---
18-May-2021 00:31:03 [INFO] 1 archive(s) processed
18-May-2021 00:31:03 [INFO]
18-May-2021 00:31:03 [INFO] --- tycho-source-feature-plugin:1.7.0:source-feature (source-feature) @ org.codehaus.groovy.eclipse.site ---
18-May-2021 00:31:03 [INFO]
18-May-2021 00:31:03 [INFO] --- tycho-p2-plugin:1.7.0:p2-metadata (attach-p2-metadata) @ org.codehaus.groovy.eclipse.site ---
18-May-2021 00:31:03 [INFO]
18-May-2021 00:31:03 [INFO] --- maven-install-plugin:2.3.1:install (default-install) @ org.codehaus.groovy.eclipse.site ---
18-May-2021 00:31:03 [INFO] Installing /opt/bamboo-home/xml-data/build-dir/GRECLIPSE-E416-JOB1/Site-org.codehaus.groovy.eclipse/target/site.zip to /home/bamboo/.m2/repository/org/codehaus/groovy/eclipse/org.codehaus.groovy.eclipse.site/4.2.0-SNAPSHOT/org.codehaus.groovy.eclipse.site-4.2.0-SNAPSHOT.zip
18-May-2021 00:31:03 [INFO] Installing /opt/bamboo-home/xml-data/build-dir/GRECLIPSE-E416-JOB1/Site-org.codehaus.groovy.eclipse/pom.xml to /home/bamboo/.m2/repository/org/codehaus/groovy/eclipse/org.codehaus.groovy.eclipse.site/4.2.0-SNAPSHOT/org.codehaus.groovy.eclipse.site-4.2.0-SNAPSHOT.pom
18-May-2021 00:31:03 [INFO]
18-May-2021 00:31:03 [INFO] --- maven-deploy-plugin:2.8.2:deploy (default-deploy) @ org.codehaus.groovy.eclipse.site ---
18-May-2021 00:31:03 [INFO] Skipping artifact deployment
18-May-2021 00:31:03 [INFO]
18-May-2021 00:31:03 [INFO] --- maven-antrun-plugin:1.8:run (upload-dist) @ org.codehaus.groovy.eclipse.site ---
18-May-2021 00:31:03 [INFO] Executing tasks
18-May-2021 00:31:03
18-May-2021 00:31:03 main:
18-May-2021 00:31:03      [echo] Uploading main update site to s3..."
18-May-2021 00:31:03      [echo] == Are props set so we can deploy? ==
18-May-2021 00:31:03      [echo] dist_properties=/home/bamboo/tools/s3.properties
18-May-2021 00:31:03      [echo] bamboo_s3_properties=/home/bamboo/tools/s3.properties
18-May-2021 00:31:03      [echo] dist.full.version=4.2.0.v202105172316-e2006
18-May-2021 00:31:03      [echo] dist.file.name=org.codehaus.groovy-4.2.0.v202105172316-e2006-updatesite.zip
18-May-2021 00:31:03       [zip] Building zip: /opt/bamboo-home/xml-data/build-dir/GRECLIPSE-E416-JOB1/Site-org.codehaus.groovy.eclipse/target/org.codehaus.groovy-4.2.0.v202105172316-e2006-updatesite.zip
18-May-2021 00:31:07      [echo] Preparing for upload...
18-May-2021 00:31:07      [echo] Will Delete:
18-May-2021 00:31:07      [echo] dist.bucket=dist.springsource.org
18-May-2021 00:31:07      [echo] dist.path=snapshot/GRECLIPSE/e4.16
18-May-2021 00:31:07      [echo] Will Upload:
18-May-2021 00:31:07      [echo] dist.bucket=dist.springsource.org
18-May-2021 00:31:07      [echo] fromDir=/opt/bamboo-home/xml-data/build-dir/GRECLIPSE-E416-JOB1/Site-org.codehaus.groovy.eclipse/target/site
18-May-2021 00:31:07      [echo] toDir=snapshot/GRECLIPSE/e4.16
18-May-2021 00:31:07      [echo] Will Upload:
18-May-2021 00:31:07      [echo] dist.bucket=dist.springsource.org
18-May-2021 00:31:07      [echo] fromFile=/opt/bamboo-home/xml-data/build-dir/GRECLIPSE-E416-JOB1/Site-org.codehaus.groovy.eclipse/target/org.codehaus.groovy-4.2.0.v202105172316-e2006-updatesite.zip
18-May-2021 00:31:07      [echo] toFile=snapshot/GRECLIPSE/e4.16/org.codehaus.groovy-4.2.0.v202105172316-e2006-updatesite.zip
18-May-2021 00:31:07      [echo] metadata bundle.version=4.2.0.v202105172316-e2006
18-May-2021 00:31:07      [echo] metadata package.file.name=org.codehaus.groovy-4.2.0.v202105172316-e2006-updatesite.zip
18-May-2021 00:31:07      [echo] metadata project.name=Groovy Development Tools
18-May-2021 00:31:07      [echo] metadata release.type=snapshot
18-May-2021 00:31:09 Deleted s3://dist.springsource.org/snapshot/GRECLIPSE/e4.16/artifacts.jar
18-May-2021 00:31:09 Deleted s3://dist.springsource.org/snapshot/GRECLIPSE/e4.16/content.jar
18-May-2021 00:31:09 Deleted s3://dist.springsource.org/snapshot/GRECLIPSE/e4.16/features/
18-May-2021 00:31:09 Deleted s3://dist.springsource.org/snapshot/GRECLIPSE/e4.16/features/org.codehaus.groovy.compilerless.feature_4.2.0.v202105162300-e2006.jar
18-May-2021 00:31:09 Deleted s3://dist.springsource.org/snapshot/GRECLIPSE/e4.16/features/org.codehaus.groovy.eclipse.feature_4.2.0.v202105162300-e2006.jar
18-May-2021 00:31:09 Deleted s3://dist.springsource.org/snapshot/GRECLIPSE/e4.16/features/org.codehaus.groovy.headless.feature_4.2.0.v202105162300-e2006.jar
18-May-2021 00:31:10 Deleted s3://dist.springsource.org/snapshot/GRECLIPSE/e4.16/features/org.codehaus.groovy.jdt.patch_4.2.0.v202105162300-e2006.jar
18-May-2021 00:31:10 Deleted s3://dist.springsource.org/snapshot/GRECLIPSE/e4.16/features/org.codehaus.groovy.m2eclipse.feature_4.2.0.v202105162300-e2006.jar
18-May-2021 00:31:10 Deleted s3://dist.springsource.org/snapshot/GRECLIPSE/e4.16/features/org.codehaus.groovy25.feature_4.2.0.v202105162300-e2006.jar
18-May-2021 00:31:10 Deleted s3://dist.springsource.org/snapshot/GRECLIPSE/e4.16/features/org.codehaus.groovy30.feature_4.2.0.v202105162300-e2006.jar
18-May-2021 00:31:10 Deleted s3://dist.springsource.org/snapshot/GRECLIPSE/e4.16/features/org.codehaus.groovy40.feature_4.2.0.v202105162300-e2006.jar
18-May-2021 00:31:10 Deleted s3://dist.springsource.org/snapshot/GRECLIPSE/e4.16/plugins/
18-May-2021 00:31:10 Deleted s3://dist.springsource.org/snapshot/GRECLIPSE/e4.16/plugins/org.codehaus.groovy.eclipse.ant_4.2.0.v202105162300-e2006.jar
18-May-2021 00:31:10 Deleted s3://dist.springsource.org/snapshot/GRECLIPSE/e4.16/plugins/org.codehaus.groovy.eclipse.astviews_4.2.0.v202105162300-e2006.jar
18-May-2021 00:31:11 Deleted s3://dist.springsource.org/snapshot/GRECLIPSE/e4.16/plugins/org.codehaus.groovy.eclipse.codeassist_4.2.0.v202105162300-e2006.jar
18-May-2021 00:31:11 Deleted s3://dist.springsource.org/snapshot/GRECLIPSE/e4.16/plugins/org.codehaus.groovy.eclipse.codebrowsing_4.2.0.v202105162300-e2006.jar
18-May-2021 00:31:11 Deleted s3://dist.springsource.org/snapshot/GRECLIPSE/e4.16/plugins/org.codehaus.groovy.eclipse.compilerResolver_4.2.0.v202105162300-e2006.jar
18-May-2021 00:31:11 Deleted s3://dist.springsource.org/snapshot/GRECLIPSE/e4.16/plugins/org.codehaus.groovy.eclipse.core_4.2.0.v202105162300-e2006.jar
18-May-2021 00:31:11 Deleted s3://dist.springsource.org/snapshot/GRECLIPSE/e4.16/plugins/org.codehaus.groovy.eclipse.dsl_4.2.0.v202105162300-e2006.jar
18-May-2021 00:31:11 Deleted s3://dist.springsource.org/snapshot/GRECLIPSE/e4.16/plugins/org.codehaus.groovy.eclipse.quickfix_4.2.0.v202105162300-e2006.jar
18-May-2021 00:31:11 Deleted s3://dist.springsource.org/snapshot/GRECLIPSE/e4.16/plugins/org.codehaus.groovy.eclipse.refactoring_4.2.0.v202105162300-e2006.jar
18-May-2021 00:31:11 Deleted s3://dist.springsource.org/snapshot/GRECLIPSE/e4.16/plugins/org.codehaus.groovy.eclipse.ui_4.2.0.v202105162300-e2006.jar
18-May-2021 00:31:12 Deleted s3://dist.springsource.org/snapshot/GRECLIPSE/e4.16/plugins/org.codehaus.groovy.eclipse_4.2.0.v202105162300-e2006.jar
18-May-2021 00:31:12 Deleted s3://dist.springsource.org/snapshot/GRECLIPSE/e4.16/plugins/org.codehaus.groovy.m2eclipse_4.2.0.v202105162300-e2006.jar
18-May-2021 00:31:12 Deleted s3://dist.springsource.org/snapshot/GRECLIPSE/e4.16/plugins/org.codehaus.groovy_2.5.14.v202105162300-e2006.jar
18-May-2021 00:31:12 Deleted s3://dist.springsource.org/snapshot/GRECLIPSE/e4.16/plugins/org.codehaus.groovy_3.0.8.v202105162300-e2006.jar
18-May-2021 00:31:12 Deleted s3://dist.springsource.org/snapshot/GRECLIPSE/e4.16/plugins/org.codehaus.groovy_4.0.0.v202105162300-e2006.jar
18-May-2021 00:31:12 Deleted s3://dist.springsource.org/snapshot/GRECLIPSE/e4.16/plugins/org.eclipse.jdt.core_3.22.0.v202105162300-e2006.jar
18-May-2021 00:31:12 Deleted s3://dist.springsource.org/snapshot/GRECLIPSE/e4.16/plugins/org.eclipse.jdt.groovy.core_4.2.0.v202105162300-e2006.jar
18-May-2021 00:31:12 Deleted s3://dist.springsource.org/snapshot/GRECLIPSE/e4.16/site.xml
18-May-2021 00:31:13 Uploading /opt/bamboo-home/xml-data/build-dir/GRECLIPSE-E416-JOB1/Site-org.codehaus.groovy.eclipse/target/site/artifacts.jar (2.8 KB) to s3://dist.springsource.org/snapshot/GRECLIPSE/e4.16/artifacts.jar
18-May-2021 00:31:13 Transfer Time: .2 s - Transfer Rate: 11.7 KB/s
18-May-2021 00:31:13 Uploading /opt/bamboo-home/xml-data/build-dir/GRECLIPSE-E416-JOB1/Site-org.codehaus.groovy.eclipse/target/site/content.jar (13.5 KB) to s3://dist.springsource.org/snapshot/GRECLIPSE/e4.16/content.jar
18-May-2021 00:31:14 Transfer Time: .4 s - Transfer Rate: 36.5 KB/s
18-May-2021 00:31:14 Uploading /opt/bamboo-home/xml-data/build-dir/GRECLIPSE-E416-JOB1/Site-org.codehaus.groovy.eclipse/target/site/features/org.codehaus.groovy.compilerless.feature_4.2.0.v202105172316-e2006.jar (14.9 KB) to s3://dist.springsource.org/snapshot/GRECLIPSE/e4.16/features/org.codehaus.groovy.compilerless.feature_4.2.0.v202105172316-e2006.jar
18-May-2021 00:31:15 Transfer Time: .3 s - Transfer Rate: 56.1 KB/s
18-May-2021 00:31:15 Uploading /opt/bamboo-home/xml-data/build-dir/GRECLIPSE-E416-JOB1/Site-org.codehaus.groovy.eclipse/target/site/features/org.codehaus.groovy.eclipse.feature_4.2.0.v202105172316-e2006.jar (14.8 KB) to s3://dist.springsource.org/snapshot/GRECLIPSE/e4.16/features/org.codehaus.groovy.eclipse.feature_4.2.0.v202105172316-e2006.jar
18-May-2021 00:31:15 Transfer Time: .2 s - Transfer Rate: 63.4 KB/s
18-May-2021 00:31:16 Uploading /opt/bamboo-home/xml-data/build-dir/GRECLIPSE-E416-JOB1/Site-org.codehaus.groovy.eclipse/target/site/features/org.codehaus.groovy.headless.feature_4.2.0.v202105172316-e2006.jar (14.9 KB) to s3://dist.springsource.org/snapshot/GRECLIPSE/e4.16/features/org.codehaus.groovy.headless.feature_4.2.0.v202105172316-e2006.jar
18-May-2021 00:31:16 Transfer Time: .3 s - Transfer Rate: 55.9 KB/s
18-May-2021 00:31:17 Uploading /opt/bamboo-home/xml-data/build-dir/GRECLIPSE-E416-JOB1/Site-org.codehaus.groovy.eclipse/target/site/features/org.codehaus.groovy.jdt.patch_4.2.0.v202105172316-e2006.jar (9.3 KB) to s3://dist.springsource.org/snapshot/GRECLIPSE/e4.16/features/org.codehaus.groovy.jdt.patch_4.2.0.v202105172316-e2006.jar
18-May-2021 00:31:17 Transfer Time: .3 s - Transfer Rate: 36.7 KB/s
18-May-2021 00:31:17 Uploading /opt/bamboo-home/xml-data/build-dir/GRECLIPSE-E416-JOB1/Site-org.codehaus.groovy.eclipse/target/site/features/org.codehaus.groovy.m2eclipse.feature_4.2.0.v202105172316-e2006.jar (14.8 KB) to s3://dist.springsource.org/snapshot/GRECLIPSE/e4.16/features/org.codehaus.groovy.m2eclipse.feature_4.2.0.v202105172316-e2006.jar
18-May-2021 00:31:18 Transfer Time: .2 s - Transfer Rate: 63.4 KB/s
18-May-2021 00:31:18 Uploading /opt/bamboo-home/xml-data/build-dir/GRECLIPSE-E416-JOB1/Site-org.codehaus.groovy.eclipse/target/site/features/org.codehaus.groovy25.feature_4.2.0.v202105172316-e2006.jar (14.8 KB) to s3://dist.springsource.org/snapshot/GRECLIPSE/e4.16/features/org.codehaus.groovy25.feature_4.2.0.v202105172316-e2006.jar
18-May-2021 00:31:19 Transfer Time: .3 s - Transfer Rate: 58.2 KB/s
18-May-2021 00:31:19 Uploading /opt/bamboo-home/xml-data/build-dir/GRECLIPSE-E416-JOB1/Site-org.codehaus.groovy.eclipse/target/site/features/org.codehaus.groovy30.feature_4.2.0.v202105172316-e2006.jar (14.8 KB) to s3://dist.springsource.org/snapshot/GRECLIPSE/e4.16/features/org.codehaus.groovy30.feature_4.2.0.v202105172316-e2006.jar
18-May-2021 00:31:19 Transfer Time: .2 s - Transfer Rate: 59.4 KB/s
18-May-2021 00:31:20 Uploading /opt/bamboo-home/xml-data/build-dir/GRECLIPSE-E416-JOB1/Site-org.codehaus.groovy.eclipse/target/site/features/org.codehaus.groovy40.feature_4.2.0.v202105172316-e2006.jar (14.8 KB) to s3://dist.springsource.org/snapshot/GRECLIPSE/e4.16/features/org.codehaus.groovy40.feature_4.2.0.v202105172316-e2006.jar
18-May-2021 00:31:20 Transfer Time: .4 s - Transfer Rate: 41.2 KB/s
18-May-2021 00:31:21 Uploading /opt/bamboo-home/xml-data/build-dir/GRECLIPSE-E416-JOB1/Site-org.codehaus.groovy.eclipse/target/site/plugins/org.codehaus.groovy.eclipse.ant_4.2.0.v202105172316-e2006.jar (11.4 KB) to s3://dist.springsource.org/snapshot/GRECLIPSE/e4.16/plugins/org.codehaus.groovy.eclipse.ant_4.2.0.v202105172316-e2006.jar
18-May-2021 00:31:21 Transfer Time: .2 s - Transfer Rate: 48.4 KB/s
18-May-2021 00:31:21 Uploading /opt/bamboo-home/xml-data/build-dir/GRECLIPSE-E416-JOB1/Site-org.codehaus.groovy.eclipse/target/site/plugins/org.codehaus.groovy.eclipse.astviews_4.2.0.v202105172316-e2006.jar (53.3 KB) to s3://dist.springsource.org/snapshot/GRECLIPSE/e4.16/plugins/org.codehaus.groovy.eclipse.astviews_4.2.0.v202105172316-e2006.jar
18-May-2021 00:31:22 Transfer Time: .3 s - Transfer Rate: 157.2 KB/s
18-May-2021 00:31:22 Uploading /opt/bamboo-home/xml-data/build-dir/GRECLIPSE-E416-JOB1/Site-org.codehaus.groovy.eclipse/target/site/plugins/org.codehaus.groovy.eclipse.codeassist_4.2.0.v202105172316-e2006.jar (282.7 KB) to s3://dist.springsource.org/snapshot/GRECLIPSE/e4.16/plugins/org.codehaus.groovy.eclipse.codeassist_4.2.0.v202105172316-e2006.jar
18-May-2021 00:31:23 Transfer Time: .5 s - Transfer Rate: 578.1 KB/s
18-May-2021 00:31:23 Uploading /opt/bamboo-home/xml-data/build-dir/GRECLIPSE-E416-JOB1/Site-org.codehaus.groovy.eclipse/target/site/plugins/org.codehaus.groovy.eclipse.codebrowsing_4.2.0.v202105172316-e2006.jar (90.7 KB) to s3://dist.springsource.org/snapshot/GRECLIPSE/e4.16/plugins/org.codehaus.groovy.eclipse.codebrowsing_4.2.0.v202105172316-e2006.jar
18-May-2021 00:31:24 Transfer Time: .2 s - Transfer Rate: 377.7 KB/s
18-May-2021 00:31:25 Uploading /opt/bamboo-home/xml-data/build-dir/GRECLIPSE-E416-JOB1/Site-org.codehaus.groovy.eclipse/target/site/plugins/org.codehaus.groovy.eclipse.compilerResolver_4.2.0.v202105172316-e2006.jar (20.6 KB) to s3://dist.springsource.org/snapshot/GRECLIPSE/e4.16/plugins/org.codehaus.groovy.eclipse.compilerResolver_4.2.0.v202105172316-e2006.jar
18-May-2021 00:31:25 Transfer Time: .4 s - Transfer Rate: 48.0 KB/s
18-May-2021 00:31:26 Uploading /opt/bamboo-home/xml-data/build-dir/GRECLIPSE-E416-JOB1/Site-org.codehaus.groovy.eclipse/target/site/plugins/org.codehaus.groovy.eclipse.core_4.2.0.v202105172316-e2006.jar (80.8 KB) to s3://dist.springsource.org/snapshot/GRECLIPSE/e4.16/plugins/org.codehaus.groovy.eclipse.core_4.2.0.v202105172316-e2006.jar
18-May-2021 00:31:26 Transfer Time: .5 s - Transfer Rate: 178.9 KB/s
18-May-2021 00:31:27 Uploading /opt/bamboo-home/xml-data/build-dir/GRECLIPSE-E416-JOB1/Site-org.codehaus.groovy.eclipse/target/site/plugins/org.codehaus.groovy.eclipse.dsl_4.2.0.v202105172316-e2006.jar (396.6 KB) to s3://dist.springsource.org/snapshot/GRECLIPSE/e4.16/plugins/org.codehaus.groovy.eclipse.dsl_4.2.0.v202105172316-e2006.jar
18-May-2021 00:31:27 Transfer Time: .5 s - Transfer Rate: 725.0 KB/s
18-May-2021 00:31:28 Uploading /opt/bamboo-home/xml-data/build-dir/GRECLIPSE-E416-JOB1/Site-org.codehaus.groovy.eclipse/target/site/plugins/org.codehaus.groovy.eclipse.quickfix_4.2.0.v202105172316-e2006.jar (114.8 KB) to s3://dist.springsource.org/snapshot/GRECLIPSE/e4.16/plugins/org.codehaus.groovy.eclipse.quickfix_4.2.0.v202105172316-e2006.jar
18-May-2021 00:31:28 Transfer Time: .3 s - Transfer Rate: 393.3 KB/s
18-May-2021 00:31:29 Uploading /opt/bamboo-home/xml-data/build-dir/GRECLIPSE-E416-JOB1/Site-org.codehaus.groovy.eclipse/target/site/plugins/org.codehaus.groovy.eclipse.refactoring_4.2.0.v202105172316-e2006.jar (277.3 KB) to s3://dist.springsource.org/snapshot/GRECLIPSE/e4.16/plugins/org.codehaus.groovy.eclipse.refactoring_4.2.0.v202105172316-e2006.jar
18-May-2021 00:31:29 Transfer Time: .3 s - Transfer Rate: 808.3 KB/s
18-May-2021 00:31:30 Uploading /opt/bamboo-home/xml-data/build-dir/GRECLIPSE-E416-JOB1/Site-org.codehaus.groovy.eclipse/target/site/plugins/org.codehaus.groovy.eclipse.ui_4.2.0.v202105172316-e2006.jar (549.7 KB) to s3://dist.springsource.org/snapshot/GRECLIPSE/e4.16/plugins/org.codehaus.groovy.eclipse.ui_4.2.0.v202105172316-e2006.jar
18-May-2021 00:31:30 Transfer Time: .4 s - Transfer Rate: 1.5 MB/s
18-May-2021 00:31:31 Uploading /opt/bamboo-home/xml-data/build-dir/GRECLIPSE-E416-JOB1/Site-org.codehaus.groovy.eclipse/target/site/plugins/org.codehaus.groovy.eclipse_4.2.0.v202105172316-e2006.jar (16.6 KB) to s3://dist.springsource.org/snapshot/GRECLIPSE/e4.16/plugins/org.codehaus.groovy.eclipse_4.2.0.v202105172316-e2006.jar
18-May-2021 00:31:31 Transfer Time: .3 s - Transfer Rate: 54.9 KB/s
18-May-2021 00:31:32 Uploading /opt/bamboo-home/xml-data/build-dir/GRECLIPSE-E416-JOB1/Site-org.codehaus.groovy.eclipse/target/site/plugins/org.codehaus.groovy.m2eclipse_4.2.0.v202105172316-e2006.jar (18.5 KB) to s3://dist.springsource.org/snapshot/GRECLIPSE/e4.16/plugins/org.codehaus.groovy.m2eclipse_4.2.0.v202105172316-e2006.jar
18-May-2021 00:31:32 Transfer Time: .3 s - Transfer Rate: 60.8 KB/s
18-May-2021 00:31:33 Uploading /opt/bamboo-home/xml-data/build-dir/GRECLIPSE-E416-JOB1/Site-org.codehaus.groovy.eclipse/target/site/plugins/org.codehaus.groovy_2.5.14.v202105172316-e2006.jar (19.4 MB) to s3://dist.springsource.org/snapshot/GRECLIPSE/e4.16/plugins/org.codehaus.groovy_2.5.14.v202105172316-e2006.jar
18-May-2021 00:31:34 Transfer Time: 1.2 s - Transfer Rate: 16.6 MB/s
18-May-2021 00:31:34 Uploading /opt/bamboo-home/xml-data/build-dir/GRECLIPSE-E416-JOB1/Site-org.codehaus.groovy.eclipse/target/site/plugins/org.codehaus.groovy_3.0.8.v202105172316-e2006.jar (18.1 MB) to s3://dist.springsource.org/snapshot/GRECLIPSE/e4.16/plugins/org.codehaus.groovy_3.0.8.v202105172316-e2006.jar
18-May-2021 00:31:35 Transfer Time: .9 s - Transfer Rate: 19.8 MB/s
18-May-2021 00:31:36 Uploading /opt/bamboo-home/xml-data/build-dir/GRECLIPSE-E416-JOB1/Site-org.codehaus.groovy.eclipse/target/site/plugins/org.codehaus.groovy_4.0.0.v202105172316-e2006.jar (16.4 MB) to s3://dist.springsource.org/snapshot/GRECLIPSE/e4.16/plugins/org.codehaus.groovy_4.0.0.v202105172316-e2006.jar
18-May-2021 00:31:37 Transfer Time: .9 s - Transfer Rate: 17.7 MB/s
18-May-2021 00:31:38 Uploading /opt/bamboo-home/xml-data/build-dir/GRECLIPSE-E416-JOB1/Site-org.codehaus.groovy.eclipse/target/site/plugins/org.eclipse.jdt.core_3.22.0.v202105172316-e2006.jar (6.9 MB) to s3://dist.springsource.org/snapshot/GRECLIPSE/e4.16/plugins/org.eclipse.jdt.core_3.22.0.v202105172316-e2006.jar
18-May-2021 00:31:38 Transfer Time: .5 s - Transfer Rate: 14.4 MB/s
18-May-2021 00:31:39 Uploading /opt/bamboo-home/xml-data/build-dir/GRECLIPSE-E416-JOB1/Site-org.codehaus.groovy.eclipse/target/site/plugins/org.eclipse.jdt.groovy.core_4.2.0.v202105172316-e2006.jar (485.1 KB) to s3://dist.springsource.org/snapshot/GRECLIPSE/e4.16/plugins/org.eclipse.jdt.groovy.core_4.2.0.v202105172316-e2006.jar
18-May-2021 00:31:39 Transfer Time: .3 s - Transfer Rate: 1.5 MB/s
18-May-2021 00:31:39 Uploading /opt/bamboo-home/xml-data/build-dir/GRECLIPSE-E416-JOB1/Site-org.codehaus.groovy.eclipse/target/site/site.xml (2.8 KB) to s3://dist.springsource.org/snapshot/GRECLIPSE/e4.16/site.xml
18-May-2021 00:31:40 Transfer Time: .3 s - Transfer Rate: 9.8 KB/s
18-May-2021 00:31:40 Uploading /opt/bamboo-home/xml-data/build-dir/GRECLIPSE-E416-JOB1/Site-org.codehaus.groovy.eclipse/target/org.codehaus.groovy-4.2.0.v202105172316-e2006-updatesite.zip (62.8 MB) to s3://dist.springsource.org/snapshot/GRECLIPSE/e4.16/org.codehaus.groovy-4.2.0.v202105172316-e2006-updatesite.zip
18-May-2021 00:31:48 Transfer Time: 7.5 s - Transfer Rate: 8.3 MB/s
18-May-2021 00:31:48 Uploading /opt/bamboo-home/xml-data/build-dir/GRECLIPSE-E416-JOB1/Site-org.codehaus.groovy.eclipse/target/org.codehaus.groovy-4.2.0.v202105172316-e2006-updatesite.zip.md5 (.0 KB) to s3://dist.springsource.org/snapshot/GRECLIPSE/e4.16/org.codehaus.groovy-4.2.0.v202105172316-e2006-updatesite.zip.md5
18-May-2021 00:31:48 Transfer Time: .3 s - Transfer Rate: .1 KB/s
18-May-2021 00:31:49 Uploading /opt/bamboo-home/xml-data/build-dir/GRECLIPSE-E416-JOB1/Site-org.codehaus.groovy.eclipse/target/org.codehaus.groovy-4.2.0.v202105172316-e2006-updatesite.zip.sha1 (.0 KB) to s3://dist.springsource.org/snapshot/GRECLIPSE/e4.16/org.codehaus.groovy-4.2.0.v202105172316-e2006-updatesite.zip.sha1
18-May-2021 00:31:49 Transfer Time: .3 s - Transfer Rate: .1 KB/s
18-May-2021 00:31:49 [INFO] Executed tasks
18-May-2021 00:31:49 [INFO] ------------------------------------------------------------------------
18-May-2021 00:31:49 [INFO] Reactor Summary:
18-May-2021 00:31:49 [INFO]
18-May-2021 00:31:49 [INFO] org.codehaus.groovy.eclipse.parent 4.2.0-SNAPSHOT .. SUCCESS [  0.219 s]
18-May-2021 00:31:49 [INFO] org.codehaus.groovy 2.5.14-SNAPSHOT ................ SUCCESS [  8.116 s]
18-May-2021 00:31:49 [INFO] org.codehaus.groovy 3.0.8-SNAPSHOT ................. SUCCESS [  5.977 s]
18-May-2021 00:31:49 [INFO] org.codehaus.groovy 4.0.0-SNAPSHOT ................. SUCCESS [  4.673 s]
18-May-2021 00:31:49 [INFO] org.codehaus.groovy.eclipse.compilerResolver ....... SUCCESS [  1.760 s]
18-May-2021 00:31:49 [INFO] org.eclipse.jdt.core 3.22.0-SNAPSHOT ............... SUCCESS [ 12.730 s]
18-May-2021 00:31:49 [INFO] org.eclipse.jdt.groovy.core ........................ SUCCESS [  2.136 s]
18-May-2021 00:31:49 [INFO] org.codehaus.groovy.eclipse ........................ SUCCESS [  0.562 s]
18-May-2021 00:31:49 [INFO] org.codehaus.groovy.eclipse.core ................... SUCCESS [  1.538 s]
18-May-2021 00:31:49 [INFO] org.codehaus.groovy.eclipse.ant .................... SUCCESS [  1.426 s]
18-May-2021 00:31:49 [INFO] org.codehaus.groovy.eclipse.codebrowsing ........... SUCCESS [  1.352 s]
18-May-2021 00:31:49 [INFO] org.codehaus.groovy.eclipse.refactoring ............ SUCCESS [  1.696 s]
18-May-2021 00:31:49 [INFO] org.codehaus.groovy.eclipse.ui ..................... SUCCESS [  2.096 s]
18-May-2021 00:31:49 [INFO] org.codehaus.groovy.eclipse.astviews ............... SUCCESS [  1.563 s]
18-May-2021 00:31:49 [INFO] org.codehaus.groovy.eclipse.codeassist ............. SUCCESS [  1.967 s]
18-May-2021 00:31:49 [INFO] org.codehaus.groovy.eclipse.dsl .................... SUCCESS [  2.023 s]
18-May-2021 00:31:49 [INFO] org.codehaus.groovy.eclipse.quickfix ............... SUCCESS [  1.758 s]
18-May-2021 00:31:49 [INFO] org.codehaus.groovy25.feature ...................... SUCCESS [  0.752 s]
18-May-2021 00:31:49 [INFO] org.codehaus.groovy30.feature ...................... SUCCESS [  0.702 s]
18-May-2021 00:31:49 [INFO] org.codehaus.groovy40.feature ...................... SUCCESS [  0.636 s]
18-May-2021 00:31:49 [INFO] org.codehaus.groovy.jdt.patch ...................... SUCCESS [  0.681 s]
18-May-2021 00:31:49 [INFO] org.codehaus.groovy.headless.feature ............... SUCCESS [  0.717 s]
18-May-2021 00:31:49 [INFO] org.codehaus.groovy.compilerless.feature ........... SUCCESS [  0.809 s]
18-May-2021 00:31:49 [INFO] org.codehaus.groovy.eclipse.feature ................ SUCCESS [  0.664 s]
18-May-2021 00:31:49 [INFO] org.eclipse.jdt.core.tests.compiler 3.12.1200-SNAPSHOT SUCCESS [  5.151 s]
18-May-2021 00:31:49 [INFO] org.eclipse.jdt.core.tests.builder 3.10.900-SNAPSHOT SUCCESS [  1.495 s]
18-May-2021 00:31:49 [INFO] org.eclipse.jdt.groovy.core.tests.compiler ......... SUCCESS [  1.330 s]
18-May-2021 00:31:49 [INFO] org.eclipse.jdt.groovy.core.tests.builder .......... SUCCESS [  1.623 s]
18-May-2021 00:31:49 [INFO] org.codehaus.groovy.eclipse.tests .................. SUCCESS [  2.872 s]
18-May-2021 00:31:49 [INFO] org.codehaus.groovy.eclipse.codeassist.test ........ SUCCESS [  2.277 s]
18-May-2021 00:31:49 [INFO] org.codehaus.groovy.eclipse.codebrowsing.test ...... SUCCESS [  1.877 s]
18-May-2021 00:31:49 [INFO] org.codehaus.groovy.eclipse.core.test .............. SUCCESS [  1.548 s]
18-May-2021 00:31:49 [INFO] org.codehaus.groovy.eclipse.dsl.tests .............. SUCCESS [  2.038 s]
18-May-2021 00:31:49 [INFO] org.codehaus.groovy.eclipse.junit.test ............. SUCCESS [  1.391 s]
18-May-2021 00:31:49 [INFO] org.codehaus.groovy.eclipse.refactoring.test ....... SUCCESS [  2.439 s]
18-May-2021 00:31:49 [INFO] org.codehaus.groovy.eclipse.quickfix.test .......... SUCCESS [  1.694 s]
18-May-2021 00:31:49 [INFO] org.codehaus.groovy.alltests ....................... SUCCESS [  01:12 h]
18-May-2021 00:31:49 [INFO] org.codehaus.groovy.m2eclipse ...................... SUCCESS [  1.244 s]
18-May-2021 00:31:49 [INFO] org.codehaus.groovy.m2eclipse.feature .............. SUCCESS [  0.654 s]
18-May-2021 00:31:49 [INFO] org.codehaus.groovy.eclipse.site 4.2.0-SNAPSHOT .... SUCCESS [ 50.407 s]
18-May-2021 00:31:49 [INFO] ------------------------------------------------------------------------
18-May-2021 00:31:49 [INFO] BUILD SUCCESS
18-May-2021 00:31:49 [INFO] ------------------------------------------------------------------------
18-May-2021 00:31:49 [INFO] Total time: 01:14 h
18-May-2021 00:31:49 [INFO] Finished at: 2021-05-18T00:31:49Z
18-May-2021 00:31:49 [INFO] ------------------------------------------------------------------------
18-May-2021 00:31:49 [WARNING] The requested profile "snapshot" could not be activated because it does not exist.
18-May-2021 00:31:50 Parsing test results under /opt/bamboo-home/xml-data/build-dir/GRECLIPSE-E416-JOB1...
18-May-2021 00:31:50 Failing task since 2 failing test cases were found.
18-May-2021 00:31:50 Finished task 'Maven 3.x' with result: Failed
18-May-2021 00:31:50 Running post build plugin 'Docker Container Cleanup'
18-May-2021 00:31:50 Running post build plugin 'NCover Results Collector'
18-May-2021 00:31:50 Running post build plugin 'Artifactory Release Management Staging'
18-May-2021 00:31:50 Running post build plugin 'Artifactory Build Info Copier'
18-May-2021 00:31:50 Running post build plugin 'Artifactory Gradle Properties Info Copier'
18-May-2021 00:31:50 Running post build plugin 'Clover Results Collector'
18-May-2021 00:31:50 Running post build plugin 'npm Cache Cleanup'
18-May-2021 00:31:50 Running post build plugin 'Artifact Copier'
18-May-2021 00:31:50 Publishing an artifact: Zipped Update Site
18-May-2021 00:31:50 Unable to publish artifact [Zipped Update Site]:
18-May-2021 00:31:50 The artifact hasn't been successfully published after 8.843 ms
18-May-2021 00:31:50 Publishing an artifact: surefire-reports
18-May-2021 00:31:51 Unable to publish artifact [surefire-reports]:
18-May-2021 00:31:51 The artifact hasn't been successfully published after 951.7 ms
18-May-2021 00:31:52 Successfully removed working directory at '/opt/bamboo-home/xml-data/build-dir/GRECLIPSE-E416-JOB1'
18-May-2021 00:31:52 Finalising the build...
18-May-2021 00:31:52 Stopping timer.
18-May-2021 00:31:52 Build GRECLIPSE-E416-JOB1-345 completed.
18-May-2021 00:31:55 Running on server: post build plugin 'NCover Results Collector'
18-May-2021 00:31:55 Running on server: post build plugin 'Build Hanging Detection Configuration'
18-May-2021 00:31:55 Running on server: post build plugin 'Bamboo project link creator'
18-May-2021 00:31:55 Running on server: post build plugin 'Clover Delta Calculator'
18-May-2021 00:31:55 Running on server: post build plugin 'Maven Dependencies Postprocessor'
18-May-2021 00:31:55 All post build plugins have finished
18-May-2021 00:31:55 Generating build results summary...
18-May-2021 00:31:55 Saving build results to disk...
18-May-2021 00:31:55 Logging substituted variables...
18-May-2021 00:31:55 Indexing build results...
18-May-2021 00:31:55 Finished building GRECLIPSE-E416-JOB1-345.