Build: #345 failed

Job: Default Job failed

Stages & jobs

  1. Default Stage

Test results

  • 6,102 tests in total
  • 2 tests failed
  • 2 failures are new
  • 98 tests were quarantined / skipped
  • 69 minutes taken in total.

Build 345 has the following 2 errors: 2 new failure(s) occurred since the previous build.

New test failures 2
Status Test Duration
Collapse Failed BasicGroovyBuildTests testBuildJavaHelloWorld History
< 1 sec
org.junit.internal.ArrayComparisonFailure: array lengths differed, expected.length=1 actual.length=2; arrays first differed at element [1]; expected:<end of array> but was:<p1.Hello>
	at org.eclipse.jdt.core.groovy.tests.builder.BasicGroovyBuildTests.testBuildJavaHelloWorld(BasicGroovyBuildTests.java:205)
Caused by: java.lang.AssertionError: expected:<end of array> but was:<p1.Hello>
	at org.eclipse.jdt.core.groovy.tests.builder.BasicGroovyBuildTests.testBuildJavaHelloWorld(BasicGroovyBuildTests.java:205)
Collapse Failed SpockInferencingTests testGetterCheck History
< 1 sec
java.lang.AssertionError: Expected type not found.
Expected: java.lang.Integer
Found: java.lang.Object
Declaring type: foo.Bar
ASTNode: [email protected][getBaz]
Confidence: UNKNOWN

java.lang.AssertionError: 
(8 more lines...)