Build: #8 failed Changes by Eric Milles

Build result summary

Details

Completed
Duration
138 minutes
Labels
None
Agent
bamboo-13.af.pivotal.io
Revision
2f7788a0ad6eac1ddd081aa69fa85eb45985c47b 2f7788a0ad6eac1ddd081aa69fa85eb45985c47b
Total tests
8855
Fixed in
#10 (Code changes detected)

Tests

Responsible

Code commits

Author Commit Message Commit date
Eric Milles Eric Milles 2f7788a0ad6eac1ddd081aa69fa85eb45985c47b 2f7788a0ad6eac1ddd081aa69fa85eb45985c47b minor fix-ups

Tests

New test failures 5
Status Test View job Duration
Collapse Failed SyntheticMemberSearchTests testSearchInJava4 History
Default Job 1 sec
java.lang.AssertionError: Wrong number of matches found in:
. Expression: (matches.size() == expected). Values: expected = 1
java.lang.AssertionError: 
Wrong number of matches found in:
. Expression: (matches.size() == expected). Values: expected = 1
	at org.codehaus.groovy.eclipse.core.test.SyntheticMemberSearchTests.assertCount(SyntheticMemberSearchTests.groovy:275)
	at org.codehaus.groovy.eclipse.core.test.SyntheticMemberSearchTests.testSearchInJava4(SyntheticMemberSearchTests.groovy:228)
Collapse Failed SyntheticMemberSearchTests testSearchInJava3 History
Default Job 1 sec
java.lang.AssertionError: Wrong number of matches found in:
. Expression: (matches.size() == expected). Values: expected = 1
java.lang.AssertionError: 
Wrong number of matches found in:
. Expression: (matches.size() == expected). Values: expected = 1
	at org.codehaus.groovy.eclipse.core.test.SyntheticMemberSearchTests.assertCount(SyntheticMemberSearchTests.groovy:275)
	at org.codehaus.groovy.eclipse.core.test.SyntheticMemberSearchTests.testSearchInJava3(SyntheticMemberSearchTests.groovy:206)
Collapse Failed SyntheticMemberSearchTests testSearchInGroovy1 History
Default Job 1 sec
java.lang.AssertionError: Wrong number of matches found in:
. Expression: (matches.size() == expected). Values: expected = 3
java.lang.AssertionError: 
Wrong number of matches found in:
. Expression: (matches.size() == expected). Values: expected = 3
	at org.codehaus.groovy.eclipse.core.test.SyntheticMemberSearchTests.assertCount(SyntheticMemberSearchTests.groovy:275)
	at org.codehaus.groovy.eclipse.core.test.SyntheticMemberSearchTests.testSearchInGroovy1(SyntheticMemberSearchTests.groovy:63)
Collapse Failed SyntheticMemberSearchTests testSearchInJava2 History
Default Job 1 sec
java.lang.AssertionError: Wrong number of matches found in:
. Expression: (matches.size() == expected). Values: expected = 1
java.lang.AssertionError: 
Wrong number of matches found in:
. Expression: (matches.size() == expected). Values: expected = 1
	at org.codehaus.groovy.eclipse.core.test.SyntheticMemberSearchTests.assertCount(SyntheticMemberSearchTests.groovy:275)
	at org.codehaus.groovy.eclipse.core.test.SyntheticMemberSearchTests.testSearchInJava2(SyntheticMemberSearchTests.groovy:184)
Collapse Failed SyntheticMemberSearchTests testSearchInJava1 History
Default Job 5 secs
java.lang.AssertionError: Wrong number of matches found in:
. Expression: (matches.size() == expected). Values: expected = 3
java.lang.AssertionError: 
Wrong number of matches found in:
. Expression: (matches.size() == expected). Values: expected = 3
	at org.codehaus.groovy.eclipse.core.test.SyntheticMemberSearchTests.assertCount(SyntheticMemberSearchTests.groovy:275)
	at org.codehaus.groovy.eclipse.core.test.SyntheticMemberSearchTests.testSearchInJava1(SyntheticMemberSearchTests.groovy:162)