Build: #24 failed Changes by Eric Milles

Logs

The following logs have been generated by the jobs in this plan.
  • Expand all
  • Collapse all
Job Logs
Collapse Default Job Default Stage Download or View
04-May-2021 01:53:53 [INFO] org.codehaus.groovy.eclipse.refactoring.test ....... SUCCESS [  2.965 s]
04-May-2021 01:53:53 [INFO] org.codehaus.groovy.eclipse.quickfix.test .......... SUCCESS [  2.126 s]
04-May-2021 01:53:53 [INFO] org.codehaus.groovy.alltests ....................... FAILURE [  02:31 h]
04-May-2021 01:53:53 [INFO] org.codehaus.groovy.m2eclipse ...................... SKIPPED
04-May-2021 01:53:53 [INFO] org.codehaus.groovy.m2eclipse.feature .............. SKIPPED
04-May-2021 01:53:53 [INFO] org.codehaus.groovy.eclipse.site 4.2.0-SNAPSHOT .... SKIPPED
04-May-2021 01:53:53 [INFO] ------------------------------------------------------------------------
04-May-2021 01:53:53 [INFO] BUILD FAILURE
04-May-2021 01:53:53 [INFO] ------------------------------------------------------------------------
04-May-2021 01:53:53 [INFO] Total time: 02:35 h
04-May-2021 01:53:53 [INFO] Finished at: 2021-05-04T01:53:53Z
04-May-2021 01:53:53 [INFO] ------------------------------------------------------------------------
04-May-2021 01:53:53 [WARNING] The requested profile "snapshot" could not be activated because it does not exist.
04-May-2021 01:53:53 [ERROR] Failed to execute goal org.eclipse.tycho:tycho-surefire-plugin:2.3.0:test (default-test) on project org.codehaus.groovy.alltests: An unexpected error occurred while launching the test runtime (process returned error code 143(SIGTERM received?)). The process logfile /opt/bamboo-home/xml-data/build-dir/GRECLIPSE-E420-JOB1/ide-test/org.codehaus.groovy.alltests/target/work/data/.metadata/.log might contain further details. Command-line used to launch the sub-process was null -Dosgi.noShutdown=false -Dosgi.os=linux -Dosgi.ws=gtk -Dosgi.arch=x86_64 -Xmx1G -XX:-OmitStackTraceInFastThrow -Dosgi.clean=true -jar /opt/users/bamboo/.m2/repository/p2/osgi/bundle/org.eclipse.equinox.launcher/1.6.100.v20201223-0822/org.eclipse.equinox.launcher-1.6.100.v20201223-0822.jar -debug -consolelog -data /opt/bamboo-home/xml-data/build-dir/GRECLIPSE-E420-JOB1/ide-test/org.codehaus.groovy.alltests/target/work/data -install /opt/bamboo-home/xml-data/build-dir/GRECLIPSE-E420-JOB1/ide-test/org.codehaus.groovy.alltests/target/work -configuration /opt/bamboo-home/xml-data/build-dir/GRECLIPSE-E420-JOB1/ide-test/org.codehaus.groovy.alltests/target/work/configuration -application org.eclipse.tycho.surefire.osgibooter.uitest -testproperties /opt/bamboo-home/xml-data/build-dir/GRECLIPSE-E420-JOB1/ide-test/org.codehaus.groovy.alltests/target/surefire.properties in working directory /opt/bamboo-home/xml-data/build-dir/GRECLIPSE-E420-JOB1/ide-test/org.codehaus.groovy.alltests -> [Help 1]
04-May-2021 01:53:53 [ERROR]
04-May-2021 01:53:53 [ERROR] To see the full stack trace of the errors, re-run Maven with the -e switch.
04-May-2021 01:53:53 [ERROR] Re-run Maven using the -X switch to enable full debug logging.
04-May-2021 01:53:53 [ERROR]
04-May-2021 01:53:53 [ERROR] For more information about the errors and possible solutions, please read the following articles:
04-May-2021 01:53:53 [ERROR] [Help 1] http://cwiki.apache.org/confluence/display/MAVEN/MojoFailureException
04-May-2021 01:53:53 [ERROR]
04-May-2021 01:53:53 [ERROR] After correcting the problems, you can resume the build with the command
04-May-2021 01:53:53 [ERROR]   mvn <goals> -rf :org.codehaus.groovy.alltests
04-May-2021 01:53:56 Unable to publish artifact [surefire-reports]:
04-May-2021 01:53:56 Unable to publish artifact [Zipped Update Site]: the source directory /opt/bamboo-home/xml-data/build-dir/GRECLIPSE-E420-JOB1/Site-org.codehaus.groovy.eclipse/target/site does not exist.