Build: #24 failed

Job: Default Job failed

Stages & jobs

  1. Default Stage

Build log

The build generated 48,767 lines of output.The output is too long and has been truncated to the last 1,000 lines. Download or view full build log

04-May-2021 00:02:29 ----------------------------------------
04-May-2021 00:02:29 Starting: testAddImportInDollarSlashyGString1
04-May-2021 00:02:30 ----------------------------------------
04-May-2021 00:02:30 Starting: testAddImportOnForInLoopParams1
04-May-2021 00:02:31 ----------------------------------------
04-May-2021 00:02:31 Starting: testAddImportOnLocalVariableAnnotation
04-May-2021 00:02:33 ----------------------------------------
04-May-2021 00:02:33 Starting: testTryAddUnresolvedType
04-May-2021 00:02:34 ----------------------------------------
04-May-2021 00:02:34 Starting: testAddImportOnUnqualifiedAnnotation1
04-May-2021 00:02:35 ----------------------------------------
04-May-2021 00:02:35 Starting: testAddImportOnUnqualifiedAnnotation2
04-May-2021 00:02:36 ----------------------------------------
04-May-2021 00:02:36 Starting: testAddImportOnMethodReturnTypeGenerics
04-May-2021 00:02:37 ----------------------------------------
04-May-2021 00:02:37 Starting: testAddImportOnForEachLoopParams1a
04-May-2021 00:02:38 ----------------------------------------
04-May-2021 00:02:38 Starting: testAddImportOnClosureParams1a
04-May-2021 00:02:39 ----------------------------------------
04-May-2021 00:02:39 Starting: testAddImportOnClosureParams2a
04-May-2021 00:02:40 ----------------------------------------
04-May-2021 00:02:40 Starting: testAddImportOnConstructorParamGenerics
04-May-2021 00:02:41 TypeInferencingVisitorWithRequestor.findMethodNode: no match found for C(QList<Qjava.util.regex.Pattern;>;)
04-May-2021 00:02:42 ----------------------------------------
04-May-2021 00:02:42 Starting: testAddImportOnConstructorBody
04-May-2021 00:02:43 ----------------------------------------
04-May-2021 00:02:43 Starting: testAddImportOnForEachLoopParams1
04-May-2021 00:02:44 Resetting 'org.eclipse.jdt.ui.typefilter.enabled' to its default
04-May-2021 00:02:44 Resetting 'org.eclipse.jdt.ui.importorder' to its default
04-May-2021 00:02:44 Resetting 'markOccurrences' to its default
04-May-2021 00:02:44 Waiting for: Cleaning/Rebuilding Project: TestProject
04-May-2021 00:02:44 ----------------------------------------
04-May-2021 00:02:44 Starting: testRemoveInnerTypeAlias1
04-May-2021 00:02:44 ----------------------------------------
04-May-2021 00:02:44 Starting: testRetainTypeAlias1
04-May-2021 00:02:44 ----------------------------------------
04-May-2021 00:02:44 Starting: testRetainTypeAlias2
04-May-2021 00:02:44 ----------------------------------------
04-May-2021 00:02:44 Starting: testRetainTypeAlias3
04-May-2021 00:02:44 ----------------------------------------
04-May-2021 00:02:44 Starting: testRetainTypeAlias4
04-May-2021 00:02:44 ----------------------------------------
04-May-2021 00:02:44 Starting: testRetainTypeAlias5
04-May-2021 00:02:45 ----------------------------------------
04-May-2021 00:02:45 Starting: testRetainTypeAlias6
04-May-2021 00:02:45 ----------------------------------------
04-May-2021 00:02:45 Starting: testRetainTypeAlias7
04-May-2021 00:02:45 ----------------------------------------
04-May-2021 00:02:45 Starting: testRetainTypeAlias8
04-May-2021 00:02:45 ----------------------------------------
04-May-2021 00:02:45 Starting: testRemoveTypeAlias1
04-May-2021 00:02:45 ----------------------------------------
04-May-2021 00:02:45 Starting: testRemoveTypeAlias2
04-May-2021 00:02:45 ----------------------------------------
04-May-2021 00:02:45 Starting: testRetainStaticAlias1
04-May-2021 00:02:45 ----------------------------------------
04-May-2021 00:02:45 Starting: testRetainStaticAlias2
04-May-2021 00:02:45 ----------------------------------------
04-May-2021 00:02:45 Starting: testRetainStaticAlias3
04-May-2021 00:02:45 ----------------------------------------
04-May-2021 00:02:45 Starting: testRetainStaticAlias4
04-May-2021 00:02:45 ----------------------------------------
04-May-2021 00:02:45 Starting: testRetainStaticAlias5
04-May-2021 00:02:45 ----------------------------------------
04-May-2021 00:02:45 Starting: testRetainStaticAlias6
04-May-2021 00:02:45 ----------------------------------------
04-May-2021 00:02:45 Starting: testRetainStaticAlias7
04-May-2021 00:02:45 ----------------------------------------
04-May-2021 00:02:45 Starting: testRetainStaticAlias8
04-May-2021 00:02:45 ----------------------------------------
04-May-2021 00:02:45 Starting: testRetainStaticAlias9
04-May-2021 00:02:45 ----------------------------------------
04-May-2021 00:02:45 Starting: testMultiAliasing1
04-May-2021 00:02:45 ----------------------------------------
04-May-2021 00:02:45 Starting: testMultiAliasing2
04-May-2021 00:02:45 ----------------------------------------
04-May-2021 00:02:45 Starting: testMultiAliasing3
04-May-2021 00:02:45 ----------------------------------------
04-May-2021 00:02:45 Starting: testMultiAliasing4
04-May-2021 00:02:45 ----------------------------------------
04-May-2021 00:02:45 Starting: testMultiAliasing5
04-May-2021 00:02:46 ----------------------------------------
04-May-2021 00:02:46 Starting: testRetainAnnotatedStaticAlias1
04-May-2021 00:02:51 ----------------------------------------
04-May-2021 00:02:51 Starting: testRetainAnnotatedStaticAlias2
04-May-2021 00:02:51 ----------------------------------------
04-May-2021 00:02:51 Starting: testRetainStaticAlias10
04-May-2021 00:02:51 ----------------------------------------
04-May-2021 00:02:51 Starting: testRetainStaticAlias11
04-May-2021 00:02:51 ----------------------------------------
04-May-2021 00:02:51 Starting: testRetainStaticAlias12
04-May-2021 00:02:51 ----------------------------------------
04-May-2021 00:02:51 Starting: testRetainStaticAlias13
04-May-2021 00:02:51 ----------------------------------------
04-May-2021 00:02:51 Starting: testRetainStaticAlias14
04-May-2021 00:02:51 ----------------------------------------
04-May-2021 00:02:51 Starting: testRetainStaticAlias15
04-May-2021 00:02:51 ----------------------------------------
04-May-2021 00:02:51 Starting: testRetainStaticAlias1a
04-May-2021 00:02:51 ----------------------------------------
04-May-2021 00:02:51 Starting: testRetainStaticAlias2a
04-May-2021 00:02:52 ----------------------------------------
04-May-2021 00:02:52 Starting: testRetainStaticAlias6a
04-May-2021 00:02:52 ----------------------------------------
04-May-2021 00:02:52 Starting: testRetainStaticAlias6b
04-May-2021 00:02:52 ----------------------------------------
04-May-2021 00:02:52 Starting: testRetainStaticAlias6c
04-May-2021 00:02:52 ----------------------------------------
04-May-2021 00:02:52 Starting: testOrganizeWithExtraImports1
04-May-2021 00:02:52 May 04, 2021 12:02:52 AM groovy.util.FactoryBuilderSupport createNode
04-May-2021 00:02:52 WARNING: Could not find match for name 'alias'
04-May-2021 00:02:52 May 04, 2021 12:02:52 AM groovy.util.FactoryBuilderSupport createNode
04-May-2021 00:02:52 WARNING: Could not find match for name 'alias'
04-May-2021 00:02:52 ----------------------------------------
04-May-2021 00:02:52 Starting: testOrganizeWithExtraImports2
04-May-2021 00:02:52 May 04, 2021 12:02:52 AM groovy.util.FactoryBuilderSupport createNode
04-May-2021 00:02:52 WARNING: Could not find match for name 'staticMember'
04-May-2021 00:02:52 May 04, 2021 12:02:52 AM groovy.util.FactoryBuilderSupport createNode
04-May-2021 00:02:52 WARNING: Could not find match for name 'staticMember'
04-May-2021 00:02:52 May 04, 2021 12:02:52 AM groovy.util.FactoryBuilderSupport createNode
04-May-2021 00:02:52 WARNING: Could not find match for name 'staticMember'
04-May-2021 00:02:52 May 04, 2021 12:02:52 AM groovy.util.FactoryBuilderSupport createNode
04-May-2021 00:02:52 WARNING: Could not find match for name 'staticMember'
04-May-2021 00:02:52 ----------------------------------------
04-May-2021 00:02:52 Starting: testNoSpuriousEdits
04-May-2021 00:02:52 ----------------------------------------
04-May-2021 00:02:52 Starting: testRetainTypeAlias6a
04-May-2021 00:02:52 ----------------------------------------
04-May-2021 00:02:52 Starting: testRetainTypeAlias6b
04-May-2021 00:02:52 ----------------------------------------
04-May-2021 00:02:52 Starting: testRetainTypeAlias6c
04-May-2021 00:02:52 ----------------------------------------
04-May-2021 00:02:52 Starting: testRetainTypeAlias7a
04-May-2021 00:02:52 ----------------------------------------
04-May-2021 00:02:52 Starting: testRetainTypeAlias7b
04-May-2021 00:02:52 ----------------------------------------
04-May-2021 00:02:52 Starting: testRetainTypeAlias8a
04-May-2021 00:02:52 ----------------------------------------
04-May-2021 00:02:52 Starting: testRetainInnerTypeAlias1
04-May-2021 00:02:52 ----------------------------------------
04-May-2021 00:02:52 Starting: testRetainInnerTypeAlias2
04-May-2021 00:02:52 ----------------------------------------
04-May-2021 00:02:52 Starting: testRemoveStaticAlias1
04-May-2021 00:02:52 ----------------------------------------
04-May-2021 00:02:52 Starting: testRemoveStaticAlias2
04-May-2021 00:02:53 ----------------------------------------
04-May-2021 00:02:53 Starting: testRemoveStaticAlias3
04-May-2021 00:02:53 ----------------------------------------
04-May-2021 00:02:53 Starting: testRemoveStaticAlias4
04-May-2021 00:02:53 Resetting 'org.eclipse.jdt.ui.importorder' to its default
04-May-2021 00:02:54 Waiting for: Cleaning/Rebuilding Project: TestProject
04-May-2021 00:02:54 Waiting for: Java indexing... 7 files to index (/TestProject)
04-May-2021 00:02:55 ----------------------------------------
04-May-2021 00:02:55 Starting: testRenameToGroovy
04-May-2021 00:02:55 ----------------------------------------
04-May-2021 00:02:55 Starting: testRenameToJava
04-May-2021 00:02:55 ----------------------------------------
04-May-2021 00:02:55 Starting: testRenameToGroovyAndBack
04-May-2021 00:02:56 ----------------------------------------
04-May-2021 00:02:56 Starting: testRenameToJavaAndBack
04-May-2021 00:02:57 Waiting for: Cleaning/Rebuilding Project: TestProject
04-May-2021 00:02:58 ----------------------------------------
04-May-2021 00:02:58 Starting: testGetterToProperty1
04-May-2021 00:02:59 ----------------------------------------
04-May-2021 00:02:59 Starting: testGetterToProperty2
04-May-2021 00:03:00 ----------------------------------------
04-May-2021 00:03:00 Starting: testGetterToProperty3
04-May-2021 00:03:01 ----------------------------------------
04-May-2021 00:03:01 Starting: testSpaceBeforeAssignmentPreference
04-May-2021 00:03:02 ----------------------------------------
04-May-2021 00:03:02 Starting: testIsserToProperty1
04-May-2021 00:03:03 ----------------------------------------
04-May-2021 00:03:03 Starting: testStaticIsserToProperty
04-May-2021 00:03:05 ----------------------------------------
04-May-2021 00:03:05 Starting: testImplicitGetterToProperty
04-May-2021 00:03:06 ----------------------------------------
04-May-2021 00:03:06 Starting: testSpaceAfterAssignmentPreference
04-May-2021 00:03:07 ----------------------------------------
04-May-2021 00:03:07 Starting: testStaticGetterToProperty
04-May-2021 00:03:08 ----------------------------------------
04-May-2021 00:03:08 Starting: testGStringGetterProperty
04-May-2021 00:03:09 ----------------------------------------
04-May-2021 00:03:09 Starting: testScriptNotOnBuildPath
04-May-2021 00:03:10 ----------------------------------------
04-May-2021 00:03:10 Starting: testGStringIsserProperty
04-May-2021 00:03:11 ----------------------------------------
04-May-2021 00:03:11 Starting: testChainedSetterToProperty
04-May-2021 00:03:12 ----------------------------------------
04-May-2021 00:03:12 Starting: testChainedGetterProperty
04-May-2021 00:03:13 ----------------------------------------
04-May-2021 00:03:13 Starting: testSetterToProperty1
04-May-2021 00:03:14 ----------------------------------------
04-May-2021 00:03:14 Starting: testSetterToProperty2
04-May-2021 00:03:15 ----------------------------------------
04-May-2021 00:03:15 Starting: testSetterToProperty3
04-May-2021 00:03:17 ----------------------------------------
04-May-2021 00:03:17 Starting: testImplicitSetterToProperty
04-May-2021 00:03:18 ----------------------------------------
04-May-2021 00:03:18 Starting: testNoConversion10
04-May-2021 00:03:19 ----------------------------------------
04-May-2021 00:03:19 Starting: testNoConversion0
04-May-2021 00:03:20 ----------------------------------------
04-May-2021 00:03:20 Starting: testNoConversion1
04-May-2021 00:03:21 ----------------------------------------
04-May-2021 00:03:21 Starting: testNoConversion2
04-May-2021 00:03:22 ----------------------------------------
04-May-2021 00:03:22 Starting: testNoConversion3
04-May-2021 00:03:23 ----------------------------------------
04-May-2021 00:03:23 Starting: testNoConversion4
04-May-2021 00:03:24 ----------------------------------------
04-May-2021 00:03:24 Starting: testNoConversion5
04-May-2021 00:03:25 ----------------------------------------
04-May-2021 00:03:25 Starting: testNoConversion6
04-May-2021 00:03:26 ----------------------------------------
04-May-2021 00:03:26 Starting: testNoConversion7
04-May-2021 00:03:27 ----------------------------------------
04-May-2021 00:03:27 Starting: testNoConversion8
04-May-2021 00:03:29 ----------------------------------------
04-May-2021 00:03:29 Starting: testNoConversion9
04-May-2021 00:03:30 ----------------------------------------
04-May-2021 00:03:30 Starting: testImplicitIsserToProperty
04-May-2021 00:03:31 ----------------------------------------
04-May-2021 00:03:31 Starting: testChainedIsserToProperty
04-May-2021 00:03:32 ----------------------------------------
04-May-2021 00:03:32 Starting: testStaticSetterToProperty
04-May-2021 00:03:33 Resetting 'markOccurrences' to its default
04-May-2021 00:03:33 Waiting for: Cleaning/Rebuilding Project: TestProject
04-May-2021 00:03:34 Waiting for: Java indexing... 7 files to index (/TestProject)
04-May-2021 00:03:34 ----------------------------------------
04-May-2021 00:03:34 Starting: testGroovyNatureNotJavaProject
04-May-2021 00:03:34 ----------------------------------------
04-May-2021 00:03:34 Starting: testRemoveGroovyNature
04-May-2021 01:51:59
04-May-2021 01:51:59 !ENTRY org.eclipse.tycho.surefire.osgibooter 2 0 2021-05-04 01:51:59.852
04-May-2021 01:51:59 !MESSAGE DumpStackTracesTimer almost reached timeout '9000000'.
04-May-2021 01:51:59 totalMemory:            1054867456
04-May-2021 01:51:59 freeMemory (before GC): 181141376
04-May-2021 01:51:59 freeMemory (after GC):  533017584
04-May-2021 01:51:59 Thread dump 0 at 2021-05-04 01:51:59 +0000:
04-May-2021 01:51:59 java.lang.Exception: ThreadDump for thread "ForkJoinPool.commonPool-worker-5"
04-May-2021 01:51:59         at [email protected]/jdk.internal.misc.Unsafe.park(Native Method)
04-May-2021 01:51:59         at [email protected]/java.util.concurrent.locks.LockSupport.park(LockSupport.java:194)
04-May-2021 01:51:59         at [email protected]/java.util.concurrent.ForkJoinPool.runWorker(ForkJoinPool.java:1628)
04-May-2021 01:51:59         at [email protected]/java.util.concurrent.ForkJoinWorkerThread.run(ForkJoinWorkerThread.java:183)
04-May-2021 01:51:59 java.lang.Exception: ThreadDump for thread "Gogo shell"
04-May-2021 01:51:59         at [email protected]/jdk.internal.misc.Unsafe.park(Native Method)
04-May-2021 01:51:59         at [email protected]/java.util.concurrent.locks.LockSupport.park(LockSupport.java:194)
04-May-2021 01:51:59         at [email protected]/java.util.concurrent.locks.AbstractQueuedSynchronizer$ConditionObject.await(AbstractQueuedSynchronizer.java:2081)
04-May-2021 01:51:59         at [email protected]/java.util.concurrent.LinkedBlockingQueue.take(LinkedBlockingQueue.java:433)
04-May-2021 01:51:59         at [email protected]/java.util.concurrent.ThreadPoolExecutor.getTask(ThreadPoolExecutor.java:1054)
04-May-2021 01:51:59         at [email protected]/java.util.concurrent.ThreadPoolExecutor.runWorker(ThreadPoolExecutor.java:1114)
04-May-2021 01:51:59         at [email protected]/java.util.concurrent.ThreadPoolExecutor$Worker.run(ThreadPoolExecutor.java:628)
04-May-2021 01:51:59         at [email protected]/java.lang.Thread.run(Thread.java:829)
04-May-2021 01:51:59 java.lang.Exception: ThreadDump for thread "pool-1-thread-1"
04-May-2021 01:51:59         at [email protected]/jdk.internal.misc.Unsafe.park(Native Method)
04-May-2021 01:51:59         at [email protected]/java.util.concurrent.locks.LockSupport.park(LockSupport.java:194)
04-May-2021 01:51:59         at [email protected]/java.util.concurrent.locks.AbstractQueuedSynchronizer$ConditionObject.await(AbstractQueuedSynchronizer.java:2081)
04-May-2021 01:51:59         at [email protected]/java.util.concurrent.LinkedBlockingQueue.take(LinkedBlockingQueue.java:433)
04-May-2021 01:51:59         at [email protected]/java.util.concurrent.ThreadPoolExecutor.getTask(ThreadPoolExecutor.java:1054)
04-May-2021 01:51:59         at [email protected]/java.util.concurrent.ThreadPoolExecutor.runWorker(ThreadPoolExecutor.java:1114)
04-May-2021 01:51:59         at [email protected]/java.util.concurrent.ThreadPoolExecutor$Worker.run(ThreadPoolExecutor.java:628)
04-May-2021 01:51:59         at [email protected]/java.lang.Thread.run(Thread.java:829)
04-May-2021 01:51:59 java.lang.Exception: ThreadDump for thread "SCR Component Actor"
04-May-2021 01:51:59         at [email protected]/java.lang.Object.wait(Native Method)
04-May-2021 01:51:59         at [email protected]/java.lang.Object.wait(Object.java:328)
04-May-2021 01:51:59         at org.apache.felix.scr.impl.ComponentActorThread.run(ComponentActorThread.java:83)
04-May-2021 01:51:59         at [email protected]/java.lang.Thread.run(Thread.java:829)
04-May-2021 01:51:59 java.lang.Exception: ThreadDump for thread "Active Thread: Equinox Container: 8ffcc8eb-fd26-47cf-b550-419b5e1a9e3b"
04-May-2021 01:51:59         at [email protected]/jdk.internal.misc.Unsafe.park(Native Method)
04-May-2021 01:51:59         at [email protected]/java.util.concurrent.locks.LockSupport.parkNanos(LockSupport.java:234)
04-May-2021 01:51:59         at [email protected]/java.util.concurrent.locks.AbstractQueuedSynchronizer$ConditionObject.awaitNanos(AbstractQueuedSynchronizer.java:2123)
04-May-2021 01:51:59         at [email protected]/java.util.concurrent.ScheduledThreadPoolExecutor$DelayedWorkQueue.take(ScheduledThreadPoolExecutor.java:1182)
04-May-2021 01:51:59         at [email protected]/java.util.concurrent.ScheduledThreadPoolExecutor$DelayedWorkQueue.take(ScheduledThreadPoolExecutor.java:899)
04-May-2021 01:51:59         at [email protected]/java.util.concurrent.ThreadPoolExecutor.getTask(ThreadPoolExecutor.java:1054)
04-May-2021 01:51:59         at [email protected]/java.util.concurrent.ThreadPoolExecutor.runWorker(ThreadPoolExecutor.java:1114)
04-May-2021 01:51:59         at [email protected]/java.util.concurrent.ThreadPoolExecutor$Worker.run(ThreadPoolExecutor.java:628)
04-May-2021 01:51:59         at [email protected]/java.lang.Thread.run(Thread.java:829)
04-May-2021 01:51:59 java.lang.Exception: ThreadDump for thread "EMF Reference Cleaner"
04-May-2021 01:51:59         at [email protected]/java.lang.Object.wait(Native Method)
04-May-2021 01:51:59         at [email protected]/java.lang.ref.ReferenceQueue.remove(ReferenceQueue.java:155)
04-May-2021 01:51:59         at [email protected]/java.lang.ref.ReferenceQueue.remove(ReferenceQueue.java:176)
04-May-2021 01:51:59         at org.eclipse.emf.common.util.CommonUtil$1ReferenceClearingQueuePollingThread.run(CommonUtil.java:70)
04-May-2021 01:51:59 java.lang.Exception: ThreadDump for thread "EventAdmin Async Event Dispatcher Thread"
04-May-2021 01:51:59         at [email protected]/java.lang.Object.wait(Native Method)
04-May-2021 01:51:59         at [email protected]/java.lang.Object.wait(Object.java:328)
04-May-2021 01:51:59         at org.eclipse.osgi.framework.eventmgr.EventManager$EventThread.getNextEvent(EventManager.java:400)
04-May-2021 01:51:59         at org.eclipse.osgi.framework.eventmgr.EventManager$EventThread.run(EventManager.java:341)
04-May-2021 01:51:59 java.lang.Exception: ThreadDump for thread "Start Level: Equinox Container: 8ffcc8eb-fd26-47cf-b550-419b5e1a9e3b"
04-May-2021 01:51:59         at [email protected]/java.lang.Object.wait(Native Method)
04-May-2021 01:51:59         at [email protected]/java.lang.Object.wait(Object.java:328)
04-May-2021 01:51:59         at org.eclipse.osgi.framework.eventmgr.EventManager$EventThread.getNextEvent(EventManager.java:400)
04-May-2021 01:51:59         at org.eclipse.osgi.framework.eventmgr.EventManager$EventThread.run(EventManager.java:341)
04-May-2021 01:51:59 java.lang.Exception: ThreadDump for thread "Framework Event Dispatcher: Equinox Container: 8ffcc8eb-fd26-47cf-b550-419b5e1a9e3b"
04-May-2021 01:51:59         at [email protected]/java.lang.Object.wait(Native Method)
04-May-2021 01:51:59         at [email protected]/java.lang.Object.wait(Object.java:328)
04-May-2021 01:51:59         at org.eclipse.osgi.framework.eventmgr.EventManager$EventThread.getNextEvent(EventManager.java:400)
04-May-2021 01:51:59         at org.eclipse.osgi.framework.eventmgr.EventManager$EventThread.run(EventManager.java:341)
04-May-2021 01:51:59 java.lang.Exception: ThreadDump for thread "Worker-3"
04-May-2021 01:51:59         at [email protected]/java.lang.Object.wait(Native Method)
04-May-2021 01:51:59         at org.eclipse.core.internal.jobs.WorkerPool.sleep(WorkerPool.java:200)
04-May-2021 01:51:59         at org.eclipse.core.internal.jobs.WorkerPool.startJob(WorkerPool.java:242)
04-May-2021 01:51:59         at org.eclipse.core.internal.jobs.Worker.run(Worker.java:58)
04-May-2021 01:51:59 java.lang.Exception: ThreadDump for thread "Refresh Thread: Equinox Container: 8ffcc8eb-fd26-47cf-b550-419b5e1a9e3b"
04-May-2021 01:51:59         at [email protected]/java.lang.Object.wait(Native Method)
04-May-2021 01:51:59         at [email protected]/java.lang.Object.wait(Object.java:328)
04-May-2021 01:51:59         at org.eclipse.osgi.framework.eventmgr.EventManager$EventThread.getNextEvent(EventManager.java:400)
04-May-2021 01:51:59         at org.eclipse.osgi.framework.eventmgr.EventManager$EventThread.run(EventManager.java:341)
04-May-2021 01:51:59 java.lang.Exception: ThreadDump for thread "main"
04-May-2021 01:51:59         at [email protected]/java.util.concurrent.ConcurrentHashMap.replaceNode(ConcurrentHashMap.java:1122)
04-May-2021 01:51:59         at [email protected]/java.util.concurrent.ConcurrentHashMap.remove(ConcurrentHashMap.java:1102)
04-May-2021 01:51:59         at org.codehaus.jdt.groovy.internal.compiler.GroovyClassLoaderFactory.clearCache(GroovyClassLoaderFactory.java:77)
04-May-2021 01:51:59         at org.codehaus.jdt.groovy.internal.compiler.ast.GroovyParser.clearCache(GroovyParser.java:95)
04-May-2021 01:51:59         at org.codehaus.jdt.groovy.integration.internal.GroovyEventHandler.handle(GroovyEventHandler.java:30)
04-May-2021 01:51:59         at org.eclipse.jdt.internal.core.JavaProject.close(JavaProject.java:548)
04-May-2021 01:51:59         at org.eclipse.jdt.internal.core.ClasspathChange.generateDelta(ClasspathChange.java:283)
04-May-2021 01:51:59         at org.eclipse.jdt.internal.core.DeltaProcessor.resourceChanged(DeltaProcessor.java:2127)
04-May-2021 01:51:59         at org.eclipse.jdt.internal.core.DeltaProcessingState.resourceChanged(DeltaProcessingState.java:477)
04-May-2021 01:51:59         at org.eclipse.core.internal.events.NotificationManager$1.run(NotificationManager.java:305)
04-May-2021 01:51:59         at org.eclipse.core.runtime.SafeRunner.run(SafeRunner.java:45)
04-May-2021 01:51:59         at org.eclipse.core.internal.events.NotificationManager.notify(NotificationManager.java:295)
04-May-2021 01:51:59         at org.eclipse.core.internal.events.NotificationManager.broadcastChanges(NotificationManager.java:158)
04-May-2021 01:51:59         at org.eclipse.core.internal.resources.Workspace.broadcastPostChange(Workspace.java:381)
04-May-2021 01:51:59         at org.eclipse.core.internal.resources.Workspace.endOperation(Workspace.java:1503)
04-May-2021 01:51:59         at org.eclipse.core.internal.resources.Workspace.run(Workspace.java:2327)
04-May-2021 01:51:59         at org.eclipse.core.internal.resources.Workspace.run(Workspace.java:2338)
04-May-2021 01:51:59         at org.eclipse.jdt.internal.core.JavaModelOperation.runOperation(JavaModelOperation.java:811)
04-May-2021 01:51:59         at org.eclipse.jdt.internal.core.JavaProject.setRawClasspath(JavaProject.java:3650)
04-May-2021 01:51:59         at org.eclipse.jdt.internal.core.JavaProject.setRawClasspath(JavaProject.java:3610)
04-May-2021 01:51:59         at org.eclipse.jdt.internal.core.JavaProject.setRawClasspath(JavaProject.java:3666)
04-May-2021 01:51:59         at org.codehaus.groovy.eclipse.core.model.GroovyRuntime.removeClasspathEntry(GroovyRuntime.java:150)
04-May-2021 01:51:59         at org.codehaus.groovy.eclipse.actions.RemoveGroovyNatureAction.lambda$1(RemoveGroovyNatureAction.java:67)
04-May-2021 01:51:59         at org.codehaus.groovy.eclipse.actions.RemoveGroovyNatureAction$$Lambda$16756/0x0000000101fc8c40.accept(Unknown Source)
04-May-2021 01:51:59         at [email protected]/java.util.Optional.ifPresent(Optional.java:183)
04-May-2021 01:51:59         at org.codehaus.groovy.eclipse.actions.RemoveGroovyNatureAction.run(RemoveGroovyNatureAction.java:67)
04-May-2021 01:51:59         at org.eclipse.ui.IActionDelegate$run$0.call(Unknown Source)
04-May-2021 01:51:59         at org.codehaus.groovy.runtime.callsite.CallSiteArray.defaultCall(CallSiteArray.java:47)
04-May-2021 01:51:59         at org.codehaus.groovy.runtime.callsite.AbstractCallSite.call(AbstractCallSite.java:125)
04-May-2021 01:51:59         at org.codehaus.groovy.runtime.callsite.AbstractCallSite.call(AbstractCallSite.java:139)
04-May-2021 01:51:59         at org.codehaus.groovy.eclipse.test.actions.GroovyNatureActionTests.testRemoveGroovyNature(GroovyNatureActionTests.groovy:102)
04-May-2021 01:51:59         at [email protected]/jdk.internal.reflect.NativeMethodAccessorImpl.invoke0(Native Method)
04-May-2021 01:51:59         at [email protected]/jdk.internal.reflect.NativeMethodAccessorImpl.invoke(NativeMethodAccessorImpl.java:62)
04-May-2021 01:51:59         at [email protected]/jdk.internal.reflect.DelegatingMethodAccessorImpl.invoke(DelegatingMethodAccessorImpl.java:43)
04-May-2021 01:51:59         at [email protected]/java.lang.reflect.Method.invoke(Method.java:566)
04-May-2021 01:51:59         at org.junit.runners.model.FrameworkMethod$1.runReflectiveCall(FrameworkMethod.java:59)
04-May-2021 01:51:59         at org.junit.internal.runners.model.ReflectiveCallable.run(ReflectiveCallable.java:12)
04-May-2021 01:51:59         at org.junit.runners.model.FrameworkMethod.invokeExplosively(FrameworkMethod.java:56)
04-May-2021 01:51:59         at org.junit.internal.runners.statements.InvokeMethod.evaluate(InvokeMethod.java:17)
04-May-2021 01:51:59         at org.junit.internal.runners.statements.RunBefores.evaluate(RunBefores.java:26)
04-May-2021 01:51:59         at org.junit.internal.runners.statements.RunAfters.evaluate(RunAfters.java:27)
04-May-2021 01:51:59         at org.junit.rules.TestWatcher$1.evaluate(TestWatcher.java:61)
04-May-2021 01:51:59         at org.junit.runners.ParentRunner$3.evaluate(ParentRunner.java:306)
04-May-2021 01:51:59         at org.junit.runners.BlockJUnit4ClassRunner$1.evaluate(BlockJUnit4ClassRunner.java:100)
04-May-2021 01:51:59         at org.junit.runners.ParentRunner.runLeaf(ParentRunner.java:366)
04-May-2021 01:51:59         at org.junit.runners.BlockJUnit4ClassRunner.runChild(BlockJUnit4ClassRunner.java:103)
04-May-2021 01:51:59         at org.junit.runners.BlockJUnit4ClassRunner.runChild(BlockJUnit4ClassRunner.java:63)
04-May-2021 01:51:59         at org.junit.runners.ParentRunner$4.run(ParentRunner.java:331)
04-May-2021 01:51:59         at org.junit.runners.ParentRunner$1.schedule(ParentRunner.java:79)
04-May-2021 01:51:59         at org.junit.runners.ParentRunner.runChildren(ParentRunner.java:329)
04-May-2021 01:51:59         at org.junit.runners.ParentRunner.access$100(ParentRunner.java:66)
04-May-2021 01:51:59         at org.junit.runners.ParentRunner$2.evaluate(ParentRunner.java:293)
04-May-2021 01:51:59         at org.junit.internal.runners.statements.RunBefores.evaluate(RunBefores.java:26)
04-May-2021 01:51:59         at org.junit.internal.runners.statements.RunAfters.evaluate(RunAfters.java:27)
04-May-2021 01:51:59         at org.junit.runners.ParentRunner$3.evaluate(ParentRunner.java:306)
04-May-2021 01:51:59         at org.junit.runners.ParentRunner.run(ParentRunner.java:413)
04-May-2021 01:51:59         at org.junit.runners.Suite.runChild(Suite.java:128)
04-May-2021 01:51:59         at org.junit.runners.Suite.runChild(Suite.java:27)
04-May-2021 01:51:59         at org.junit.runners.ParentRunner$4.run(ParentRunner.java:331)
04-May-2021 01:51:59         at org.junit.runners.ParentRunner$1.schedule(ParentRunner.java:79)
04-May-2021 01:51:59         at org.junit.runners.ParentRunner.runChildren(ParentRunner.java:329)
04-May-2021 01:51:59         at org.junit.runners.ParentRunner.access$100(ParentRunner.java:66)
04-May-2021 01:51:59         at org.junit.runners.ParentRunner$2.evaluate(ParentRunner.java:293)
04-May-2021 01:51:59         at org.junit.internal.runners.statements.RunBefores.evaluate(RunBefores.java:26)
04-May-2021 01:51:59         at org.junit.runners.ParentRunner$3.evaluate(ParentRunner.java:306)
04-May-2021 01:51:59         at org.junit.runners.ParentRunner.run(ParentRunner.java:413)
04-May-2021 01:51:59         at org.junit.runner.JUnitCore.run(JUnitCore.java:137)
04-May-2021 01:51:59         at org.junit.runner.JUnitCore.run(JUnitCore.java:115)
04-May-2021 01:51:59         at org.junit.vintage.engine.execution.RunnerExecutor.execute(RunnerExecutor.java:43)
04-May-2021 01:51:59         at org.junit.vintage.engine.VintageTestEngine$$Lambda$813/0x0000000100a06040.accept(Unknown Source)
04-May-2021 01:51:59         at [email protected]/java.util.stream.ForEachOps$ForEachOp$OfRef.accept(ForEachOps.java:183)
04-May-2021 01:51:59         at [email protected]/java.util.stream.ReferencePipeline$3$1.accept(ReferencePipeline.java:195)
04-May-2021 01:51:59         at [email protected]/java.util.Iterator.forEachRemaining(Iterator.java:133)
04-May-2021 01:51:59         at [email protected]/java.util.Spliterators$IteratorSpliterator.forEachRemaining(Spliterators.java:1801)
04-May-2021 01:51:59         at [email protected]/java.util.stream.AbstractPipeline.copyInto(AbstractPipeline.java:484)
04-May-2021 01:51:59         at [email protected]/java.util.stream.AbstractPipeline.wrapAndCopyInto(AbstractPipeline.java:474)
04-May-2021 01:51:59         at [email protected]/java.util.stream.ForEachOps$ForEachOp.evaluateSequential(ForEachOps.java:150)
04-May-2021 01:51:59         at [email protected]/java.util.stream.ForEachOps$ForEachOp$OfRef.evaluateSequential(ForEachOps.java:173)
04-May-2021 01:51:59         at [email protected]/java.util.stream.AbstractPipeline.evaluate(AbstractPipeline.java:234)
04-May-2021 01:51:59         at [email protected]/java.util.stream.ReferencePipeline.forEach(ReferencePipeline.java:497)
04-May-2021 01:51:59         at org.junit.vintage.engine.VintageTestEngine.executeAllChildren(VintageTestEngine.java:82)
04-May-2021 01:51:59         at org.junit.vintage.engine.VintageTestEngine.execute(VintageTestEngine.java:73)
04-May-2021 01:51:59         at org.junit.platform.launcher.core.EngineExecutionOrchestrator.execute(EngineExecutionOrchestrator.java:108)
04-May-2021 01:51:59         at org.junit.platform.launcher.core.EngineExecutionOrchestrator.execute(EngineExecutionOrchestrator.java:88)
04-May-2021 01:51:59         at org.junit.platform.launcher.core.EngineExecutionOrchestrator.lambda$execute$0(EngineExecutionOrchestrator.java:54)
04-May-2021 01:51:59         at org.junit.platform.launcher.core.EngineExecutionOrchestrator$$Lambda$763/0x00000001009d9440.accept(Unknown Source)
04-May-2021 01:51:59         at org.junit.platform.launcher.core.EngineExecutionOrchestrator.withInterceptedStreams(EngineExecutionOrchestrator.java:67)
04-May-2021 01:51:59         at org.junit.platform.launcher.core.EngineExecutionOrchestrator.execute(EngineExecutionOrchestrator.java:52)
04-May-2021 01:51:59         at org.junit.platform.launcher.core.DefaultLauncher.execute(DefaultLauncher.java:96)
04-May-2021 01:51:59         at org.junit.platform.launcher.core.DefaultLauncher.execute(DefaultLauncher.java:75)
04-May-2021 01:51:59         at org.apache.maven.surefire.junitplatform.JUnitPlatformProvider.invokeAllTests(JUnitPlatformProvider.java:150)
04-May-2021 01:51:59         at org.apache.maven.surefire.junitplatform.JUnitPlatformProvider.invoke(JUnitPlatformProvider.java:124)
04-May-2021 01:51:59         at [email protected]/jdk.internal.reflect.NativeMethodAccessorImpl.invoke0(Native Method)
04-May-2021 01:51:59         at [email protected]/jdk.internal.reflect.NativeMethodAccessorImpl.invoke(NativeMethodAccessorImpl.java:62)
04-May-2021 01:51:59         at [email protected]/jdk.internal.reflect.DelegatingMethodAccessorImpl.invoke(DelegatingMethodAccessorImpl.java:43)
04-May-2021 01:51:59         at [email protected]/java.lang.reflect.Method.invoke(Method.java:566)
04-May-2021 01:51:59         at org.apache.maven.surefire.util.ReflectionUtils.invokeMethodWithArray2(ReflectionUtils.java:206)
04-May-2021 01:51:59         at org.apache.maven.surefire.booter.ProviderFactory$ProviderProxy.invoke(ProviderFactory.java:161)
04-May-2021 01:51:59         at org.apache.maven.surefire.booter.ProviderFactory.invokeProvider(ProviderFactory.java:84)
04-May-2021 01:51:59         at org.eclipse.tycho.surefire.osgibooter.OsgiSurefireBooter.run(OsgiSurefireBooter.java:116)
04-May-2021 01:51:59         at org.eclipse.tycho.surefire.osgibooter.AbstractUITestApplication$1.run(AbstractUITestApplication.java:37)
04-May-2021 01:51:59         at org.eclipse.swt.widgets.RunnableLock.run(RunnableLock.java:40)
04-May-2021 01:51:59         at org.eclipse.swt.widgets.Synchronizer.runAsyncMessages(Synchronizer.java:185)
04-May-2021 01:51:59         at org.eclipse.swt.widgets.Display.runAsyncMessages(Display.java:5096)
04-May-2021 01:51:59         at org.eclipse.swt.widgets.Display.readAndDispatch(Display.java:4602)
04-May-2021 01:51:59         at org.eclipse.e4.ui.internal.workbench.swt.PartRenderingEngine$5.run(PartRenderingEngine.java:1157)
04-May-2021 01:51:59         at org.eclipse.core.databinding.observable.Realm.runWithDefault(Realm.java:338)
04-May-2021 01:51:59         at org.eclipse.e4.ui.internal.workbench.swt.PartRenderingEngine.run(PartRenderingEngine.java:1046)
04-May-2021 01:51:59         at org.eclipse.e4.ui.internal.workbench.E4Workbench.createAndRunUI(E4Workbench.java:155)
04-May-2021 01:51:59         at org.eclipse.ui.internal.Workbench.lambda$3(Workbench.java:644)
04-May-2021 01:51:59         at org.eclipse.ui.internal.Workbench$$Lambda$108/0x00000001002fa040.run(Unknown Source)
04-May-2021 01:51:59         at org.eclipse.core.databinding.observable.Realm.runWithDefault(Realm.java:338)
04-May-2021 01:51:59         at org.eclipse.ui.internal.Workbench.createAndRunWorkbench(Workbench.java:551)
04-May-2021 01:51:59         at org.eclipse.ui.PlatformUI.createAndRunWorkbench(PlatformUI.java:156)
04-May-2021 01:51:59         at org.eclipse.ui.internal.ide.application.IDEApplication.start(IDEApplication.java:152)
04-May-2021 01:51:59         at org.eclipse.tycho.surefire.osgibooter.UITestApplication.runApplication(UITestApplication.java:29)
04-May-2021 01:51:59         at org.eclipse.tycho.surefire.osgibooter.AbstractUITestApplication.run(AbstractUITestApplication.java:122)
04-May-2021 01:51:59         at org.eclipse.tycho.surefire.osgibooter.UITestApplication.start(UITestApplication.java:35)
04-May-2021 01:51:59         at org.eclipse.equinox.internal.app.EclipseAppHandle.run(EclipseAppHandle.java:203)
04-May-2021 01:51:59         at org.eclipse.core.runtime.internal.adaptor.EclipseAppLauncher.runApplication(EclipseAppLauncher.java:134)
04-May-2021 01:51:59         at org.eclipse.core.runtime.internal.adaptor.EclipseAppLauncher.start(EclipseAppLauncher.java:104)
04-May-2021 01:51:59         at org.eclipse.core.runtime.adaptor.EclipseStarter.run(EclipseStarter.java:401)
04-May-2021 01:51:59         at org.eclipse.core.runtime.adaptor.EclipseStarter.run(EclipseStarter.java:255)
04-May-2021 01:51:59         at [email protected]/jdk.internal.reflect.NativeMethodAccessorImpl.invoke0(Native Method)
04-May-2021 01:51:59         at [email protected]/jdk.internal.reflect.NativeMethodAccessorImpl.invoke(NativeMethodAccessorImpl.java:62)
04-May-2021 01:51:59         at [email protected]/jdk.internal.reflect.DelegatingMethodAccessorImpl.invoke(DelegatingMethodAccessorImpl.java:43)
04-May-2021 01:51:59         at [email protected]/java.lang.reflect.Method.invoke(Method.java:566)
04-May-2021 01:51:59         at app//org.eclipse.equinox.launcher.Main.invokeFramework(Main.java:653)
04-May-2021 01:51:59         at app//org.eclipse.equinox.launcher.Main.basicRun(Main.java:590)
04-May-2021 01:51:59         at app//org.eclipse.equinox.launcher.Main.run(Main.java:1461)
04-May-2021 01:51:59         at app//org.eclipse.equinox.launcher.Main.main(Main.java:1434)
04-May-2021 01:51:59 java.lang.Exception: ThreadDump for thread "Worker-6: Compacting resource model"
04-May-2021 01:51:59         at [email protected]/java.lang.Object.wait(Native Method)
04-May-2021 01:51:59         at [email protected]/java.lang.Object.wait(Object.java:328)
04-May-2021 01:51:59         at org.eclipse.core.internal.jobs.ThreadJob.waitForRun(ThreadJob.java:316)
04-May-2021 01:51:59         at org.eclipse.core.internal.jobs.ThreadJob.joinRun(ThreadJob.java:205)
04-May-2021 01:51:59         at org.eclipse.core.internal.jobs.ImplicitJobs.begin(ImplicitJobs.java:95)
04-May-2021 01:51:59         at org.eclipse.core.internal.jobs.JobManager.beginRule(JobManager.java:299)
04-May-2021 01:51:59         at org.eclipse.core.internal.utils.StringPoolJob.run(StringPoolJob.java:101)
04-May-2021 01:51:59         at org.eclipse.core.internal.jobs.Worker.run(Worker.java:63)
04-May-2021 01:51:59 java.lang.Exception: ThreadDump for thread "Worker-JM"
04-May-2021 01:51:59         at [email protected]/java.lang.Object.wait(Native Method)
04-May-2021 01:51:59         at org.eclipse.core.internal.jobs.InternalWorker.run(InternalWorker.java:61)
04-May-2021 01:51:59 java.lang.Exception: ThreadDump for thread "Common-Cleaner"
04-May-2021 01:51:59         at [email protected]/java.lang.Object.wait(Native Method)
04-May-2021 01:51:59         at [email protected]/java.lang.ref.ReferenceQueue.remove(ReferenceQueue.java:155)
04-May-2021 01:51:59         at [email protected]/jdk.internal.ref.CleanerImpl.run(CleanerImpl.java:148)
04-May-2021 01:51:59         at [email protected]/java.lang.Thread.run(Thread.java:829)
04-May-2021 01:51:59         at [email protected]/jdk.internal.misc.InnocuousThread.run(InnocuousThread.java:134)
04-May-2021 01:51:59 java.lang.Exception: ThreadDump for thread "Finalizer"
04-May-2021 01:51:59         at [email protected]/java.lang.Object.wait(Native Method)
04-May-2021 01:51:59         at [email protected]/java.lang.ref.ReferenceQueue.remove(ReferenceQueue.java:155)
04-May-2021 01:51:59         at [email protected]/java.lang.ref.ReferenceQueue.remove(ReferenceQueue.java:176)
04-May-2021 01:51:59         at [email protected]/java.lang.ref.Finalizer$FinalizerThread.run(Finalizer.java:170)
04-May-2021 01:51:59 java.lang.Exception: ThreadDump for thread "pool-2-thread-1"
04-May-2021 01:51:59         at [email protected]/jdk.internal.misc.Unsafe.park(Native Method)
04-May-2021 01:51:59         at [email protected]/java.util.concurrent.locks.LockSupport.park(LockSupport.java:194)
04-May-2021 01:51:59         at [email protected]/java.util.concurrent.locks.AbstractQueuedSynchronizer$ConditionObject.await(AbstractQueuedSynchronizer.java:2081)
04-May-2021 01:51:59         at [email protected]/java.util.concurrent.LinkedBlockingQueue.take(LinkedBlockingQueue.java:433)
04-May-2021 01:51:59         at [email protected]/java.util.concurrent.ThreadPoolExecutor.getTask(ThreadPoolExecutor.java:1054)
04-May-2021 01:51:59         at [email protected]/java.util.concurrent.ThreadPoolExecutor.runWorker(ThreadPoolExecutor.java:1114)
04-May-2021 01:51:59         at [email protected]/java.util.concurrent.ThreadPoolExecutor$Worker.run(ThreadPoolExecutor.java:628)
04-May-2021 01:51:59         at [email protected]/java.lang.Thread.run(Thread.java:829)
04-May-2021 01:51:59 java.lang.Exception: ThreadDump for thread "Reference Handler"
04-May-2021 01:51:59         at [email protected]/java.lang.ref.Reference.waitForReferencePendingList(Native Method)
04-May-2021 01:51:59         at [email protected]/java.lang.ref.Reference.processPendingReferences(Reference.java:241)
04-May-2021 01:51:59         at [email protected]/java.lang.ref.Reference$ReferenceHandler.run(Reference.java:213)
04-May-2021 01:51:59 java.lang.Exception: ThreadDump for thread "DumpStackTracesTimer"
04-May-2021 01:51:59         at [email protected]/java.lang.Thread.dumpThreads(Native Method)
04-May-2021 01:51:59         at [email protected]/java.lang.Thread.getAllStackTraces(Thread.java:1653)
04-May-2021 01:51:59         at org.eclipse.tycho.surefire.osgibooter.DumpStackTracesTimer.dumpStackTraces(DumpStackTracesTimer.java:136)
04-May-2021 01:51:59         at org.eclipse.tycho.surefire.osgibooter.DumpStackTracesTimer.logStackTraces(DumpStackTracesTimer.java:122)
04-May-2021 01:51:59         at org.eclipse.tycho.surefire.osgibooter.DumpStackTracesTimer.dump(DumpStackTracesTimer.java:110)
04-May-2021 01:51:59         at org.eclipse.tycho.surefire.osgibooter.DumpStackTracesTimer.run(DumpStackTracesTimer.java:95)
04-May-2021 01:51:59         at [email protected]/java.util.TimerThread.mainLoop(Timer.java:556)
04-May-2021 01:51:59         at [email protected]/java.util.TimerThread.run(Timer.java:506)
04-May-2021 01:51:59 java.lang.Exception: ThreadDump for thread "Java indexing"
04-May-2021 01:51:59         at [email protected]/java.util.concurrent.ConcurrentHashMap.computeIfAbsent(ConcurrentHashMap.java:1723)
04-May-2021 01:51:59         at org.codehaus.jdt.groovy.internal.compiler.GroovyClassLoaderFactory.getProjectGroovyClassLoaders(GroovyClassLoaderFactory.java:157)
04-May-2021 01:51:59         at org.codehaus.jdt.groovy.internal.compiler.GroovyClassLoaderFactory.getGroovyClassLoaders(GroovyClassLoaderFactory.java:122)
04-May-2021 01:51:59         at org.codehaus.jdt.groovy.internal.compiler.ast.GroovyParser.lambda$0(GroovyParser.java:144)
04-May-2021 01:51:59         at org.codehaus.jdt.groovy.internal.compiler.ast.GroovyParser$$Lambda$927/0x0000000100ada440.get(Unknown Source)
04-May-2021 01:51:59         at org.codehaus.jdt.groovy.internal.compiler.ast.GroovyParser.dietParse(GroovyParser.java:215)
04-May-2021 01:51:59         at org.codehaus.jdt.groovy.integration.internal.MultiplexingIndexingParser.parseCompilationUnit(MultiplexingIndexingParser.java:63)
04-May-2021 01:51:59         at org.eclipse.jdt.internal.core.search.indexing.SourceIndexer.indexDocument(SourceIndexer.java:115)
04-May-2021 01:51:59         at org.eclipse.jdt.internal.core.search.JavaSearchParticipant.indexDocument(JavaSearchParticipant.java:83)
04-May-2021 01:51:59         at org.eclipse.jdt.internal.core.search.indexing.IndexManager.indexDocument(IndexManager.java:550)
04-May-2021 01:51:59         at org.eclipse.jdt.internal.core.search.indexing.IndexManager$1.execute(IndexManager.java:1078)
04-May-2021 01:51:59         at org.eclipse.jdt.internal.core.search.processing.JobManager.run(JobManager.java:414)
04-May-2021 01:51:59         at [email protected]/java.lang.Thread.run(Thread.java:829)
04-May-2021 01:51:59 java.lang.Exception: ThreadDump for thread "Signal Dispatcher"
04-May-2021 01:51:59 java.lang.Exception: ThreadDump for thread "Worker-5: Refresh DSLD scripts"
04-May-2021 01:51:59         at [email protected]/java.lang.Object.wait(Native Method)
04-May-2021 01:51:59         at org.eclipse.core.internal.jobs.Semaphore.acquire(Semaphore.java:44)
04-May-2021 01:51:59         at org.eclipse.core.internal.jobs.OrderedLock.doAcquire(OrderedLock.java:173)
04-May-2021 01:51:59         at org.eclipse.core.internal.jobs.OrderedLock.acquire(OrderedLock.java:109)
04-May-2021 01:51:59         at org.eclipse.core.internal.jobs.OrderedLock.acquire(OrderedLock.java:85)
04-May-2021 01:51:59         at org.eclipse.core.internal.resources.WorkManager.checkIn(WorkManager.java:125)
04-May-2021 01:51:59         at org.eclipse.core.internal.resources.Workspace.prepareOperation(Workspace.java:2263)
04-May-2021 01:51:59         at org.eclipse.core.internal.resources.Workspace.run(Workspace.java:2308)
04-May-2021 01:51:59         at org.eclipse.core.internal.resources.Workspace.run(Workspace.java:2338)
04-May-2021 01:51:59         at org.eclipse.jdt.internal.core.JavaModelManager.initializeAllContainers(JavaModelManager.java:3146)
04-May-2021 01:51:59         at org.eclipse.jdt.internal.core.JavaModelManager.getClasspathContainer(JavaModelManager.java:2113)
04-May-2021 01:51:59         at org.eclipse.jdt.core.JavaCore.getClasspathContainer(JavaCore.java:3764)
04-May-2021 01:51:59         at org.eclipse.jdt.launching.JavaRuntime.computeDefaultContainerEntries(JavaRuntime.java:1554)
04-May-2021 01:51:59         at org.eclipse.jdt.launching.JavaRuntime.resolveRuntimeClasspathEntry(JavaRuntime.java:1503)
04-May-2021 01:51:59         at org.eclipse.jdt.internal.launching.DefaultEntryResolver.resolveRuntimeClasspathEntry(DefaultEntryResolver.java:70)
04-May-2021 01:51:59         at org.eclipse.jdt.launching.JavaRuntime.resolveRuntimeClasspathEntry(JavaRuntime.java:1508)
04-May-2021 01:51:59         at jdk.internal.reflect.GeneratedMethodAccessor3920.invoke(Unknown Source)
04-May-2021 01:51:59         at [email protected]/jdk.internal.reflect.DelegatingMethodAccessorImpl.invoke(DelegatingMethodAccessorImpl.java:43)
04-May-2021 01:51:59         at [email protected]/java.lang.reflect.Method.invoke(Method.java:566)
04-May-2021 01:51:59         at org.codehaus.jdt.groovy.internal.compiler.GroovyClassLoaderFactory.resolveRuntimeClasspathEntry(GroovyClassLoaderFactory.java:246)
04-May-2021 01:51:59         at org.codehaus.jdt.groovy.internal.compiler.GroovyClassLoaderFactory.calculateClasspath(GroovyClassLoaderFactory.java:233)
04-May-2021 01:51:59         at org.codehaus.jdt.groovy.internal.compiler.GroovyClassLoaderFactory.lambda$2(GroovyClassLoaderFactory.java:159)
04-May-2021 01:51:59         at org.codehaus.jdt.groovy.internal.compiler.GroovyClassLoaderFactory$$Lambda$932/0x0000000100b3e840.apply(Unknown Source)
04-May-2021 01:51:59         at [email protected]/java.util.concurrent.ConcurrentHashMap.computeIfAbsent(ConcurrentHashMap.java:1705)
04-May-2021 01:51:59         at org.codehaus.jdt.groovy.internal.compiler.GroovyClassLoaderFactory.getProjectGroovyClassLoaders(GroovyClassLoaderFactory.java:157)
04-May-2021 01:51:59         at org.codehaus.jdt.groovy.internal.compiler.GroovyClassLoaderFactory.getGroovyClassLoaders(GroovyClassLoaderFactory.java:122)
04-May-2021 01:51:59         at org.codehaus.jdt.groovy.integration.internal.GroovyLanguageSupport.newGroovyClassLoader(GroovyLanguageSupport.java:289)
04-May-2021 01:51:59         at org.codehaus.groovy.eclipse.dsl.script.DSLDScriptExecutor.getGroovyClassLoader(DSLDScriptExecutor.java:136)
04-May-2021 01:51:59         at org.codehaus.groovy.eclipse.dsl.script.DSLDScriptExecutor.executeScript(DSLDScriptExecutor.java:72)
04-May-2021 01:51:59         at org.codehaus.groovy.eclipse.dsl.RefreshDSLDJob.refreshProject(RefreshDSLDJob.java:189)
04-May-2021 01:51:59         at org.codehaus.groovy.eclipse.dsl.RefreshDSLDJob.run(RefreshDSLDJob.java:118)
04-May-2021 01:51:59         at org.eclipse.core.internal.jobs.Worker.run(Worker.java:63)
04-May-2021 01:51:59 java.lang.Exception: ThreadDump for thread "WorkbenchTestable"
04-May-2021 01:51:59         at [email protected]/java.lang.Object.wait(Native Method)
04-May-2021 01:51:59         at [email protected]/java.lang.Object.wait(Object.java:328)
04-May-2021 01:51:59         at org.eclipse.swt.widgets.Synchronizer.syncExec(Synchronizer.java:253)
04-May-2021 01:51:59         at org.eclipse.ui.internal.UISynchronizer.syncExec(UISynchronizer.java:133)
04-May-2021 01:51:59         at org.eclipse.swt.widgets.Display.syncExec(Display.java:5996)
04-May-2021 01:51:59         at org.eclipse.e4.ui.internal.workbench.swt.E4Testable.runTest(E4Testable.java:115)
04-May-2021 01:51:59         at org.eclipse.tycho.surefire.osgibooter.AbstractUITestApplication.runTests(AbstractUITestApplication.java:34)
04-May-2021 01:51:59         at org.eclipse.e4.ui.internal.workbench.swt.E4Testable.lambda$0(E4Testable.java:76)
04-May-2021 01:51:59         at org.eclipse.e4.ui.internal.workbench.swt.E4Testable$$Lambda$520/0x00000001007a1c40.run(Unknown Source)
04-May-2021 01:51:59         at [email protected]/java.lang.Thread.run(Thread.java:829)
04-May-2021 01:51:59 java.lang.Exception: ThreadDump for thread "Bundle File Closer"
04-May-2021 01:51:59         at [email protected]/java.lang.Object.wait(Native Method)
04-May-2021 01:51:59         at [email protected]/java.lang.Object.wait(Object.java:328)
04-May-2021 01:51:59         at org.eclipse.osgi.framework.eventmgr.EventManager$EventThread.getNextEvent(EventManager.java:400)
04-May-2021 01:51:59         at org.eclipse.osgi.framework.eventmgr.EventManager$EventThread.run(EventManager.java:341)
04-May-2021 01:51:59 java.lang.Exception: ThreadDump for thread "Worker-1: Decoration Calculation"
04-May-2021 01:51:59         at [email protected]/java.lang.Thread.sleep(Native Method)
04-May-2021 01:51:59         at org.eclipse.ui.internal.decorators.DecorationScheduler$1.run(DecorationScheduler.java:341)
04-May-2021 01:51:59         at org.eclipse.core.internal.jobs.Worker.run(Worker.java:63)
04-May-2021 01:51:59 java.lang.Exception: ThreadDump for thread "Worker-2: Java indexing... "
04-May-2021 01:51:59         at [email protected]/java.lang.Thread.sleep(Native Method)
04-May-2021 01:51:59         at org.eclipse.jdt.internal.core.search.processing.JobManager$1ProgressJob.run(JobManager.java:364)
04-May-2021 01:51:59         at org.eclipse.core.internal.jobs.Worker.run(Worker.java:63)
04-May-2021 01:51:59
04-May-2021 01:51:59
04-May-2021 01:51:59 !ENTRY org.eclipse.tycho.surefire.osgibooter 1 0 2021-05-04 01:51:59.854
04-May-2021 01:51:59 !MESSAGE Seconds to do dump 0: 1.006
04-May-2021 01:52:05
04-May-2021 01:52:05 !ENTRY org.eclipse.tycho.surefire.osgibooter 2 0 2021-05-04 01:52:05.270
04-May-2021 01:52:05 !MESSAGE DumpStackTracesTimer almost reached timeout '9000000'.
04-May-2021 01:52:05 totalMemory:            1054867456
04-May-2021 01:52:05 freeMemory (before GC): 531835224
04-May-2021 01:52:05 freeMemory (after GC):  595598072
04-May-2021 01:52:05 Thread dump 5 at 2021-05-04 01:52:05 +0000:
04-May-2021 01:52:05 java.lang.Exception: ThreadDump for thread "ForkJoinPool.commonPool-worker-5"
04-May-2021 01:52:05         at [email protected]/jdk.internal.misc.Unsafe.park(Native Method)
04-May-2021 01:52:05         at [email protected]/java.util.concurrent.locks.LockSupport.park(LockSupport.java:194)
04-May-2021 01:52:05         at [email protected]/java.util.concurrent.ForkJoinPool.runWorker(ForkJoinPool.java:1628)
04-May-2021 01:52:05         at [email protected]/java.util.concurrent.ForkJoinWorkerThread.run(ForkJoinWorkerThread.java:183)
04-May-2021 01:52:05 java.lang.Exception: ThreadDump for thread "Gogo shell"
04-May-2021 01:52:05         at [email protected]/jdk.internal.misc.Unsafe.park(Native Method)
04-May-2021 01:52:05         at [email protected]/java.util.concurrent.locks.LockSupport.park(LockSupport.java:194)
04-May-2021 01:52:05         at [email protected]/java.util.concurrent.locks.AbstractQueuedSynchronizer$ConditionObject.await(AbstractQueuedSynchronizer.java:2081)
04-May-2021 01:52:05         at [email protected]/java.util.concurrent.LinkedBlockingQueue.take(LinkedBlockingQueue.java:433)
04-May-2021 01:52:05         at [email protected]/java.util.concurrent.ThreadPoolExecutor.getTask(ThreadPoolExecutor.java:1054)
04-May-2021 01:52:05         at [email protected]/java.util.concurrent.ThreadPoolExecutor.runWorker(ThreadPoolExecutor.java:1114)
04-May-2021 01:52:05         at [email protected]/java.util.concurrent.ThreadPoolExecutor$Worker.run(ThreadPoolExecutor.java:628)
04-May-2021 01:52:05         at [email protected]/java.lang.Thread.run(Thread.java:829)
04-May-2021 01:52:05 java.lang.Exception: ThreadDump for thread "pool-1-thread-1"
04-May-2021 01:52:05         at [email protected]/jdk.internal.misc.Unsafe.park(Native Method)
04-May-2021 01:52:05         at [email protected]/java.util.concurrent.locks.LockSupport.park(LockSupport.java:194)
04-May-2021 01:52:05         at [email protected]/java.util.concurrent.locks.AbstractQueuedSynchronizer$ConditionObject.await(AbstractQueuedSynchronizer.java:2081)
04-May-2021 01:52:05         at [email protected]/java.util.concurrent.LinkedBlockingQueue.take(LinkedBlockingQueue.java:433)
04-May-2021 01:52:05         at [email protected]/java.util.concurrent.ThreadPoolExecutor.getTask(ThreadPoolExecutor.java:1054)
04-May-2021 01:52:05         at [email protected]/java.util.concurrent.ThreadPoolExecutor.runWorker(ThreadPoolExecutor.java:1114)
04-May-2021 01:52:05         at [email protected]/java.util.concurrent.ThreadPoolExecutor$Worker.run(ThreadPoolExecutor.java:628)
04-May-2021 01:52:05         at [email protected]/java.lang.Thread.run(Thread.java:829)
04-May-2021 01:52:05 java.lang.Exception: ThreadDump for thread "SCR Component Actor"
04-May-2021 01:52:05         at [email protected]/java.lang.Object.wait(Native Method)
04-May-2021 01:52:05         at [email protected]/java.lang.Object.wait(Object.java:328)
04-May-2021 01:52:05         at org.apache.felix.scr.impl.ComponentActorThread.run(ComponentActorThread.java:83)
04-May-2021 01:52:05         at [email protected]/java.lang.Thread.run(Thread.java:829)
04-May-2021 01:52:05 java.lang.Exception: ThreadDump for thread "Active Thread: Equinox Container: 8ffcc8eb-fd26-47cf-b550-419b5e1a9e3b"
04-May-2021 01:52:05         at [email protected]/jdk.internal.misc.Unsafe.park(Native Method)
04-May-2021 01:52:05         at [email protected]/java.util.concurrent.locks.LockSupport.parkNanos(LockSupport.java:234)
04-May-2021 01:52:05         at [email protected]/java.util.concurrent.locks.AbstractQueuedSynchronizer$ConditionObject.awaitNanos(AbstractQueuedSynchronizer.java:2123)
04-May-2021 01:52:05         at [email protected]/java.util.concurrent.ScheduledThreadPoolExecutor$DelayedWorkQueue.take(ScheduledThreadPoolExecutor.java:1182)
04-May-2021 01:52:05         at [email protected]/java.util.concurrent.ScheduledThreadPoolExecutor$DelayedWorkQueue.take(ScheduledThreadPoolExecutor.java:899)
04-May-2021 01:52:05         at [email protected]/java.util.concurrent.ThreadPoolExecutor.getTask(ThreadPoolExecutor.java:1054)
04-May-2021 01:52:05         at [email protected]/java.util.concurrent.ThreadPoolExecutor.runWorker(ThreadPoolExecutor.java:1114)
04-May-2021 01:52:05         at [email protected]/java.util.concurrent.ThreadPoolExecutor$Worker.run(ThreadPoolExecutor.java:628)
04-May-2021 01:52:05         at [email protected]/java.lang.Thread.run(Thread.java:829)
04-May-2021 01:52:05 java.lang.Exception: ThreadDump for thread "EMF Reference Cleaner"
04-May-2021 01:52:05         at [email protected]/java.lang.Object.wait(Native Method)
04-May-2021 01:52:05         at [email protected]/java.lang.ref.ReferenceQueue.remove(ReferenceQueue.java:155)
04-May-2021 01:52:05         at [email protected]/java.lang.ref.ReferenceQueue.remove(ReferenceQueue.java:176)
04-May-2021 01:52:05         at org.eclipse.emf.common.util.CommonUtil$1ReferenceClearingQueuePollingThread.run(CommonUtil.java:70)
04-May-2021 01:52:05 java.lang.Exception: ThreadDump for thread "EventAdmin Async Event Dispatcher Thread"
04-May-2021 01:52:05         at [email protected]/java.lang.Object.wait(Native Method)
04-May-2021 01:52:05         at [email protected]/java.lang.Object.wait(Object.java:328)
04-May-2021 01:52:05         at org.eclipse.osgi.framework.eventmgr.EventManager$EventThread.getNextEvent(EventManager.java:400)
04-May-2021 01:52:05         at org.eclipse.osgi.framework.eventmgr.EventManager$EventThread.run(EventManager.java:341)
04-May-2021 01:52:05 java.lang.Exception: ThreadDump for thread "Start Level: Equinox Container: 8ffcc8eb-fd26-47cf-b550-419b5e1a9e3b"
04-May-2021 01:52:05         at [email protected]/java.lang.Object.wait(Native Method)
04-May-2021 01:52:05         at [email protected]/java.lang.Object.wait(Object.java:328)
04-May-2021 01:52:05         at org.eclipse.osgi.framework.eventmgr.EventManager$EventThread.getNextEvent(EventManager.java:400)
04-May-2021 01:52:05         at org.eclipse.osgi.framework.eventmgr.EventManager$EventThread.run(EventManager.java:341)
04-May-2021 01:52:05 java.lang.Exception: ThreadDump for thread "Framework Event Dispatcher: Equinox Container: 8ffcc8eb-fd26-47cf-b550-419b5e1a9e3b"
04-May-2021 01:52:05         at [email protected]/java.lang.Object.wait(Native Method)
04-May-2021 01:52:05         at [email protected]/java.lang.Object.wait(Object.java:328)
04-May-2021 01:52:05         at org.eclipse.osgi.framework.eventmgr.EventManager$EventThread.getNextEvent(EventManager.java:400)
04-May-2021 01:52:05         at org.eclipse.osgi.framework.eventmgr.EventManager$EventThread.run(EventManager.java:341)
04-May-2021 01:52:05 java.lang.Exception: ThreadDump for thread "Worker-3"
04-May-2021 01:52:05         at [email protected]/java.lang.Object.wait(Native Method)
04-May-2021 01:52:05         at org.eclipse.core.internal.jobs.WorkerPool.sleep(WorkerPool.java:200)
04-May-2021 01:52:05         at org.eclipse.core.internal.jobs.WorkerPool.startJob(WorkerPool.java:242)
04-May-2021 01:52:05         at org.eclipse.core.internal.jobs.Worker.run(Worker.java:58)
04-May-2021 01:52:05 java.lang.Exception: ThreadDump for thread "Refresh Thread: Equinox Container: 8ffcc8eb-fd26-47cf-b550-419b5e1a9e3b"
04-May-2021 01:52:05         at [email protected]/java.lang.Object.wait(Native Method)
04-May-2021 01:52:05         at [email protected]/java.lang.Object.wait(Object.java:328)
04-May-2021 01:52:05         at org.eclipse.osgi.framework.eventmgr.EventManager$EventThread.getNextEvent(EventManager.java:400)
04-May-2021 01:52:05         at org.eclipse.osgi.framework.eventmgr.EventManager$EventThread.run(EventManager.java:341)
04-May-2021 01:52:05 java.lang.Exception: ThreadDump for thread "main"
04-May-2021 01:52:05         at [email protected]/java.util.concurrent.ConcurrentHashMap.replaceNode(ConcurrentHashMap.java:1122)
04-May-2021 01:52:05         at [email protected]/java.util.concurrent.ConcurrentHashMap.remove(ConcurrentHashMap.java:1102)
04-May-2021 01:52:05         at org.codehaus.jdt.groovy.internal.compiler.GroovyClassLoaderFactory.clearCache(GroovyClassLoaderFactory.java:77)
04-May-2021 01:52:05         at org.codehaus.jdt.groovy.internal.compiler.ast.GroovyParser.clearCache(GroovyParser.java:95)
04-May-2021 01:52:05         at org.codehaus.jdt.groovy.integration.internal.GroovyEventHandler.handle(GroovyEventHandler.java:30)
04-May-2021 01:52:05         at org.eclipse.jdt.internal.core.JavaProject.close(JavaProject.java:548)
04-May-2021 01:52:05         at org.eclipse.jdt.internal.core.ClasspathChange.generateDelta(ClasspathChange.java:283)
04-May-2021 01:52:05         at org.eclipse.jdt.internal.core.DeltaProcessor.resourceChanged(DeltaProcessor.java:2127)
04-May-2021 01:52:05         at org.eclipse.jdt.internal.core.DeltaProcessingState.resourceChanged(DeltaProcessingState.java:477)
04-May-2021 01:52:05         at org.eclipse.core.internal.events.NotificationManager$1.run(NotificationManager.java:305)
04-May-2021 01:52:05         at org.eclipse.core.runtime.SafeRunner.run(SafeRunner.java:45)
04-May-2021 01:52:05         at org.eclipse.core.internal.events.NotificationManager.notify(NotificationManager.java:295)
04-May-2021 01:52:05         at org.eclipse.core.internal.events.NotificationManager.broadcastChanges(NotificationManager.java:158)
04-May-2021 01:52:05         at org.eclipse.core.internal.resources.Workspace.broadcastPostChange(Workspace.java:381)
04-May-2021 01:52:05         at org.eclipse.core.internal.resources.Workspace.endOperation(Workspace.java:1503)
04-May-2021 01:52:05         at org.eclipse.core.internal.resources.Workspace.run(Workspace.java:2327)
04-May-2021 01:52:05         at org.eclipse.core.internal.resources.Workspace.run(Workspace.java:2338)
04-May-2021 01:52:05         at org.eclipse.jdt.internal.core.JavaModelOperation.runOperation(JavaModelOperation.java:811)
04-May-2021 01:52:05         at org.eclipse.jdt.internal.core.JavaProject.setRawClasspath(JavaProject.java:3650)
04-May-2021 01:52:05         at org.eclipse.jdt.internal.core.JavaProject.setRawClasspath(JavaProject.java:3610)
04-May-2021 01:52:05         at org.eclipse.jdt.internal.core.JavaProject.setRawClasspath(JavaProject.java:3666)
04-May-2021 01:52:05         at org.codehaus.groovy.eclipse.core.model.GroovyRuntime.removeClasspathEntry(GroovyRuntime.java:150)
04-May-2021 01:52:05         at org.codehaus.groovy.eclipse.actions.RemoveGroovyNatureAction.lambda$1(RemoveGroovyNatureAction.java:67)
04-May-2021 01:52:05         at org.codehaus.groovy.eclipse.actions.RemoveGroovyNatureAction$$Lambda$16756/0x0000000101fc8c40.accept(Unknown Source)
04-May-2021 01:52:05         at [email protected]/java.util.Optional.ifPresent(Optional.java:183)
04-May-2021 01:52:05         at org.codehaus.groovy.eclipse.actions.RemoveGroovyNatureAction.run(RemoveGroovyNatureAction.java:67)
04-May-2021 01:52:05         at org.eclipse.ui.IActionDelegate$run$0.call(Unknown Source)
04-May-2021 01:52:05         at org.codehaus.groovy.runtime.callsite.CallSiteArray.defaultCall(CallSiteArray.java:47)
04-May-2021 01:52:05         at org.codehaus.groovy.runtime.callsite.AbstractCallSite.call(AbstractCallSite.java:125)
04-May-2021 01:52:05         at org.codehaus.groovy.runtime.callsite.AbstractCallSite.call(AbstractCallSite.java:139)
04-May-2021 01:52:05         at org.codehaus.groovy.eclipse.test.actions.GroovyNatureActionTests.testRemoveGroovyNature(GroovyNatureActionTests.groovy:102)
04-May-2021 01:52:05         at [email protected]/jdk.internal.reflect.NativeMethodAccessorImpl.invoke0(Native Method)
04-May-2021 01:52:05         at [email protected]/jdk.internal.reflect.NativeMethodAccessorImpl.invoke(NativeMethodAccessorImpl.java:62)
04-May-2021 01:52:05         at [email protected]/jdk.internal.reflect.DelegatingMethodAccessorImpl.invoke(DelegatingMethodAccessorImpl.java:43)
04-May-2021 01:52:05         at [email protected]/java.lang.reflect.Method.invoke(Method.java:566)
04-May-2021 01:52:05         at org.junit.runners.model.FrameworkMethod$1.runReflectiveCall(FrameworkMethod.java:59)
04-May-2021 01:52:05         at org.junit.internal.runners.model.ReflectiveCallable.run(ReflectiveCallable.java:12)
04-May-2021 01:52:05         at org.junit.runners.model.FrameworkMethod.invokeExplosively(FrameworkMethod.java:56)
04-May-2021 01:52:05         at org.junit.internal.runners.statements.InvokeMethod.evaluate(InvokeMethod.java:17)
04-May-2021 01:52:05         at org.junit.internal.runners.statements.RunBefores.evaluate(RunBefores.java:26)
04-May-2021 01:52:05         at org.junit.internal.runners.statements.RunAfters.evaluate(RunAfters.java:27)
04-May-2021 01:52:05         at org.junit.rules.TestWatcher$1.evaluate(TestWatcher.java:61)
04-May-2021 01:52:05         at org.junit.runners.ParentRunner$3.evaluate(ParentRunner.java:306)
04-May-2021 01:52:05         at org.junit.runners.BlockJUnit4ClassRunner$1.evaluate(BlockJUnit4ClassRunner.java:100)
04-May-2021 01:52:05         at org.junit.runners.ParentRunner.runLeaf(ParentRunner.java:366)
04-May-2021 01:52:05         at org.junit.runners.BlockJUnit4ClassRunner.runChild(BlockJUnit4ClassRunner.java:103)
04-May-2021 01:52:05         at org.junit.runners.BlockJUnit4ClassRunner.runChild(BlockJUnit4ClassRunner.java:63)
04-May-2021 01:52:05         at org.junit.runners.ParentRunner$4.run(ParentRunner.java:331)
04-May-2021 01:52:05         at org.junit.runners.ParentRunner$1.schedule(ParentRunner.java:79)
04-May-2021 01:52:05         at org.junit.runners.ParentRunner.runChildren(ParentRunner.java:329)
04-May-2021 01:52:05         at org.junit.runners.ParentRunner.access$100(ParentRunner.java:66)
04-May-2021 01:52:05         at org.junit.runners.ParentRunner$2.evaluate(ParentRunner.java:293)
04-May-2021 01:52:05         at org.junit.internal.runners.statements.RunBefores.evaluate(RunBefores.java:26)
04-May-2021 01:52:05         at org.junit.internal.runners.statements.RunAfters.evaluate(RunAfters.java:27)
04-May-2021 01:52:05         at org.junit.runners.ParentRunner$3.evaluate(ParentRunner.java:306)
04-May-2021 01:52:05         at org.junit.runners.ParentRunner.run(ParentRunner.java:413)
04-May-2021 01:52:05         at org.junit.runners.Suite.runChild(Suite.java:128)
04-May-2021 01:52:05         at org.junit.runners.Suite.runChild(Suite.java:27)
04-May-2021 01:52:05         at org.junit.runners.ParentRunner$4.run(ParentRunner.java:331)
04-May-2021 01:52:05         at org.junit.runners.ParentRunner$1.schedule(ParentRunner.java:79)
04-May-2021 01:52:05         at org.junit.runners.ParentRunner.runChildren(ParentRunner.java:329)
04-May-2021 01:52:05         at org.junit.runners.ParentRunner.access$100(ParentRunner.java:66)
04-May-2021 01:52:05         at org.junit.runners.ParentRunner$2.evaluate(ParentRunner.java:293)
04-May-2021 01:52:05         at org.junit.internal.runners.statements.RunBefores.evaluate(RunBefores.java:26)
04-May-2021 01:52:05         at org.junit.runners.ParentRunner$3.evaluate(ParentRunner.java:306)
04-May-2021 01:52:05         at org.junit.runners.ParentRunner.run(ParentRunner.java:413)
04-May-2021 01:52:05         at org.junit.runner.JUnitCore.run(JUnitCore.java:137)
04-May-2021 01:52:05         at org.junit.runner.JUnitCore.run(JUnitCore.java:115)
04-May-2021 01:52:05         at org.junit.vintage.engine.execution.RunnerExecutor.execute(RunnerExecutor.java:43)
04-May-2021 01:52:05         at org.junit.vintage.engine.VintageTestEngine$$Lambda$813/0x0000000100a06040.accept(Unknown Source)
04-May-2021 01:52:05         at [email protected]/java.util.stream.ForEachOps$ForEachOp$OfRef.accept(ForEachOps.java:183)
04-May-2021 01:52:05         at [email protected]/java.util.stream.ReferencePipeline$3$1.accept(ReferencePipeline.java:195)
04-May-2021 01:52:05         at [email protected]/java.util.Iterator.forEachRemaining(Iterator.java:133)
04-May-2021 01:52:05         at [email protected]/java.util.Spliterators$IteratorSpliterator.forEachRemaining(Spliterators.java:1801)
04-May-2021 01:52:05         at [email protected]/java.util.stream.AbstractPipeline.copyInto(AbstractPipeline.java:484)
04-May-2021 01:52:05         at [email protected]/java.util.stream.AbstractPipeline.wrapAndCopyInto(AbstractPipeline.java:474)
04-May-2021 01:52:05         at [email protected]/java.util.stream.ForEachOps$ForEachOp.evaluateSequential(ForEachOps.java:150)
04-May-2021 01:52:05         at [email protected]/java.util.stream.ForEachOps$ForEachOp$OfRef.evaluateSequential(ForEachOps.java:173)
04-May-2021 01:52:05         at [email protected]/java.util.stream.AbstractPipeline.evaluate(AbstractPipeline.java:234)
04-May-2021 01:52:05         at [email protected]/java.util.stream.ReferencePipeline.forEach(ReferencePipeline.java:497)
04-May-2021 01:52:05         at org.junit.vintage.engine.VintageTestEngine.executeAllChildren(VintageTestEngine.java:82)
04-May-2021 01:52:05         at org.junit.vintage.engine.VintageTestEngine.execute(VintageTestEngine.java:73)
04-May-2021 01:52:05         at org.junit.platform.launcher.core.EngineExecutionOrchestrator.execute(EngineExecutionOrchestrator.java:108)
04-May-2021 01:52:05         at org.junit.platform.launcher.core.EngineExecutionOrchestrator.execute(EngineExecutionOrchestrator.java:88)
04-May-2021 01:52:05         at org.junit.platform.launcher.core.EngineExecutionOrchestrator.lambda$execute$0(EngineExecutionOrchestrator.java:54)
04-May-2021 01:52:05         at org.junit.platform.launcher.core.EngineExecutionOrchestrator$$Lambda$763/0x00000001009d9440.accept(Unknown Source)
04-May-2021 01:52:05         at org.junit.platform.launcher.core.EngineExecutionOrchestrator.withInterceptedStreams(EngineExecutionOrchestrator.java:67)
04-May-2021 01:52:05         at org.junit.platform.launcher.core.EngineExecutionOrchestrator.execute(EngineExecutionOrchestrator.java:52)
04-May-2021 01:52:05         at org.junit.platform.launcher.core.DefaultLauncher.execute(DefaultLauncher.java:96)
04-May-2021 01:52:05         at org.junit.platform.launcher.core.DefaultLauncher.execute(DefaultLauncher.java:75)
04-May-2021 01:52:05         at org.apache.maven.surefire.junitplatform.JUnitPlatformProvider.invokeAllTests(JUnitPlatformProvider.java:150)
04-May-2021 01:52:05         at org.apache.maven.surefire.junitplatform.JUnitPlatformProvider.invoke(JUnitPlatformProvider.java:124)
04-May-2021 01:52:05         at [email protected]/jdk.internal.reflect.NativeMethodAccessorImpl.invoke0(Native Method)
04-May-2021 01:52:05         at [email protected]/jdk.internal.reflect.NativeMethodAccessorImpl.invoke(NativeMethodAccessorImpl.java:62)
04-May-2021 01:52:05         at [email protected]/jdk.internal.reflect.DelegatingMethodAccessorImpl.invoke(DelegatingMethodAccessorImpl.java:43)
04-May-2021 01:52:05         at [email protected]/java.lang.reflect.Method.invoke(Method.java:566)
04-May-2021 01:52:05         at org.apache.maven.surefire.util.ReflectionUtils.invokeMethodWithArray2(ReflectionUtils.java:206)
04-May-2021 01:52:05         at org.apache.maven.surefire.booter.ProviderFactory$ProviderProxy.invoke(ProviderFactory.java:161)
04-May-2021 01:52:05         at org.apache.maven.surefire.booter.ProviderFactory.invokeProvider(ProviderFactory.java:84)
04-May-2021 01:52:05         at org.eclipse.tycho.surefire.osgibooter.OsgiSurefireBooter.run(OsgiSurefireBooter.java:116)
04-May-2021 01:52:05         at org.eclipse.tycho.surefire.osgibooter.AbstractUITestApplication$1.run(AbstractUITestApplication.java:37)
04-May-2021 01:52:05         at org.eclipse.swt.widgets.RunnableLock.run(RunnableLock.java:40)
04-May-2021 01:52:05         at org.eclipse.swt.widgets.Synchronizer.runAsyncMessages(Synchronizer.java:185)
04-May-2021 01:52:05         at org.eclipse.swt.widgets.Display.runAsyncMessages(Display.java:5096)
04-May-2021 01:52:05         at org.eclipse.swt.widgets.Display.readAndDispatch(Display.java:4602)
04-May-2021 01:52:05         at org.eclipse.e4.ui.internal.workbench.swt.PartRenderingEngine$5.run(PartRenderingEngine.java:1157)
04-May-2021 01:52:05         at org.eclipse.core.databinding.observable.Realm.runWithDefault(Realm.java:338)
04-May-2021 01:52:05         at org.eclipse.e4.ui.internal.workbench.swt.PartRenderingEngine.run(PartRenderingEngine.java:1046)
04-May-2021 01:52:05         at org.eclipse.e4.ui.internal.workbench.E4Workbench.createAndRunUI(E4Workbench.java:155)
04-May-2021 01:52:05         at org.eclipse.ui.internal.Workbench.lambda$3(Workbench.java:644)
04-May-2021 01:52:05         at org.eclipse.ui.internal.Workbench$$Lambda$108/0x00000001002fa040.run(Unknown Source)
04-May-2021 01:52:05         at org.eclipse.core.databinding.observable.Realm.runWithDefault(Realm.java:338)
04-May-2021 01:52:05         at org.eclipse.ui.internal.Workbench.createAndRunWorkbench(Workbench.java:551)
04-May-2021 01:52:05         at org.eclipse.ui.PlatformUI.createAndRunWorkbench(PlatformUI.java:156)
04-May-2021 01:52:05         at org.eclipse.ui.internal.ide.application.IDEApplication.start(IDEApplication.java:152)
04-May-2021 01:52:05         at org.eclipse.tycho.surefire.osgibooter.UITestApplication.runApplication(UITestApplication.java:29)
04-May-2021 01:52:05         at org.eclipse.tycho.surefire.osgibooter.AbstractUITestApplication.run(AbstractUITestApplication.java:122)
04-May-2021 01:52:05         at org.eclipse.tycho.surefire.osgibooter.UITestApplication.start(UITestApplication.java:35)
04-May-2021 01:52:05         at org.eclipse.equinox.internal.app.EclipseAppHandle.run(EclipseAppHandle.java:203)
04-May-2021 01:52:05         at org.eclipse.core.runtime.internal.adaptor.EclipseAppLauncher.runApplication(EclipseAppLauncher.java:134)
04-May-2021 01:52:05         at org.eclipse.core.runtime.internal.adaptor.EclipseAppLauncher.start(EclipseAppLauncher.java:104)
04-May-2021 01:52:05         at org.eclipse.core.runtime.adaptor.EclipseStarter.run(EclipseStarter.java:401)
04-May-2021 01:52:05         at org.eclipse.core.runtime.adaptor.EclipseStarter.run(EclipseStarter.java:255)
04-May-2021 01:52:05         at [email protected]/jdk.internal.reflect.NativeMethodAccessorImpl.invoke0(Native Method)
04-May-2021 01:52:05         at [email protected]/jdk.internal.reflect.NativeMethodAccessorImpl.invoke(NativeMethodAccessorImpl.java:62)
04-May-2021 01:52:05         at [email protected]/jdk.internal.reflect.DelegatingMethodAccessorImpl.invoke(DelegatingMethodAccessorImpl.java:43)
04-May-2021 01:52:05         at [email protected]/java.lang.reflect.Method.invoke(Method.java:566)
04-May-2021 01:52:05         at app//org.eclipse.equinox.launcher.Main.invokeFramework(Main.java:653)
04-May-2021 01:52:05         at app//org.eclipse.equinox.launcher.Main.basicRun(Main.java:590)
04-May-2021 01:52:05         at app//org.eclipse.equinox.launcher.Main.run(Main.java:1461)
04-May-2021 01:52:05         at app//org.eclipse.equinox.launcher.Main.main(Main.java:1434)
04-May-2021 01:52:05 java.lang.Exception: ThreadDump for thread "Worker-6: Compacting resource model"
04-May-2021 01:52:05         at [email protected]/java.lang.Object.wait(Native Method)
04-May-2021 01:52:05         at [email protected]/java.lang.Object.wait(Object.java:328)
04-May-2021 01:52:05         at org.eclipse.core.internal.jobs.ThreadJob.waitForRun(ThreadJob.java:316)
04-May-2021 01:52:05         at org.eclipse.core.internal.jobs.ThreadJob.joinRun(ThreadJob.java:205)
04-May-2021 01:52:05         at org.eclipse.core.internal.jobs.ImplicitJobs.begin(ImplicitJobs.java:95)
04-May-2021 01:52:05         at org.eclipse.core.internal.jobs.JobManager.beginRule(JobManager.java:299)
04-May-2021 01:52:05         at org.eclipse.core.internal.utils.StringPoolJob.run(StringPoolJob.java:101)
04-May-2021 01:52:05         at org.eclipse.core.internal.jobs.Worker.run(Worker.java:63)
04-May-2021 01:52:05 java.lang.Exception: ThreadDump for thread "Worker-JM"
04-May-2021 01:52:05         at [email protected]/java.lang.Object.wait(Native Method)
04-May-2021 01:52:05         at org.eclipse.core.internal.jobs.InternalWorker.run(InternalWorker.java:61)
04-May-2021 01:52:05 java.lang.Exception: ThreadDump for thread "Common-Cleaner"
04-May-2021 01:52:05         at [email protected]/java.lang.Object.wait(Native Method)
04-May-2021 01:52:05         at [email protected]/java.lang.ref.ReferenceQueue.remove(ReferenceQueue.java:155)
04-May-2021 01:52:05         at [email protected]/jdk.internal.ref.CleanerImpl.run(CleanerImpl.java:148)
04-May-2021 01:52:05         at [email protected]/java.lang.Thread.run(Thread.java:829)
04-May-2021 01:52:05         at [email protected]/jdk.internal.misc.InnocuousThread.run(InnocuousThread.java:134)
04-May-2021 01:52:05 java.lang.Exception: ThreadDump for thread "Finalizer"
04-May-2021 01:52:05         at [email protected]/java.lang.Object.wait(Native Method)
04-May-2021 01:52:05         at [email protected]/java.lang.ref.ReferenceQueue.remove(ReferenceQueue.java:155)
04-May-2021 01:52:05         at [email protected]/java.lang.ref.ReferenceQueue.remove(ReferenceQueue.java:176)
04-May-2021 01:52:05         at [email protected]/java.lang.ref.Finalizer$FinalizerThread.run(Finalizer.java:170)
04-May-2021 01:52:05 java.lang.Exception: ThreadDump for thread "Equinox Log Thread - Equinox Container: 8ffcc8eb-fd26-47cf-b550-419b5e1a9e3b"
04-May-2021 01:52:05         at [email protected]/jdk.internal.misc.Unsafe.park(Native Method)
04-May-2021 01:52:05         at [email protected]/java.util.concurrent.locks.LockSupport.parkNanos(LockSupport.java:234)
04-May-2021 01:52:05         at [email protected]/java.util.concurrent.locks.AbstractQueuedSynchronizer$ConditionObject.awaitNanos(AbstractQueuedSynchronizer.java:2123)
04-May-2021 01:52:05         at [email protected]/java.util.concurrent.LinkedBlockingQueue.poll(LinkedBlockingQueue.java:458)
04-May-2021 01:52:05         at [email protected]/java.util.concurrent.ThreadPoolExecutor.getTask(ThreadPoolExecutor.java:1053)
04-May-2021 01:52:05         at [email protected]/java.util.concurrent.ThreadPoolExecutor.runWorker(ThreadPoolExecutor.java:1114)
04-May-2021 01:52:05         at [email protected]/java.util.concurrent.ThreadPoolExecutor$Worker.run(ThreadPoolExecutor.java:628)
04-May-2021 01:52:05         at [email protected]/java.lang.Thread.run(Thread.java:829)
04-May-2021 01:52:05 java.lang.Exception: ThreadDump for thread "pool-2-thread-1"
04-May-2021 01:52:05         at [email protected]/jdk.internal.misc.Unsafe.park(Native Method)
04-May-2021 01:52:05         at [email protected]/java.util.concurrent.locks.LockSupport.park(LockSupport.java:194)
04-May-2021 01:52:05         at [email protected]/java.util.concurrent.locks.AbstractQueuedSynchronizer$ConditionObject.await(AbstractQueuedSynchronizer.java:2081)
04-May-2021 01:52:05         at [email protected]/java.util.concurrent.LinkedBlockingQueue.take(LinkedBlockingQueue.java:433)
04-May-2021 01:52:05         at [email protected]/java.util.concurrent.ThreadPoolExecutor.getTask(ThreadPoolExecutor.java:1054)
04-May-2021 01:52:05         at [email protected]/java.util.concurrent.ThreadPoolExecutor.runWorker(ThreadPoolExecutor.java:1114)
04-May-2021 01:52:05         at [email protected]/java.util.concurrent.ThreadPoolExecutor$Worker.run(ThreadPoolExecutor.java:628)
04-May-2021 01:52:05         at [email protected]/java.lang.Thread.run(Thread.java:829)
04-May-2021 01:52:05 java.lang.Exception: ThreadDump for thread "Reference Handler"
04-May-2021 01:52:05         at [email protected]/java.lang.Object.notifyAll(Native Method)
04-May-2021 01:52:05         at [email protected]/java.lang.ref.ReferenceQueue.enqueue(ReferenceQueue.java:80)
04-May-2021 01:52:05         at [email protected]/java.lang.ref.Reference.processPendingReferences(Reference.java:262)
04-May-2021 01:52:05         at [email protected]/java.lang.ref.Reference$ReferenceHandler.run(Reference.java:213)
04-May-2021 01:52:05 java.lang.Exception: ThreadDump for thread "DumpStackTracesTimer"
04-May-2021 01:52:05         at [email protected]/java.lang.Thread.dumpThreads(Native Method)
04-May-2021 01:52:05         at [email protected]/java.lang.Thread.getAllStackTraces(Thread.java:1653)
04-May-2021 01:52:05         at org.eclipse.tycho.surefire.osgibooter.DumpStackTracesTimer.dumpStackTraces(DumpStackTracesTimer.java:136)
04-May-2021 01:52:05         at org.eclipse.tycho.surefire.osgibooter.DumpStackTracesTimer.logStackTraces(DumpStackTracesTimer.java:122)
04-May-2021 01:52:05         at org.eclipse.tycho.surefire.osgibooter.DumpStackTracesTimer.dump(DumpStackTracesTimer.java:110)
04-May-2021 01:52:05         at org.eclipse.tycho.surefire.osgibooter.DumpStackTracesTimer.run(DumpStackTracesTimer.java:101)
04-May-2021 01:52:05         at [email protected]/java.util.TimerThread.mainLoop(Timer.java:556)
04-May-2021 01:52:05         at [email protected]/java.util.TimerThread.run(Timer.java:506)
04-May-2021 01:52:05 java.lang.Exception: ThreadDump for thread "Equinox Log Thread - Equinox Container: 8ffcc8eb-fd26-47cf-b550-419b5e1a9e3b"
04-May-2021 01:52:05         at [email protected]/jdk.internal.misc.Unsafe.park(Native Method)
04-May-2021 01:52:05         at [email protected]/java.util.concurrent.locks.LockSupport.parkNanos(LockSupport.java:234)
04-May-2021 01:52:05         at [email protected]/java.util.concurrent.locks.AbstractQueuedSynchronizer$ConditionObject.awaitNanos(AbstractQueuedSynchronizer.java:2123)
04-May-2021 01:52:05         at [email protected]/java.util.concurrent.LinkedBlockingQueue.poll(LinkedBlockingQueue.java:458)
04-May-2021 01:52:05         at [email protected]/java.util.concurrent.ThreadPoolExecutor.getTask(ThreadPoolExecutor.java:1053)
04-May-2021 01:52:05         at [email protected]/java.util.concurrent.ThreadPoolExecutor.runWorker(ThreadPoolExecutor.java:1114)
04-May-2021 01:52:05         at [email protected]/java.util.concurrent.ThreadPoolExecutor$Worker.run(ThreadPoolExecutor.java:628)
04-May-2021 01:52:05         at [email protected]/java.lang.Thread.run(Thread.java:829)
04-May-2021 01:52:05 java.lang.Exception: ThreadDump for thread "Java indexing"
04-May-2021 01:52:05         at [email protected]/java.util.concurrent.ConcurrentHashMap.computeIfAbsent(ConcurrentHashMap.java:1723)
04-May-2021 01:52:05         at org.codehaus.jdt.groovy.internal.compiler.GroovyClassLoaderFactory.getProjectGroovyClassLoaders(GroovyClassLoaderFactory.java:157)
04-May-2021 01:52:05         at org.codehaus.jdt.groovy.internal.compiler.GroovyClassLoaderFactory.getGroovyClassLoaders(GroovyClassLoaderFactory.java:122)
04-May-2021 01:52:05         at org.codehaus.jdt.groovy.internal.compiler.ast.GroovyParser.lambda$0(GroovyParser.java:144)
04-May-2021 01:52:05         at org.codehaus.jdt.groovy.internal.compiler.ast.GroovyParser$$Lambda$927/0x0000000100ada440.get(Unknown Source)
04-May-2021 01:52:05         at org.codehaus.jdt.groovy.internal.compiler.ast.GroovyParser.dietParse(GroovyParser.java:215)
04-May-2021 01:52:05         at org.codehaus.jdt.groovy.integration.internal.MultiplexingIndexingParser.parseCompilationUnit(MultiplexingIndexingParser.java:63)
04-May-2021 01:52:05         at org.eclipse.jdt.internal.core.search.indexing.SourceIndexer.indexDocument(SourceIndexer.java:115)
04-May-2021 01:52:05         at org.eclipse.jdt.internal.core.search.JavaSearchParticipant.indexDocument(JavaSearchParticipant.java:83)
04-May-2021 01:52:05         at org.eclipse.jdt.internal.core.search.indexing.IndexManager.indexDocument(IndexManager.java:550)
04-May-2021 01:52:05         at org.eclipse.jdt.internal.core.search.indexing.IndexManager$1.execute(IndexManager.java:1078)
04-May-2021 01:52:05         at org.eclipse.jdt.internal.core.search.processing.JobManager.run(JobManager.java:414)
04-May-2021 01:52:05         at [email protected]/java.lang.Thread.run(Thread.java:829)
04-May-2021 01:52:05 java.lang.Exception: ThreadDump for thread "Signal Dispatcher"
04-May-2021 01:52:05 java.lang.Exception: ThreadDump for thread "Worker-5: Refresh DSLD scripts"
04-May-2021 01:52:05         at [email protected]/java.lang.Object.wait(Native Method)
04-May-2021 01:52:05         at org.eclipse.core.internal.jobs.Semaphore.acquire(Semaphore.java:44)
04-May-2021 01:52:05         at org.eclipse.core.internal.jobs.OrderedLock.doAcquire(OrderedLock.java:173)
04-May-2021 01:52:05         at org.eclipse.core.internal.jobs.OrderedLock.acquire(OrderedLock.java:109)
04-May-2021 01:52:05         at org.eclipse.core.internal.jobs.OrderedLock.acquire(OrderedLock.java:85)
04-May-2021 01:52:05         at org.eclipse.core.internal.resources.WorkManager.checkIn(WorkManager.java:125)
04-May-2021 01:52:05         at org.eclipse.core.internal.resources.Workspace.prepareOperation(Workspace.java:2263)
04-May-2021 01:52:05         at org.eclipse.core.internal.resources.Workspace.run(Workspace.java:2308)
04-May-2021 01:52:05         at org.eclipse.core.internal.resources.Workspace.run(Workspace.java:2338)
04-May-2021 01:52:05         at org.eclipse.jdt.internal.core.JavaModelManager.initializeAllContainers(JavaModelManager.java:3146)
04-May-2021 01:52:05         at org.eclipse.jdt.internal.core.JavaModelManager.getClasspathContainer(JavaModelManager.java:2113)
04-May-2021 01:52:05         at org.eclipse.jdt.core.JavaCore.getClasspathContainer(JavaCore.java:3764)
04-May-2021 01:52:05         at org.eclipse.jdt.launching.JavaRuntime.computeDefaultContainerEntries(JavaRuntime.java:1554)
04-May-2021 01:52:05         at org.eclipse.jdt.launching.JavaRuntime.resolveRuntimeClasspathEntry(JavaRuntime.java:1503)
04-May-2021 01:52:05         at org.eclipse.jdt.internal.launching.DefaultEntryResolver.resolveRuntimeClasspathEntry(DefaultEntryResolver.java:70)
04-May-2021 01:52:05         at org.eclipse.jdt.launching.JavaRuntime.resolveRuntimeClasspathEntry(JavaRuntime.java:1508)
04-May-2021 01:52:05         at jdk.internal.reflect.GeneratedMethodAccessor3920.invoke(Unknown Source)
04-May-2021 01:52:05         at [email protected]/jdk.internal.reflect.DelegatingMethodAccessorImpl.invoke(DelegatingMethodAccessorImpl.java:43)
04-May-2021 01:52:05         at [email protected]/java.lang.reflect.Method.invoke(Method.java:566)
04-May-2021 01:52:05         at org.codehaus.jdt.groovy.internal.compiler.GroovyClassLoaderFactory.resolveRuntimeClasspathEntry(GroovyClassLoaderFactory.java:246)
04-May-2021 01:52:05         at org.codehaus.jdt.groovy.internal.compiler.GroovyClassLoaderFactory.calculateClasspath(GroovyClassLoaderFactory.java:233)
04-May-2021 01:52:05         at org.codehaus.jdt.groovy.internal.compiler.GroovyClassLoaderFactory.lambda$2(GroovyClassLoaderFactory.java:159)
04-May-2021 01:52:05         at org.codehaus.jdt.groovy.internal.compiler.GroovyClassLoaderFactory$$Lambda$932/0x0000000100b3e840.apply(Unknown Source)
04-May-2021 01:52:05         at [email protected]/java.util.concurrent.ConcurrentHashMap.computeIfAbsent(ConcurrentHashMap.java:1705)
04-May-2021 01:52:05         at org.codehaus.jdt.groovy.internal.compiler.GroovyClassLoaderFactory.getProjectGroovyClassLoaders(GroovyClassLoaderFactory.java:157)
04-May-2021 01:52:05         at org.codehaus.jdt.groovy.internal.compiler.GroovyClassLoaderFactory.getGroovyClassLoaders(GroovyClassLoaderFactory.java:122)
04-May-2021 01:52:05         at org.codehaus.jdt.groovy.integration.internal.GroovyLanguageSupport.newGroovyClassLoader(GroovyLanguageSupport.java:289)
04-May-2021 01:52:05         at org.codehaus.groovy.eclipse.dsl.script.DSLDScriptExecutor.getGroovyClassLoader(DSLDScriptExecutor.java:136)
04-May-2021 01:52:05         at org.codehaus.groovy.eclipse.dsl.script.DSLDScriptExecutor.executeScript(DSLDScriptExecutor.java:72)
04-May-2021 01:52:05         at org.codehaus.groovy.eclipse.dsl.RefreshDSLDJob.refreshProject(RefreshDSLDJob.java:189)
04-May-2021 01:52:05         at org.codehaus.groovy.eclipse.dsl.RefreshDSLDJob.run(RefreshDSLDJob.java:118)
04-May-2021 01:52:05         at org.eclipse.core.internal.jobs.Worker.run(Worker.java:63)
04-May-2021 01:52:05 java.lang.Exception: ThreadDump for thread "WorkbenchTestable"
04-May-2021 01:52:05         at [email protected]/java.lang.Object.wait(Native Method)
04-May-2021 01:52:05         at [email protected]/java.lang.Object.wait(Object.java:328)
04-May-2021 01:52:05         at org.eclipse.swt.widgets.Synchronizer.syncExec(Synchronizer.java:253)
04-May-2021 01:52:05         at org.eclipse.ui.internal.UISynchronizer.syncExec(UISynchronizer.java:133)
04-May-2021 01:52:05         at org.eclipse.swt.widgets.Display.syncExec(Display.java:5996)
04-May-2021 01:52:05         at org.eclipse.e4.ui.internal.workbench.swt.E4Testable.runTest(E4Testable.java:115)
04-May-2021 01:52:05         at org.eclipse.tycho.surefire.osgibooter.AbstractUITestApplication.runTests(AbstractUITestApplication.java:34)
04-May-2021 01:52:05         at org.eclipse.e4.ui.internal.workbench.swt.E4Testable.lambda$0(E4Testable.java:76)
04-May-2021 01:52:05         at org.eclipse.e4.ui.internal.workbench.swt.E4Testable$$Lambda$520/0x00000001007a1c40.run(Unknown Source)
04-May-2021 01:52:05         at [email protected]/java.lang.Thread.run(Thread.java:829)
04-May-2021 01:52:05 java.lang.Exception: ThreadDump for thread "Bundle File Closer"
04-May-2021 01:52:05         at [email protected]/java.lang.Object.wait(Native Method)
04-May-2021 01:52:05         at [email protected]/java.lang.Object.wait(Object.java:328)
04-May-2021 01:52:05         at org.eclipse.osgi.framework.eventmgr.EventManager$EventThread.getNextEvent(EventManager.java:400)
04-May-2021 01:52:05         at org.eclipse.osgi.framework.eventmgr.EventManager$EventThread.run(EventManager.java:341)
04-May-2021 01:52:05 java.lang.Exception: ThreadDump for thread "Worker-1: Decoration Calculation"
04-May-2021 01:52:05         at [email protected]/java.lang.Thread.sleep(Native Method)
04-May-2021 01:52:05         at org.eclipse.ui.internal.decorators.DecorationScheduler$1.run(DecorationScheduler.java:341)
04-May-2021 01:52:05         at org.eclipse.core.internal.jobs.Worker.run(Worker.java:63)
04-May-2021 01:52:05 java.lang.Exception: ThreadDump for thread "Worker-2: Java indexing... "
04-May-2021 01:52:05         at [email protected]/java.lang.Thread.sleep(Native Method)
04-May-2021 01:52:05         at org.eclipse.jdt.internal.core.search.processing.JobManager$1ProgressJob.run(JobManager.java:364)
04-May-2021 01:52:05         at org.eclipse.core.internal.jobs.Worker.run(Worker.java:63)
04-May-2021 01:52:05
04-May-2021 01:52:05
04-May-2021 01:52:05 !ENTRY org.eclipse.tycho.surefire.osgibooter 1 0 2021-05-04 01:52:05.273
04-May-2021 01:52:05 !MESSAGE Seconds to do dump 5: 0.419
04-May-2021 01:53:53 [ERROR] Timeout 9000 s exceeded. Process was killed.
04-May-2021 01:53:53 [INFO] ------------------------------------------------------------------------
04-May-2021 01:53:53 [INFO] Reactor Summary:
04-May-2021 01:53:53 [INFO]
04-May-2021 01:53:53 [INFO] org.codehaus.groovy.eclipse.parent 4.2.0-SNAPSHOT .. SUCCESS [  0.376 s]
04-May-2021 01:53:53 [INFO] org.codehaus.groovy 2.5.14-SNAPSHOT ................ SUCCESS [ 15.518 s]
04-May-2021 01:53:53 [INFO] org.codehaus.groovy 3.0.8-SNAPSHOT ................. SUCCESS [  6.636 s]
04-May-2021 01:53:53 [INFO] org.codehaus.groovy 4.0.0-SNAPSHOT ................. SUCCESS [  5.897 s]
04-May-2021 01:53:53 [INFO] org.codehaus.groovy.eclipse.compilerResolver ....... SUCCESS [  2.555 s]
04-May-2021 01:53:53 [INFO] org.eclipse.jdt.core 3.26.0-SNAPSHOT ............... SUCCESS [ 17.512 s]
04-May-2021 01:53:53 [INFO] org.eclipse.jdt.groovy.core ........................ SUCCESS [  2.938 s]
04-May-2021 01:53:53 [INFO] org.codehaus.groovy.eclipse ........................ SUCCESS [  0.707 s]
04-May-2021 01:53:53 [INFO] org.codehaus.groovy.eclipse.core ................... SUCCESS [  1.818 s]
04-May-2021 01:53:53 [INFO] org.codehaus.groovy.eclipse.ant .................... SUCCESS [  1.915 s]
04-May-2021 01:53:53 [INFO] org.codehaus.groovy.eclipse.codebrowsing ........... SUCCESS [  1.761 s]
04-May-2021 01:53:53 [INFO] org.codehaus.groovy.eclipse.refactoring ............ SUCCESS [  2.242 s]
04-May-2021 01:53:53 [INFO] org.codehaus.groovy.eclipse.ui ..................... SUCCESS [  2.671 s]
04-May-2021 01:53:53 [INFO] org.codehaus.groovy.eclipse.astviews ............... SUCCESS [  2.286 s]
04-May-2021 01:53:53 [INFO] org.codehaus.groovy.eclipse.codeassist ............. SUCCESS [  2.196 s]
04-May-2021 01:53:53 [INFO] org.codehaus.groovy.eclipse.dsl .................... SUCCESS [  2.365 s]
04-May-2021 01:53:53 [INFO] org.codehaus.groovy.eclipse.quickfix ............... SUCCESS [  2.344 s]
04-May-2021 01:53:53 [INFO] org.codehaus.groovy25.feature ...................... SUCCESS [  0.826 s]
04-May-2021 01:53:53 [INFO] org.codehaus.groovy30.feature ...................... SUCCESS [  0.875 s]
04-May-2021 01:53:53 [INFO] org.codehaus.groovy40.feature ...................... SUCCESS [  0.727 s]
04-May-2021 01:53:53 [INFO] org.codehaus.groovy.jdt.patch ...................... SUCCESS [  0.740 s]
04-May-2021 01:53:53 [INFO] org.codehaus.groovy.headless.feature ............... SUCCESS [  0.831 s]
04-May-2021 01:53:53 [INFO] org.codehaus.groovy.compilerless.feature ........... SUCCESS [  0.888 s]
04-May-2021 01:53:53 [INFO] org.codehaus.groovy.eclipse.feature ................ SUCCESS [  0.791 s]
04-May-2021 01:53:53 [INFO] org.eclipse.jdt.core.tests.compiler 3.12.1600-SNAPSHOT SUCCESS [  6.320 s]
04-May-2021 01:53:53 [INFO] org.eclipse.jdt.core.tests.builder 3.10.1200-SNAPSHOT SUCCESS [  2.167 s]
04-May-2021 01:53:53 [INFO] org.eclipse.jdt.groovy.core.tests.compiler ......... SUCCESS [  1.893 s]
04-May-2021 01:53:53 [INFO] org.eclipse.jdt.groovy.core.tests.builder .......... SUCCESS [  2.377 s]
04-May-2021 01:53:53 [INFO] org.codehaus.groovy.eclipse.tests .................. SUCCESS [  3.534 s]
04-May-2021 01:53:53 [INFO] org.codehaus.groovy.eclipse.codeassist.test ........ SUCCESS [  3.223 s]
04-May-2021 01:53:53 [INFO] org.codehaus.groovy.eclipse.codebrowsing.test ...... SUCCESS [  2.344 s]
04-May-2021 01:53:53 [INFO] org.codehaus.groovy.eclipse.core.test .............. SUCCESS [  2.007 s]
04-May-2021 01:53:53 [INFO] org.codehaus.groovy.eclipse.dsl.tests .............. SUCCESS [  2.508 s]
04-May-2021 01:53:53 [INFO] org.codehaus.groovy.eclipse.junit.test ............. SUCCESS [  1.743 s]
04-May-2021 01:53:53 [INFO] org.codehaus.groovy.eclipse.refactoring.test ....... SUCCESS [  2.965 s]
04-May-2021 01:53:53 [INFO] org.codehaus.groovy.eclipse.quickfix.test .......... SUCCESS [  2.126 s]
04-May-2021 01:53:53 [INFO] org.codehaus.groovy.alltests ....................... FAILURE [  02:31 h]
04-May-2021 01:53:53 [INFO] org.codehaus.groovy.m2eclipse ...................... SKIPPED
04-May-2021 01:53:53 [INFO] org.codehaus.groovy.m2eclipse.feature .............. SKIPPED
04-May-2021 01:53:53 [INFO] org.codehaus.groovy.eclipse.site 4.2.0-SNAPSHOT .... SKIPPED
04-May-2021 01:53:53 [INFO] ------------------------------------------------------------------------
04-May-2021 01:53:53 [INFO] BUILD FAILURE
04-May-2021 01:53:53 [INFO] ------------------------------------------------------------------------
04-May-2021 01:53:53 [INFO] Total time: 02:35 h
04-May-2021 01:53:53 [INFO] Finished at: 2021-05-04T01:53:53Z
04-May-2021 01:53:53 [INFO] ------------------------------------------------------------------------
04-May-2021 01:53:53 [WARNING] The requested profile "snapshot" could not be activated because it does not exist.
04-May-2021 01:53:53 [ERROR] Failed to execute goal org.eclipse.tycho:tycho-surefire-plugin:2.3.0:test (default-test) on project org.codehaus.groovy.alltests: An unexpected error occurred while launching the test runtime (process returned error code 143(SIGTERM received?)). The process logfile /opt/bamboo-home/xml-data/build-dir/GRECLIPSE-E420-JOB1/ide-test/org.codehaus.groovy.alltests/target/work/data/.metadata/.log might contain further details. Command-line used to launch the sub-process was null -Dosgi.noShutdown=false -Dosgi.os=linux -Dosgi.ws=gtk -Dosgi.arch=x86_64 -Xmx1G -XX:-OmitStackTraceInFastThrow -Dosgi.clean=true -jar /opt/users/bamboo/.m2/repository/p2/osgi/bundle/org.eclipse.equinox.launcher/1.6.100.v20201223-0822/org.eclipse.equinox.launcher-1.6.100.v20201223-0822.jar -debug -consolelog -data /opt/bamboo-home/xml-data/build-dir/GRECLIPSE-E420-JOB1/ide-test/org.codehaus.groovy.alltests/target/work/data -install /opt/bamboo-home/xml-data/build-dir/GRECLIPSE-E420-JOB1/ide-test/org.codehaus.groovy.alltests/target/work -configuration /opt/bamboo-home/xml-data/build-dir/GRECLIPSE-E420-JOB1/ide-test/org.codehaus.groovy.alltests/target/work/configuration -application org.eclipse.tycho.surefire.osgibooter.uitest -testproperties /opt/bamboo-home/xml-data/build-dir/GRECLIPSE-E420-JOB1/ide-test/org.codehaus.groovy.alltests/target/surefire.properties in working directory /opt/bamboo-home/xml-data/build-dir/GRECLIPSE-E420-JOB1/ide-test/org.codehaus.groovy.alltests -> [Help 1]
04-May-2021 01:53:53 [ERROR]
04-May-2021 01:53:53 [ERROR] To see the full stack trace of the errors, re-run Maven with the -e switch.
04-May-2021 01:53:53 [ERROR] Re-run Maven using the -X switch to enable full debug logging.
04-May-2021 01:53:53 [ERROR]
04-May-2021 01:53:53 [ERROR] For more information about the errors and possible solutions, please read the following articles:
04-May-2021 01:53:53 [ERROR] [Help 1] http://cwiki.apache.org/confluence/display/MAVEN/MojoFailureException
04-May-2021 01:53:53 [ERROR]
04-May-2021 01:53:53 [ERROR] After correcting the problems, you can resume the build with the command
04-May-2021 01:53:53 [ERROR]   mvn <goals> -rf :org.codehaus.groovy.alltests
04-May-2021 01:53:54 Failing task since return code of [/opt/maven-3.5/bin/mvn --batch-mode -Djava.io.tmpdir=/tmp/GRECLIPSE-E420-JOB1 -Pe4.20 clean deploy -Psnapshot] was 1 while expected 0
04-May-2021 01:53:54 Parsing test results under /opt/bamboo-home/xml-data/build-dir/GRECLIPSE-E420-JOB1...
04-May-2021 01:53:54 Finished task 'Maven 3.x' with result: Failed
04-May-2021 01:53:54 Running post build plugin 'Docker Container Cleanup'
04-May-2021 01:53:54 Running post build plugin 'NCover Results Collector'
04-May-2021 01:53:54 Running post build plugin 'Artifactory Release Management Staging'
04-May-2021 01:53:54 Running post build plugin 'Artifactory Build Info Copier'
04-May-2021 01:53:54 Running post build plugin 'Artifactory Gradle Properties Info Copier'
04-May-2021 01:53:54 Running post build plugin 'Clover Results Collector'
04-May-2021 01:53:54 Running post build plugin 'npm Cache Cleanup'
04-May-2021 01:53:54 Running post build plugin 'Artifact Copier'
04-May-2021 01:53:54 Publishing an artifact: surefire-reports
04-May-2021 01:53:56 Unable to publish artifact [surefire-reports]:
04-May-2021 01:53:56 The artifact hasn't been successfully published after 1.866 s
04-May-2021 01:53:56 Publishing an artifact: Zipped Update Site
04-May-2021 01:53:56 Unable to publish artifact [Zipped Update Site]: the source directory /opt/bamboo-home/xml-data/build-dir/GRECLIPSE-E420-JOB1/Site-org.codehaus.groovy.eclipse/target/site does not exist.
04-May-2021 01:53:56 The artifact hasn't been successfully published after 227.4 μs
04-May-2021 01:53:57 Successfully removed working directory at '/opt/bamboo-home/xml-data/build-dir/GRECLIPSE-E420-JOB1'
04-May-2021 01:53:57 Finalising the build...
04-May-2021 01:53:57 Stopping timer.
04-May-2021 01:53:57 Build GRECLIPSE-E420-JOB1-24 completed.
04-May-2021 01:53:58 Running on server: post build plugin 'NCover Results Collector'
04-May-2021 01:53:58 Running on server: post build plugin 'Build Hanging Detection Configuration'
04-May-2021 01:53:58 Running on server: post build plugin 'Bamboo project link creator'
04-May-2021 01:53:58 Running on server: post build plugin 'Clover Delta Calculator'
04-May-2021 01:53:58 Running on server: post build plugin 'Maven Dependencies Postprocessor'
04-May-2021 01:53:58 All post build plugins have finished
04-May-2021 01:53:58 Generating build results summary...
04-May-2021 01:53:58 Saving build results to disk...
04-May-2021 01:53:58 Logging substituted variables...
04-May-2021 01:53:58 Indexing build results...
04-May-2021 01:53:58 Finished building GRECLIPSE-E420-JOB1-24.