E44 build, test and publish

Build: #801 was successful

Job: Default Job was successful

Stages & jobs

  1. Default Stage

Build log

The build generated 36,173 lines of output.The output is too long and has been truncated to the last 1,000 lines. Download or view full build log

09-Jan-2018 22:23:22 testForLoop4(org.eclipse.jdt.core.groovy.tests.search.GenericInferencingTests)  Time elapsed: 0.078 sec
09-Jan-2018 22:23:22 testForLoop5(org.eclipse.jdt.core.groovy.tests.search.GenericInferencingTests)  Time elapsed: 0.084 sec
09-Jan-2018 22:23:22 testForLoop6(org.eclipse.jdt.core.groovy.tests.search.GenericInferencingTests)  Time elapsed: 0.087 sec
09-Jan-2018 22:23:22 testForLoop7(org.eclipse.jdt.core.groovy.tests.search.GenericInferencingTests)  Time elapsed: 0.08 sec
09-Jan-2018 22:23:22 testForLoop8(org.eclipse.jdt.core.groovy.tests.search.GenericInferencingTests)  Time elapsed: 0.08 sec
09-Jan-2018 22:23:22 testForLoop9(org.eclipse.jdt.core.groovy.tests.search.GenericInferencingTests)  Time elapsed: 0.108 sec
09-Jan-2018 22:23:22 testInferringRange1(org.eclipse.jdt.core.groovy.tests.search.GenericInferencingTests)  Time elapsed: 0.086 sec
09-Jan-2018 22:23:22 testInferringRange2(org.eclipse.jdt.core.groovy.tests.search.GenericInferencingTests)  Time elapsed: 0.081 sec
09-Jan-2018 22:23:22 testMapOfList(org.eclipse.jdt.core.groovy.tests.search.GenericInferencingTests)  Time elapsed: 0.09 sec
09-Jan-2018 22:23:22 testList10(org.eclipse.jdt.core.groovy.tests.search.GenericInferencingTests)  Time elapsed: 0.079 sec
09-Jan-2018 22:23:22 testForLoop11(org.eclipse.jdt.core.groovy.tests.search.GenericInferencingTests)  Time elapsed: 0.079 sec
09-Jan-2018 22:23:22 testForLoop2a(org.eclipse.jdt.core.groovy.tests.search.GenericInferencingTests)  Time elapsed: 0.076 sec
09-Jan-2018 22:23:22 testDGMClosure10(org.eclipse.jdt.core.groovy.tests.search.GenericInferencingTests)  Time elapsed: 0.077 sec
09-Jan-2018 22:23:22 testDGMClosure11(org.eclipse.jdt.core.groovy.tests.search.GenericInferencingTests)  Time elapsed: 0.081 sec
09-Jan-2018 22:23:22 testDGMClosure12(org.eclipse.jdt.core.groovy.tests.search.GenericInferencingTests)  Time elapsed: 0.083 sec
09-Jan-2018 22:23:22 testDGMClosure13(org.eclipse.jdt.core.groovy.tests.search.GenericInferencingTests)  Time elapsed: 0.096 sec
09-Jan-2018 22:23:22 testDGMClosure14(org.eclipse.jdt.core.groovy.tests.search.GenericInferencingTests)  Time elapsed: 0.078 sec
09-Jan-2018 22:23:22 testDGMClosure15(org.eclipse.jdt.core.groovy.tests.search.GenericInferencingTests)  Time elapsed: 0.089 sec
09-Jan-2018 22:23:22 testDGMClosure16(org.eclipse.jdt.core.groovy.tests.search.GenericInferencingTests)  Time elapsed: 0.084 sec
09-Jan-2018 22:23:22 testDGMClosure17(org.eclipse.jdt.core.groovy.tests.search.GenericInferencingTests)  Time elapsed: 0.08 sec
09-Jan-2018 22:23:22 testDGMClosure18(org.eclipse.jdt.core.groovy.tests.search.GenericInferencingTests)  Time elapsed: 0.078 sec
09-Jan-2018 22:23:22 testDGMClosure19(org.eclipse.jdt.core.groovy.tests.search.GenericInferencingTests)  Time elapsed: 0.079 sec
09-Jan-2018 22:23:22 testDGMClosure20(org.eclipse.jdt.core.groovy.tests.search.GenericInferencingTests)  Time elapsed: 0.077 sec
09-Jan-2018 22:23:22 testDGMClosure21(org.eclipse.jdt.core.groovy.tests.search.GenericInferencingTests)  Time elapsed: 0.077 sec
09-Jan-2018 22:23:22 testDGMClosure22(org.eclipse.jdt.core.groovy.tests.search.GenericInferencingTests)  Time elapsed: 0.095 sec
09-Jan-2018 22:23:22 testDGMClosure23(org.eclipse.jdt.core.groovy.tests.search.GenericInferencingTests)  Time elapsed: 0.077 sec
09-Jan-2018 22:23:22 testClosure1(org.eclipse.jdt.core.groovy.tests.search.GenericInferencingTests)  Time elapsed: 0.08 sec
09-Jan-2018 22:23:22 testClosure2(org.eclipse.jdt.core.groovy.tests.search.GenericInferencingTests)  Time elapsed: 0.08 sec
09-Jan-2018 22:23:22 testClosure3(org.eclipse.jdt.core.groovy.tests.search.GenericInferencingTests)  Time elapsed: 0.083 sec
09-Jan-2018 22:23:22 testClosure4(org.eclipse.jdt.core.groovy.tests.search.GenericInferencingTests)  Time elapsed: 0.083 sec
09-Jan-2018 22:23:22 testInferringList1(org.eclipse.jdt.core.groovy.tests.search.GenericInferencingTests)  Time elapsed: 0.09 sec
09-Jan-2018 22:23:22 testInferringList2(org.eclipse.jdt.core.groovy.tests.search.GenericInferencingTests)  Time elapsed: 0.088 sec
09-Jan-2018 22:23:22 testInferringList3(org.eclipse.jdt.core.groovy.tests.search.GenericInferencingTests)  Time elapsed: 0.086 sec
09-Jan-2018 22:23:22 testMapOfList2(org.eclipse.jdt.core.groovy.tests.search.GenericInferencingTests)  Time elapsed: 0.086 sec
09-Jan-2018 22:23:22 testMapOfList3(org.eclipse.jdt.core.groovy.tests.search.GenericInferencingTests)  Time elapsed: 0.077 sec
09-Jan-2018 22:23:22 testMapOfList4(org.eclipse.jdt.core.groovy.tests.search.GenericInferencingTests)  Time elapsed: 0.08 sec
09-Jan-2018 22:23:22 testMapOfList5(org.eclipse.jdt.core.groovy.tests.search.GenericInferencingTests)  Time elapsed: 0.083 sec
09-Jan-2018 22:23:22 testMapOfList6(org.eclipse.jdt.core.groovy.tests.search.GenericInferencingTests)  Time elapsed: 0.085 sec
09-Jan-2018 22:23:22 testMapOfList7(org.eclipse.jdt.core.groovy.tests.search.GenericInferencingTests)  Time elapsed: 0.076 sec
09-Jan-2018 22:23:22 testGenericsMapper(org.eclipse.jdt.core.groovy.tests.search.GenericsMappingTests)  Time elapsed: 0.074 sec
09-Jan-2018 22:23:22 testCompileStatic10(org.eclipse.jdt.core.groovy.tests.search.Groovy20InferencingTests)  Time elapsed: 0.122 sec
09-Jan-2018 22:23:22 testCompileStatic1(org.eclipse.jdt.core.groovy.tests.search.Groovy20InferencingTests)  Time elapsed: 0.091 sec
09-Jan-2018 22:23:22 testCompileStatic2(org.eclipse.jdt.core.groovy.tests.search.Groovy20InferencingTests)  Time elapsed: 0.078 sec
09-Jan-2018 22:23:22 testCompileStatic3(org.eclipse.jdt.core.groovy.tests.search.Groovy20InferencingTests)  Time elapsed: 0.112 sec
09-Jan-2018 22:23:22 testCompileStatic4(org.eclipse.jdt.core.groovy.tests.search.Groovy20InferencingTests)  Time elapsed: 0.087 sec
09-Jan-2018 22:23:22 testCompileStatic5(org.eclipse.jdt.core.groovy.tests.search.Groovy20InferencingTests)  Time elapsed: 0.098 sec
09-Jan-2018 22:23:22 testCompileStatic6(org.eclipse.jdt.core.groovy.tests.search.Groovy20InferencingTests)  Time elapsed: 0.083 sec
09-Jan-2018 22:23:22 testCompileStatic7(org.eclipse.jdt.core.groovy.tests.search.Groovy20InferencingTests)  Time elapsed: 0.081 sec
09-Jan-2018 22:23:22 testCompileStatic8(org.eclipse.jdt.core.groovy.tests.search.Groovy20InferencingTests)  Time elapsed: 0.083 sec
09-Jan-2018 22:23:22 testCompileStatic9(org.eclipse.jdt.core.groovy.tests.search.Groovy20InferencingTests)  Time elapsed: 0.083 sec
09-Jan-2018 22:23:22 testTypeChecked1(org.eclipse.jdt.core.groovy.tests.search.Groovy20InferencingTests)  Time elapsed: 0.083 sec
09-Jan-2018 22:23:22 testTypeChecked2(org.eclipse.jdt.core.groovy.tests.search.Groovy20InferencingTests)  Time elapsed: 0.082 sec
09-Jan-2018 22:23:22 testTypeChecked3(org.eclipse.jdt.core.groovy.tests.search.Groovy20InferencingTests)  Time elapsed: 0.087 sec
09-Jan-2018 22:23:22 testTypeChecked4(org.eclipse.jdt.core.groovy.tests.search.Groovy20InferencingTests)  Time elapsed: 0.082 sec
09-Jan-2018 22:23:22 testTypeChecked5(org.eclipse.jdt.core.groovy.tests.search.Groovy20InferencingTests)  Time elapsed: 0.084 sec
09-Jan-2018 22:23:22 testTypeChecked6(org.eclipse.jdt.core.groovy.tests.search.Groovy20InferencingTests)  Time elapsed: 0.084 sec
09-Jan-2018 22:23:22 testTypeChecked7(org.eclipse.jdt.core.groovy.tests.search.Groovy20InferencingTests)  Time elapsed: 0.092 sec
09-Jan-2018 22:23:22 testTypeChecked8(org.eclipse.jdt.core.groovy.tests.search.Groovy20InferencingTests)  Time elapsed: 0.105 sec
09-Jan-2018 22:23:22 testTypeCheckingExtension(org.eclipse.jdt.core.groovy.tests.search.Groovy21InferencingTests)  Time elapsed: 0.583 sec
09-Jan-2018 22:23:22 testDelegatesToTarget1(org.eclipse.jdt.core.groovy.tests.search.Groovy21InferencingTests)  Time elapsed: 0.143 sec
09-Jan-2018 22:23:22 testDelegatesToTarget2(org.eclipse.jdt.core.groovy.tests.search.Groovy21InferencingTests)  Time elapsed: 0.146 sec
09-Jan-2018 22:23:22 testDelegatesToTarget3(org.eclipse.jdt.core.groovy.tests.search.Groovy21InferencingTests)  Time elapsed: 0.167 sec
09-Jan-2018 22:23:22 testDelegatesToTarget4(org.eclipse.jdt.core.groovy.tests.search.Groovy21InferencingTests)  Time elapsed: 0.129 sec
09-Jan-2018 22:23:22 testDelegatesToTarget5(org.eclipse.jdt.core.groovy.tests.search.Groovy21InferencingTests)  Time elapsed: 0.132 sec
09-Jan-2018 22:23:22 testDelegatesToValue2(org.eclipse.jdt.core.groovy.tests.search.Groovy21InferencingTests)  Time elapsed: 0.088 sec
09-Jan-2018 22:23:22 testDelegatesToValue3(org.eclipse.jdt.core.groovy.tests.search.Groovy21InferencingTests)  Time elapsed: 0.09 sec
09-Jan-2018 22:23:22 testDelegatesToValue4(org.eclipse.jdt.core.groovy.tests.search.Groovy21InferencingTests)  Time elapsed: 0.088 sec
09-Jan-2018 22:23:22 testDelegatesToValue5(org.eclipse.jdt.core.groovy.tests.search.Groovy21InferencingTests)  Time elapsed: 0.092 sec
09-Jan-2018 22:23:22 testDelegatesToValue6(org.eclipse.jdt.core.groovy.tests.search.Groovy21InferencingTests)  Time elapsed: 0.088 sec
09-Jan-2018 22:23:22 testDelegatesToValue(org.eclipse.jdt.core.groovy.tests.search.Groovy21InferencingTests)  Time elapsed: 0.087 sec
09-Jan-2018 22:23:22 testEnumOverrides(org.eclipse.jdt.core.groovy.tests.search.Groovy21InferencingTests)  Time elapsed: 0.091 sec
09-Jan-2018 22:23:22 testEnumOverrides2(org.eclipse.jdt.core.groovy.tests.search.Groovy21InferencingTests)  Time elapsed: 0.117 sec
09-Jan-2018 22:23:22 testFieldAndPropertyWithSameName(org.eclipse.jdt.core.groovy.tests.search.InferencingTests)  Time elapsed: 0.105 sec
09-Jan-2018 22:23:22 testObjectMethodOnInterface(org.eclipse.jdt.core.groovy.tests.search.InferencingTests)  Time elapsed: 0.083 sec
09-Jan-2018 22:23:22 testNothingIsUnknown(org.eclipse.jdt.core.groovy.tests.search.InferencingTests)  Time elapsed: 0.081 sec
09-Jan-2018 22:23:22 testInnerClass1(org.eclipse.jdt.core.groovy.tests.search.InferencingTests)  Time elapsed: 0.082 sec
09-Jan-2018 22:23:22 testInnerClass2(org.eclipse.jdt.core.groovy.tests.search.InferencingTests)  Time elapsed: 0.089 sec
09-Jan-2018 22:23:22 testInnerClass3(org.eclipse.jdt.core.groovy.tests.search.InferencingTests)  Time elapsed: 0.082 sec
09-Jan-2018 22:23:22 testInnerClass4(org.eclipse.jdt.core.groovy.tests.search.InferencingTests)  Time elapsed: 0.088 sec
09-Jan-2018 22:23:22 testInnerClass5(org.eclipse.jdt.core.groovy.tests.search.InferencingTests)  Time elapsed: 0.079 sec
09-Jan-2018 22:23:22 testInnerClass6(org.eclipse.jdt.core.groovy.tests.search.InferencingTests)  Time elapsed: 0.083 sec
09-Jan-2018 22:23:22 testInnerClass7(org.eclipse.jdt.core.groovy.tests.search.InferencingTests)  Time elapsed: 0.139 sec
09-Jan-2018 22:23:22 testInnerClass8(org.eclipse.jdt.core.groovy.tests.search.InferencingTests)  Time elapsed: 0.139 sec
09-Jan-2018 22:23:22 testInnerClass9(org.eclipse.jdt.core.groovy.tests.search.InferencingTests)  Time elapsed: 0.102 sec
09-Jan-2018 22:23:22 testBoolean1(org.eclipse.jdt.core.groovy.tests.search.InferencingTests)  Time elapsed: 0.076 sec
09-Jan-2018 22:23:22 testBoolean2(org.eclipse.jdt.core.groovy.tests.search.InferencingTests)  Time elapsed: 0.078 sec
09-Jan-2018 22:23:22 testBoolean3(org.eclipse.jdt.core.groovy.tests.search.InferencingTests)  Time elapsed: 0.077 sec
09-Jan-2018 22:23:22 testBoolean4(org.eclipse.jdt.core.groovy.tests.search.InferencingTests)  Time elapsed: 0.077 sec
09-Jan-2018 22:23:22 testBoolean5(org.eclipse.jdt.core.groovy.tests.search.InferencingTests)  Time elapsed: 0.081 sec
09-Jan-2018 22:23:22 testBoolean6(org.eclipse.jdt.core.groovy.tests.search.InferencingTests)  Time elapsed: 0.099 sec
09-Jan-2018 22:23:22 testBoolean7(org.eclipse.jdt.core.groovy.tests.search.InferencingTests)  Time elapsed: 0.078 sec
09-Jan-2018 22:23:22 testDeclarationAtBeginningOfMethod(org.eclipse.jdt.core.groovy.tests.search.InferencingTests)  Time elapsed: 0.077 sec
09-Jan-2018 22:23:22 testLocalTypeAndDefaultImportCollision(org.eclipse.jdt.core.groovy.tests.search.InferencingTests)  Time elapsed: 0.095 sec
09-Jan-2018 22:23:22 testSuperClassMethod(org.eclipse.jdt.core.groovy.tests.search.InferencingTests)  Time elapsed: 0.082 sec
09-Jan-2018 22:23:22 testGRECLIPSE731a(org.eclipse.jdt.core.groovy.tests.search.InferencingTests)  Time elapsed: 0.078 sec
09-Jan-2018 22:23:22 testGRECLIPSE731b(org.eclipse.jdt.core.groovy.tests.search.InferencingTests)  Time elapsed: 0.082 sec
09-Jan-2018 22:23:22 testGRECLIPSE731c(org.eclipse.jdt.core.groovy.tests.search.InferencingTests)  Time elapsed: 0.084 sec
09-Jan-2018 22:23:22 testGRECLIPSE731d(org.eclipse.jdt.core.groovy.tests.search.InferencingTests)  Time elapsed: 0.08 sec
09-Jan-2018 22:23:22 testGRECLIPSE731e(org.eclipse.jdt.core.groovy.tests.search.InferencingTests)  Time elapsed: 0.079 sec
09-Jan-2018 22:23:22 testGRECLIPSE731f(org.eclipse.jdt.core.groovy.tests.search.InferencingTests)  Time elapsed: 0.079 sec
09-Jan-2018 22:23:22 testSpecialConstructor1(org.eclipse.jdt.core.groovy.tests.search.InferencingTests)  Time elapsed: 0.093 sec
09-Jan-2018 22:23:22 testSpecialConstructor2(org.eclipse.jdt.core.groovy.tests.search.InferencingTests)  Time elapsed: 0.102 sec
09-Jan-2018 22:23:22 testInnerClass10(org.eclipse.jdt.core.groovy.tests.search.InferencingTests)  Time elapsed: 0.115 sec
09-Jan-2018 22:23:22 testInnerClass11(org.eclipse.jdt.core.groovy.tests.search.InferencingTests)  Time elapsed: 0.102 sec
09-Jan-2018 22:23:22 testMultiDecl10(org.eclipse.jdt.core.groovy.tests.search.InferencingTests)  Time elapsed: 0.095 sec
09-Jan-2018 22:23:22 testMultiDecl11(org.eclipse.jdt.core.groovy.tests.search.InferencingTests)  Time elapsed: 0.1 sec
09-Jan-2018 22:23:22 testMultiDecl12(org.eclipse.jdt.core.groovy.tests.search.InferencingTests)  Time elapsed: 0.109 sec
09-Jan-2018 22:23:22 testMultiDecl13(org.eclipse.jdt.core.groovy.tests.search.InferencingTests)  Time elapsed: 0.103 sec
09-Jan-2018 22:23:22 testAssignementInInnerBlock(org.eclipse.jdt.core.groovy.tests.search.InferencingTests)  Time elapsed: 0.079 sec
09-Jan-2018 22:23:22 testConstantFromSuper(org.eclipse.jdt.core.groovy.tests.search.InferencingTests)  Time elapsed: 0.085 sec
09-Jan-2018 22:23:22 testAsExpression1(org.eclipse.jdt.core.groovy.tests.search.InferencingTests)  Time elapsed: 0.081 sec
09-Jan-2018 22:23:22 testAsExpression2(org.eclipse.jdt.core.groovy.tests.search.InferencingTests)  Time elapsed: 0.091 sec
09-Jan-2018 22:23:22 testSuperClassMethod2(org.eclipse.jdt.core.groovy.tests.search.InferencingTests)  Time elapsed: 0.084 sec
09-Jan-2018 22:23:22 testNumber1a(org.eclipse.jdt.core.groovy.tests.search.InferencingTests)  Time elapsed: 0.077 sec
09-Jan-2018 22:23:22 testDGM1(org.eclipse.jdt.core.groovy.tests.search.InferencingTests)  Time elapsed: 0.081 sec
09-Jan-2018 22:23:22 testDGM2(org.eclipse.jdt.core.groovy.tests.search.InferencingTests)  Time elapsed: 0.081 sec
09-Jan-2018 22:23:22 testDGM3(org.eclipse.jdt.core.groovy.tests.search.InferencingTests)  Time elapsed: 0.077 sec
09-Jan-2018 22:23:22 testRangeExpression1(org.eclipse.jdt.core.groovy.tests.search.InferencingTests)  Time elapsed: 0.079 sec
09-Jan-2018 22:23:22 testRangeExpression2(org.eclipse.jdt.core.groovy.tests.search.InferencingTests)  Time elapsed: 0.08 sec
09-Jan-2018 22:23:22 testRangeExpression3(org.eclipse.jdt.core.groovy.tests.search.InferencingTests)  Time elapsed: 0.078 sec
09-Jan-2018 22:23:22 testRangeExpression4(org.eclipse.jdt.core.groovy.tests.search.InferencingTests)  Time elapsed: 0.078 sec
09-Jan-2018 22:23:22 testRangeExpression5(org.eclipse.jdt.core.groovy.tests.search.InferencingTests)  Time elapsed: 0.08 sec
09-Jan-2018 22:23:22 testRangeExpression6(org.eclipse.jdt.core.groovy.tests.search.InferencingTests)  Time elapsed: 0.085 sec
09-Jan-2018 22:23:22 testSpread10(org.eclipse.jdt.core.groovy.tests.search.InferencingTests)  Time elapsed: 0.081 sec
09-Jan-2018 22:23:22 testSpread11(org.eclipse.jdt.core.groovy.tests.search.InferencingTests)  Time elapsed: 0.089 sec
09-Jan-2018 22:23:22 testSpread12(org.eclipse.jdt.core.groovy.tests.search.InferencingTests)  Time elapsed: 0.109 sec
09-Jan-2018 22:23:22 testSpread13(org.eclipse.jdt.core.groovy.tests.search.InferencingTests)  Time elapsed: 0.108 sec
09-Jan-2018 22:23:22 testStaticThisAndSuper2(org.eclipse.jdt.core.groovy.tests.search.InferencingTests)  Time elapsed: 0.096 sec
09-Jan-2018 22:23:22 testConstructor1(org.eclipse.jdt.core.groovy.tests.search.InferencingTests)  Time elapsed: 0.158 sec
09-Jan-2018 22:23:22 testConstructor2(org.eclipse.jdt.core.groovy.tests.search.InferencingTests)  Time elapsed: 0.154 sec
09-Jan-2018 22:23:22 testConstructor3(org.eclipse.jdt.core.groovy.tests.search.InferencingTests)  Time elapsed: 0.113 sec
09-Jan-2018 22:23:22 testConstructor4(org.eclipse.jdt.core.groovy.tests.search.InferencingTests)  Time elapsed: 0.127 sec
09-Jan-2018 22:23:22 testConstructor5(org.eclipse.jdt.core.groovy.tests.search.InferencingTests)  Time elapsed: 0.131 sec
09-Jan-2018 22:23:22 testConstructor6(org.eclipse.jdt.core.groovy.tests.search.InferencingTests)  Time elapsed: 0.122 sec
09-Jan-2018 22:23:22 testInterfaceMethodsAsProperty(org.eclipse.jdt.core.groovy.tests.search.InferencingTests)  Time elapsed: 0.118 sec
09-Jan-2018 22:23:22 testPostfix(org.eclipse.jdt.core.groovy.tests.search.InferencingTests)  Time elapsed: 0.079 sec
09-Jan-2018 22:23:22 testListSort1(org.eclipse.jdt.core.groovy.tests.search.InferencingTests)  Time elapsed: 0.093 sec
09-Jan-2018 22:23:22 testListSort2(org.eclipse.jdt.core.groovy.tests.search.InferencingTests)  Time elapsed: 0.11 sec
09-Jan-2018 22:23:22 testListSort3(org.eclipse.jdt.core.groovy.tests.search.InferencingTests)  Time elapsed: 0.117 sec
09-Jan-2018 22:23:22 testLocalVar1(org.eclipse.jdt.core.groovy.tests.search.InferencingTests)  Time elapsed: 0.078 sec
09-Jan-2018 22:23:22 testLocalVar2(org.eclipse.jdt.core.groovy.tests.search.InferencingTests)  Time elapsed: 0.079 sec
09-Jan-2018 22:23:22 testLocalVar3(org.eclipse.jdt.core.groovy.tests.search.InferencingTests)  Time elapsed: 0.083 sec
09-Jan-2018 22:23:22 testLocalVar4(org.eclipse.jdt.core.groovy.tests.search.InferencingTests)  Time elapsed: 0.083 sec
09-Jan-2018 22:23:22 testIndirectInterfaceMethod(org.eclipse.jdt.core.groovy.tests.search.InferencingTests)  Time elapsed: 0.115 sec
09-Jan-2018 22:23:22 testMapLiteral(org.eclipse.jdt.core.groovy.tests.search.InferencingTests)  Time elapsed: 0.08 sec
09-Jan-2018 22:23:22 testListRemove(org.eclipse.jdt.core.groovy.tests.search.InferencingTests)  Time elapsed: 0.102 sec
09-Jan-2018 22:23:22 testCategoryMethodAsProperty(org.eclipse.jdt.core.groovy.tests.search.InferencingTests)  Time elapsed: 0.083 sec
09-Jan-2018 22:23:22 testNothingIsUnknownWithCategories(org.eclipse.jdt.core.groovy.tests.search.InferencingTests)  Time elapsed: 0.097 sec
09-Jan-2018 22:23:22 testImplicitVar1(org.eclipse.jdt.core.groovy.tests.search.InferencingTests)  Time elapsed: 0.087 sec
09-Jan-2018 22:23:22 testImplicitVar2(org.eclipse.jdt.core.groovy.tests.search.InferencingTests)  Time elapsed: 0.075 sec
09-Jan-2018 22:23:22 testImplicitVar3(org.eclipse.jdt.core.groovy.tests.search.InferencingTests)  Time elapsed: 0.088 sec
09-Jan-2018 22:23:22 testImplicitVar4(org.eclipse.jdt.core.groovy.tests.search.InferencingTests)  Time elapsed: 0.076 sec
09-Jan-2018 22:23:22 testImplicitVar5(org.eclipse.jdt.core.groovy.tests.search.InferencingTests)  Time elapsed: 0.083 sec
09-Jan-2018 22:23:22 testImplicitVar6(org.eclipse.jdt.core.groovy.tests.search.InferencingTests)  Time elapsed: 0.083 sec
09-Jan-2018 22:23:22 testImplicitVar7(org.eclipse.jdt.core.groovy.tests.search.InferencingTests)  Time elapsed: 0.08 sec
09-Jan-2018 22:23:22 testClassLiteral1(org.eclipse.jdt.core.groovy.tests.search.InferencingTests)  Time elapsed: 0.079 sec
09-Jan-2018 22:23:22 testClassLiteral2(org.eclipse.jdt.core.groovy.tests.search.InferencingTests)  Time elapsed: 0.098 sec
09-Jan-2018 22:23:22 testClassLiteral3(org.eclipse.jdt.core.groovy.tests.search.InferencingTests)  Time elapsed: 0.084 sec
09-Jan-2018 22:23:22 testClassLiteral4(org.eclipse.jdt.core.groovy.tests.search.InferencingTests)  Time elapsed: 0.078 sec
09-Jan-2018 22:23:22 testClassLiteral5(org.eclipse.jdt.core.groovy.tests.search.InferencingTests)  Time elapsed: 0.079 sec
09-Jan-2018 22:23:22 testScriptDeclaringType(org.eclipse.jdt.core.groovy.tests.search.InferencingTests)  Time elapsed: 0.08 sec
09-Jan-2018 22:23:22 testInstanceOf10(org.eclipse.jdt.core.groovy.tests.search.InferencingTests)  Time elapsed: 0.137 sec
09-Jan-2018 22:23:22 testInstanceOf1a(org.eclipse.jdt.core.groovy.tests.search.InferencingTests)  Time elapsed: 0.137 sec
09-Jan-2018 22:23:22 testInstanceOf1b(org.eclipse.jdt.core.groovy.tests.search.InferencingTests)  Time elapsed: 0.136 sec
09-Jan-2018 22:23:22 testStaticImports1(org.eclipse.jdt.core.groovy.tests.search.InferencingTests)  Time elapsed: 0.083 sec
09-Jan-2018 22:23:22 testStaticImports2(org.eclipse.jdt.core.groovy.tests.search.InferencingTests)  Time elapsed: 0.083 sec
09-Jan-2018 22:23:22 testStaticImports3(org.eclipse.jdt.core.groovy.tests.search.InferencingTests)  Time elapsed: 0.081 sec
09-Jan-2018 22:23:22 testStaticImports4(org.eclipse.jdt.core.groovy.tests.search.InferencingTests)  Time elapsed: 0.081 sec
09-Jan-2018 22:23:22 testElvisOperator(org.eclipse.jdt.core.groovy.tests.search.InferencingTests)  Time elapsed: 0.081 sec
09-Jan-2018 22:23:22 testMultiDecl1(org.eclipse.jdt.core.groovy.tests.search.InferencingTests)  Time elapsed: 0.09 sec
09-Jan-2018 22:23:22 testMultiDecl2(org.eclipse.jdt.core.groovy.tests.search.InferencingTests)  Time elapsed: 0.09 sec
09-Jan-2018 22:23:22 testMultiDecl3(org.eclipse.jdt.core.groovy.tests.search.InferencingTests)  Time elapsed: 0.092 sec
09-Jan-2018 22:23:22 testMultiDecl4(org.eclipse.jdt.core.groovy.tests.search.InferencingTests)  Time elapsed: 0.108 sec
09-Jan-2018 22:23:22 testMultiDecl6(org.eclipse.jdt.core.groovy.tests.search.InferencingTests)  Time elapsed: 0.099 sec
09-Jan-2018 22:23:22 testMultiDecl7(org.eclipse.jdt.core.groovy.tests.search.InferencingTests)  Time elapsed: 0.102 sec
09-Jan-2018 22:23:22 testMultiDecl8(org.eclipse.jdt.core.groovy.tests.search.InferencingTests)  Time elapsed: 0.095 sec
09-Jan-2018 22:23:22 testMultiDecl9(org.eclipse.jdt.core.groovy.tests.search.InferencingTests)  Time elapsed: 0.095 sec
09-Jan-2018 22:23:22 testStaticThisAndSuper(org.eclipse.jdt.core.groovy.tests.search.InferencingTests)  Time elapsed: 0.086 sec
09-Jan-2018 22:23:22 testLocalMethod1(org.eclipse.jdt.core.groovy.tests.search.InferencingTests)  Time elapsed: 0.081 sec
09-Jan-2018 22:23:22 testLocalMethod2(org.eclipse.jdt.core.groovy.tests.search.InferencingTests)  Time elapsed: 0.083 sec
09-Jan-2018 22:23:22 testLocalMethod3(org.eclipse.jdt.core.groovy.tests.search.InferencingTests)  Time elapsed: 0.083 sec
09-Jan-2018 22:23:22 testLocalMethod4(org.eclipse.jdt.core.groovy.tests.search.InferencingTests)  Time elapsed: 0.081 sec
09-Jan-2018 22:23:22 testLocalMethod5(org.eclipse.jdt.core.groovy.tests.search.InferencingTests)  Time elapsed: 0.081 sec
09-Jan-2018 22:23:22 testLocalMethod6(org.eclipse.jdt.core.groovy.tests.search.InferencingTests)  Time elapsed: 0.081 sec
09-Jan-2018 22:23:22 testLocalMethod7(org.eclipse.jdt.core.groovy.tests.search.InferencingTests)  Time elapsed: 0.081 sec
09-Jan-2018 22:23:22 testLocalVar2a(org.eclipse.jdt.core.groovy.tests.search.InferencingTests)  Time elapsed: 0.07 sec
09-Jan-2018 22:23:22 testNoGString(org.eclipse.jdt.core.groovy.tests.search.InferencingTests)  Time elapsed: 0.083 sec
09-Jan-2018 22:23:22 testMapEntries1(org.eclipse.jdt.core.groovy.tests.search.InferencingTests)  Time elapsed: 0.121 sec
09-Jan-2018 22:23:22 testObjectMethodOnInterfaceAsProperty(org.eclipse.jdt.core.groovy.tests.search.InferencingTests)  Time elapsed: 0.086 sec
09-Jan-2018 22:23:22 testMatcher1(org.eclipse.jdt.core.groovy.tests.search.InferencingTests)  Time elapsed: 0.098 sec
09-Jan-2018 22:23:22 testMatcher2(org.eclipse.jdt.core.groovy.tests.search.InferencingTests)  Time elapsed: 0.084 sec
09-Jan-2018 22:23:22 testSuperFieldReference(org.eclipse.jdt.core.groovy.tests.search.InferencingTests)  Time elapsed: 0.086 sec
09-Jan-2018 22:23:22 testAssignementInInnerBlock2(org.eclipse.jdt.core.groovy.tests.search.InferencingTests)  Time elapsed: 0.086 sec
09-Jan-2018 22:23:22 testAssignment1(org.eclipse.jdt.core.groovy.tests.search.InferencingTests)  Time elapsed: 0.085 sec
09-Jan-2018 22:23:22 testAssignment2(org.eclipse.jdt.core.groovy.tests.search.InferencingTests)  Time elapsed: 0.079 sec
09-Jan-2018 22:23:22 testAssignment3(org.eclipse.jdt.core.groovy.tests.search.InferencingTests)  Time elapsed: 0.085 sec
09-Jan-2018 22:23:22 testAssignment4(org.eclipse.jdt.core.groovy.tests.search.InferencingTests)  Time elapsed: 0.085 sec
09-Jan-2018 22:23:22 testAssignment5(org.eclipse.jdt.core.groovy.tests.search.InferencingTests)  Time elapsed: 0.082 sec
09-Jan-2018 22:23:22 testStaticMethodCall2(org.eclipse.jdt.core.groovy.tests.search.InferencingTests)  Time elapsed: 0.094 sec
09-Jan-2018 22:23:22 testStaticMethodCall3(org.eclipse.jdt.core.groovy.tests.search.InferencingTests)  Time elapsed: 0.092 sec
09-Jan-2018 22:23:22 testStaticMethodCall4(org.eclipse.jdt.core.groovy.tests.search.InferencingTests)  Time elapsed: 0.083 sec
09-Jan-2018 22:23:22 testStaticMethodCall5(org.eclipse.jdt.core.groovy.tests.search.InferencingTests)  Time elapsed: 0.08 sec
09-Jan-2018 22:23:22 testStaticMethodCall6(org.eclipse.jdt.core.groovy.tests.search.InferencingTests)  Time elapsed: 0.089 sec
09-Jan-2018 22:23:22 testStaticMethodCall7(org.eclipse.jdt.core.groovy.tests.search.InferencingTests)  Time elapsed: 0.104 sec
09-Jan-2018 22:23:22 testStaticMethodCall8(org.eclipse.jdt.core.groovy.tests.search.InferencingTests)  Time elapsed: 0.091 sec
09-Jan-2018 22:23:22 testStaticMethodCall9(org.eclipse.jdt.core.groovy.tests.search.InferencingTests)  Time elapsed: 0.09 sec
09-Jan-2018 22:23:22 testCatchBlock1(org.eclipse.jdt.core.groovy.tests.search.InferencingTests)  Time elapsed: 0.081 sec
09-Jan-2018 22:23:22 testCatchBlock2(org.eclipse.jdt.core.groovy.tests.search.InferencingTests)  Time elapsed: 0.098 sec
09-Jan-2018 22:23:22 testCatchBlock3(org.eclipse.jdt.core.groovy.tests.search.InferencingTests)  Time elapsed: 0.079 sec
09-Jan-2018 22:23:22 testCatchBlock4(org.eclipse.jdt.core.groovy.tests.search.InferencingTests)  Time elapsed: 0.081 sec
09-Jan-2018 22:23:22 testCatchBlock5(org.eclipse.jdt.core.groovy.tests.search.InferencingTests)  Time elapsed: 0.079 sec
09-Jan-2018 22:23:22 testTernaryExpression(org.eclipse.jdt.core.groovy.tests.search.InferencingTests)  Time elapsed: 0.079 sec
09-Jan-2018 22:23:22 testInterfaceMethodAsProperty2(org.eclipse.jdt.core.groovy.tests.search.InferencingTests)  Time elapsed: 0.12 sec
09-Jan-2018 22:23:22 testInterfaceMethodAsProperty3(org.eclipse.jdt.core.groovy.tests.search.InferencingTests)  Time elapsed: 0.116 sec
09-Jan-2018 22:23:22 testGetAt1(org.eclipse.jdt.core.groovy.tests.search.InferencingTests)  Time elapsed: 0.086 sec
09-Jan-2018 22:23:22 testGetAt2(org.eclipse.jdt.core.groovy.tests.search.InferencingTests)  Time elapsed: 0.08 sec
09-Jan-2018 22:23:22 testGetAt3(org.eclipse.jdt.core.groovy.tests.search.InferencingTests)  Time elapsed: 0.086 sec
09-Jan-2018 22:23:22 testGetAt4(org.eclipse.jdt.core.groovy.tests.search.InferencingTests)  Time elapsed: 0.093 sec
09-Jan-2018 22:23:22 testGetAt5(org.eclipse.jdt.core.groovy.tests.search.InferencingTests)  Time elapsed: 0.084 sec
09-Jan-2018 22:23:22 testGetAt6(org.eclipse.jdt.core.groovy.tests.search.InferencingTests)  Time elapsed: 0.095 sec
09-Jan-2018 22:23:22 testGetAt7(org.eclipse.jdt.core.groovy.tests.search.InferencingTests)  Time elapsed: 0.097 sec
09-Jan-2018 22:23:22 testFieldWithInitializer1(org.eclipse.jdt.core.groovy.tests.search.InferencingTests)  Time elapsed: 0.085 sec
09-Jan-2018 22:23:22 testFieldWithInitializer2(org.eclipse.jdt.core.groovy.tests.search.InferencingTests)  Time elapsed: 0.096 sec
09-Jan-2018 22:23:22 testNested1(org.eclipse.jdt.core.groovy.tests.search.InferencingTests)  Time elapsed: 0.094 sec
09-Jan-2018 22:23:22 testNested2(org.eclipse.jdt.core.groovy.tests.search.InferencingTests)  Time elapsed: 0.074 sec
09-Jan-2018 22:23:22 testNested3(org.eclipse.jdt.core.groovy.tests.search.InferencingTests)  Time elapsed: 0.118 sec
09-Jan-2018 22:23:22 testNested4(org.eclipse.jdt.core.groovy.tests.search.InferencingTests)  Time elapsed: 0.099 sec
09-Jan-2018 22:23:22 testIndirectInterfaceConstant(org.eclipse.jdt.core.groovy.tests.search.InferencingTests)  Time elapsed: 0.131 sec
09-Jan-2018 22:23:22 testInstanceOf1(org.eclipse.jdt.core.groovy.tests.search.InferencingTests)  Time elapsed: 0.13 sec
09-Jan-2018 22:23:22 testInstanceOf2(org.eclipse.jdt.core.groovy.tests.search.InferencingTests)  Time elapsed: 0.126 sec
09-Jan-2018 22:23:22 testInstanceOf3(org.eclipse.jdt.core.groovy.tests.search.InferencingTests)  Time elapsed: 0.138 sec
09-Jan-2018 22:23:22 testInstanceOf4(org.eclipse.jdt.core.groovy.tests.search.InferencingTests)  Time elapsed: 0.199 sec
09-Jan-2018 22:23:22 testInstanceOf5(org.eclipse.jdt.core.groovy.tests.search.InferencingTests)  Time elapsed: 0.151 sec
09-Jan-2018 22:23:22 testInstanceOf6(org.eclipse.jdt.core.groovy.tests.search.InferencingTests)  Time elapsed: 0.242 sec
09-Jan-2018 22:23:22 testInstanceOf7(org.eclipse.jdt.core.groovy.tests.search.InferencingTests)  Time elapsed: 0.135 sec
09-Jan-2018 22:23:22 testInstanceOf8(org.eclipse.jdt.core.groovy.tests.search.InferencingTests)  Time elapsed: 0.134 sec
09-Jan-2018 22:23:22 testInstanceOf9(org.eclipse.jdt.core.groovy.tests.search.InferencingTests)  Time elapsed: 0.142 sec
09-Jan-2018 22:23:22 testAnonInner1(org.eclipse.jdt.core.groovy.tests.search.InferencingTests)  Time elapsed: 0.084 sec
09-Jan-2018 22:23:22 testAnonInner2(org.eclipse.jdt.core.groovy.tests.search.InferencingTests)  Time elapsed: 0.085 sec
09-Jan-2018 22:23:22 testAnonInner3(org.eclipse.jdt.core.groovy.tests.search.InferencingTests)  Time elapsed: 0.087 sec
09-Jan-2018 22:23:22 testAnonInner4(org.eclipse.jdt.core.groovy.tests.search.InferencingTests)  Time elapsed: 0.096 sec
09-Jan-2018 22:23:22 testAnonInner5(org.eclipse.jdt.core.groovy.tests.search.InferencingTests)  Time elapsed: 0.102 sec
09-Jan-2018 22:23:22 testAnonInner6(org.eclipse.jdt.core.groovy.tests.search.InferencingTests)  Time elapsed: 0.106 sec
09-Jan-2018 22:23:22 testAnonInner7(org.eclipse.jdt.core.groovy.tests.search.InferencingTests)  Time elapsed: 0.159 sec
09-Jan-2018 22:23:22 testThisInInnerClass1(org.eclipse.jdt.core.groovy.tests.search.InferencingTests)  Time elapsed: 0.102 sec
09-Jan-2018 22:23:22 testNumber1(org.eclipse.jdt.core.groovy.tests.search.InferencingTests)  Time elapsed: 0.076 sec
09-Jan-2018 22:23:22 testNumber2(org.eclipse.jdt.core.groovy.tests.search.InferencingTests)  Time elapsed: 0.081 sec
09-Jan-2018 22:23:22 testNumber3(org.eclipse.jdt.core.groovy.tests.search.InferencingTests)  Time elapsed: 0.083 sec
09-Jan-2018 22:23:22 testNumber4(org.eclipse.jdt.core.groovy.tests.search.InferencingTests)  Time elapsed: 0.081 sec
09-Jan-2018 22:23:22 testNumber5(org.eclipse.jdt.core.groovy.tests.search.InferencingTests)  Time elapsed: 0.079 sec
09-Jan-2018 22:23:22 testNumber6(org.eclipse.jdt.core.groovy.tests.search.InferencingTests)  Time elapsed: 0.087 sec
09-Jan-2018 22:23:22 testSpread1(org.eclipse.jdt.core.groovy.tests.search.InferencingTests)  Time elapsed: 0.093 sec
09-Jan-2018 22:23:22 testSpread2(org.eclipse.jdt.core.groovy.tests.search.InferencingTests)  Time elapsed: 0.104 sec
09-Jan-2018 22:23:22 testSpread3(org.eclipse.jdt.core.groovy.tests.search.InferencingTests)  Time elapsed: 0.077 sec
09-Jan-2018 22:23:22 testSpread4(org.eclipse.jdt.core.groovy.tests.search.InferencingTests)  Time elapsed: 0.089 sec
09-Jan-2018 22:23:22 testSpread5(org.eclipse.jdt.core.groovy.tests.search.InferencingTests)  Time elapsed: 0.084 sec
09-Jan-2018 22:23:22 testSpread6(org.eclipse.jdt.core.groovy.tests.search.InferencingTests)  Time elapsed: 0.08 sec
09-Jan-2018 22:23:22 testSpread7(org.eclipse.jdt.core.groovy.tests.search.InferencingTests)  Time elapsed: 0.082 sec
09-Jan-2018 22:23:22 testSpread8(org.eclipse.jdt.core.groovy.tests.search.InferencingTests)  Time elapsed: 0.092 sec
09-Jan-2018 22:23:22 testSpread9(org.eclipse.jdt.core.groovy.tests.search.InferencingTests)  Time elapsed: 0.079 sec
09-Jan-2018 22:23:22 testPattern1(org.eclipse.jdt.core.groovy.tests.search.InferencingTests)  Time elapsed: 0.081 sec
09-Jan-2018 22:23:22 testPattern2(org.eclipse.jdt.core.groovy.tests.search.InferencingTests)  Time elapsed: 0.091 sec
09-Jan-2018 22:23:22 testString1(org.eclipse.jdt.core.groovy.tests.search.InferencingTests)  Time elapsed: 0.082 sec
09-Jan-2018 22:23:22 testString2(org.eclipse.jdt.core.groovy.tests.search.InferencingTests)  Time elapsed: 0.081 sec
09-Jan-2018 22:23:22 testString3(org.eclipse.jdt.core.groovy.tests.search.InferencingTests)  Time elapsed: 0.081 sec
09-Jan-2018 22:23:22 testString4(org.eclipse.jdt.core.groovy.tests.search.InferencingTests)  Time elapsed: 0.082 sec
09-Jan-2018 22:23:22 testStaticMethodCall(org.eclipse.jdt.core.groovy.tests.search.InferencingTests)  Time elapsed: 0.088 sec
09-Jan-2018 22:23:22 testClassReference1(org.eclipse.jdt.core.groovy.tests.search.InferencingTests)  Time elapsed: 0.083 sec
09-Jan-2018 22:23:22 testClassReference2(org.eclipse.jdt.core.groovy.tests.search.InferencingTests)  Time elapsed: 0.078 sec
09-Jan-2018 22:23:22 testClassReference3(org.eclipse.jdt.core.groovy.tests.search.InferencingTests)  Time elapsed: 0.081 sec
09-Jan-2018 22:23:22 testClassReference4(org.eclipse.jdt.core.groovy.tests.search.InferencingTests)  Time elapsed: 0.107 sec
09-Jan-2018 22:23:22 testPropertyNodeFromJava1(org.eclipse.jdt.core.groovy.tests.search.JDTPropertyNodeInferencingTests)  Time elapsed: 0.078 sec
09-Jan-2018 22:23:22 testPropertyNodeFromJava2(org.eclipse.jdt.core.groovy.tests.search.JDTPropertyNodeInferencingTests)  Time elapsed: 0.084 sec
09-Jan-2018 22:23:22 testPropertyNodeFromJava3(org.eclipse.jdt.core.groovy.tests.search.JDTPropertyNodeInferencingTests)  Time elapsed: 0.085 sec
09-Jan-2018 22:23:22 testPropertyNodeFromJava4(org.eclipse.jdt.core.groovy.tests.search.JDTPropertyNodeInferencingTests)  Time elapsed: 0.083 sec
09-Jan-2018 22:23:22 testNodeFromJava1(org.eclipse.jdt.core.groovy.tests.search.JDTPropertyNodeInferencingTests)  Time elapsed: 0.084 sec
09-Jan-2018 22:23:22 testPropertyNodeReferenceInBinary1(org.eclipse.jdt.core.groovy.tests.search.JDTPropertyNodeInferencingTests)  Time elapsed: 0.088 sec
09-Jan-2018 22:23:22 testvarReferenceInGString1(org.eclipse.jdt.core.groovy.tests.search.LocalVariableReferenceSearchTests)  Time elapsed: 0.084 sec
09-Jan-2018 22:23:22 testvarReferenceInGString2(org.eclipse.jdt.core.groovy.tests.search.LocalVariableReferenceSearchTests)  Time elapsed: 0.083 sec
09-Jan-2018 22:23:22 testvarReferenceInGString3(org.eclipse.jdt.core.groovy.tests.search.LocalVariableReferenceSearchTests)  Time elapsed: 0.083 sec
09-Jan-2018 22:23:22 testvarReferenceInGString4(org.eclipse.jdt.core.groovy.tests.search.LocalVariableReferenceSearchTests)  Time elapsed: 0.085 sec
09-Jan-2018 22:23:22 testvarReferenceInGString5(org.eclipse.jdt.core.groovy.tests.search.LocalVariableReferenceSearchTests)  Time elapsed: 0.093 sec
09-Jan-2018 22:23:22 testvarReference1(org.eclipse.jdt.core.groovy.tests.search.LocalVariableReferenceSearchTests)  Time elapsed: 0.085 sec
09-Jan-2018 22:23:22 testvarReference2(org.eclipse.jdt.core.groovy.tests.search.LocalVariableReferenceSearchTests)  Time elapsed: 0.084 sec
09-Jan-2018 22:23:22 testvarReference3(org.eclipse.jdt.core.groovy.tests.search.LocalVariableReferenceSearchTests)  Time elapsed: 0.1 sec
09-Jan-2018 22:23:22 testvarReference4(org.eclipse.jdt.core.groovy.tests.search.LocalVariableReferenceSearchTests)  Time elapsed: 0.085 sec
09-Jan-2018 22:23:22 testvarReference5(org.eclipse.jdt.core.groovy.tests.search.LocalVariableReferenceSearchTests)  Time elapsed: 0.083 sec
09-Jan-2018 22:23:22 testvarReference6(org.eclipse.jdt.core.groovy.tests.search.LocalVariableReferenceSearchTests)  Time elapsed: 0.086 sec
09-Jan-2018 22:23:22 testvarReference7(org.eclipse.jdt.core.groovy.tests.search.LocalVariableReferenceSearchTests)  Time elapsed: 0.102 sec
09-Jan-2018 22:23:22 testvarReference8(org.eclipse.jdt.core.groovy.tests.search.LocalVariableReferenceSearchTests)  Time elapsed: 0.083 sec
09-Jan-2018 22:23:22 testvarReference9(org.eclipse.jdt.core.groovy.tests.search.LocalVariableReferenceSearchTests)  Time elapsed: 0.082 sec
09-Jan-2018 22:23:22 testvarReference10(org.eclipse.jdt.core.groovy.tests.search.LocalVariableReferenceSearchTests)  Time elapsed: 0.081 sec
09-Jan-2018 22:23:22 testConstructorReferenceSearch(org.eclipse.jdt.core.groovy.tests.search.MethodReferenceSearchTests)  Time elapsed: 0.145 sec
09-Jan-2018 22:23:22 testOverloadedMethodReferences1(org.eclipse.jdt.core.groovy.tests.search.MethodReferenceSearchTests)  Time elapsed: 0.139 sec
09-Jan-2018 22:23:22 testOverloadedMethodReferences2(org.eclipse.jdt.core.groovy.tests.search.MethodReferenceSearchTests)  Time elapsed: 0.139 sec
09-Jan-2018 22:23:22 testOverloadedMethodReferences3(org.eclipse.jdt.core.groovy.tests.search.MethodReferenceSearchTests)  Time elapsed: 0.15 sec
09-Jan-2018 22:23:22 testOverloadedMethodReferences4(org.eclipse.jdt.core.groovy.tests.search.MethodReferenceSearchTests)  Time elapsed: 0.162 sec
09-Jan-2018 22:23:22 testOverloadedMethodReferences5(org.eclipse.jdt.core.groovy.tests.search.MethodReferenceSearchTests)  Time elapsed: 0.196 sec
09-Jan-2018 22:23:22 testOverloadedMethodReferences6(org.eclipse.jdt.core.groovy.tests.search.MethodReferenceSearchTests)  Time elapsed: 0.175 sec
09-Jan-2018 22:23:22 testStaticMethodReferenceSearch(org.eclipse.jdt.core.groovy.tests.search.MethodReferenceSearchTests)  Time elapsed: 0.097 sec
09-Jan-2018 22:23:22 testMethodReferencesInClass1(org.eclipse.jdt.core.groovy.tests.search.MethodReferenceSearchTests)  Time elapsed: 0.155 sec
09-Jan-2018 22:23:22 testMethodReferencesInClass2(org.eclipse.jdt.core.groovy.tests.search.MethodReferenceSearchTests)  Time elapsed: 0.158 sec
09-Jan-2018 22:23:22 testMethodReferencesInClass3(org.eclipse.jdt.core.groovy.tests.search.MethodReferenceSearchTests)  Time elapsed: 0.172 sec
09-Jan-2018 22:23:22 testMethodReferencesInClass4(org.eclipse.jdt.core.groovy.tests.search.MethodReferenceSearchTests)  Time elapsed: 0.163 sec
09-Jan-2018 22:23:22 testGenericsMethodReferenceSearch(org.eclipse.jdt.core.groovy.tests.search.MethodReferenceSearchTests)  Time elapsed: 0.158 sec
09-Jan-2018 22:23:22 testMethodReferencesInScript1GRE_1180(org.eclipse.jdt.core.groovy.tests.search.MethodReferenceSearchTests)  Time elapsed: 0.167 sec
09-Jan-2018 22:23:22 testMethodReferencesInScript1(org.eclipse.jdt.core.groovy.tests.search.MethodReferenceSearchTests)  Time elapsed: 0.169 sec
09-Jan-2018 22:23:22 testMethodReferencesInScript2(org.eclipse.jdt.core.groovy.tests.search.MethodReferenceSearchTests)  Time elapsed: 0.174 sec
09-Jan-2018 22:23:22 testMethodReferencesInScript3(org.eclipse.jdt.core.groovy.tests.search.MethodReferenceSearchTests)  Time elapsed: 0.169 sec
09-Jan-2018 22:23:22 testMethodReferencesInScript4(org.eclipse.jdt.core.groovy.tests.search.MethodReferenceSearchTests)  Time elapsed: 0.165 sec
09-Jan-2018 22:23:22 testMethodReferencesInScript5(org.eclipse.jdt.core.groovy.tests.search.MethodReferenceSearchTests)  Time elapsed: 0.162 sec
09-Jan-2018 22:23:22 testMethodReferencesInScript6(org.eclipse.jdt.core.groovy.tests.search.MethodReferenceSearchTests)  Time elapsed: 0.167 sec
09-Jan-2018 22:23:22 testMethodReferencesInScript7(org.eclipse.jdt.core.groovy.tests.search.MethodReferenceSearchTests)  Time elapsed: 0.178 sec
09-Jan-2018 22:23:22 testMethodReferencesInScript8(org.eclipse.jdt.core.groovy.tests.search.MethodReferenceSearchTests)  Time elapsed: 0.167 sec
09-Jan-2018 22:23:22 testMethodWithDefaultParameters1(org.eclipse.jdt.core.groovy.tests.search.MethodReferenceSearchTests)  Time elapsed: 0.182 sec
09-Jan-2018 22:23:22 testMethodWithDefaultParameters2(org.eclipse.jdt.core.groovy.tests.search.MethodReferenceSearchTests)  Time elapsed: 0.182 sec
09-Jan-2018 22:23:22 testRightShift(org.eclipse.jdt.core.groovy.tests.search.OperatorOverloadingInferencingTests)  Time elapsed: 0.102 sec
09-Jan-2018 22:23:22 testLeftShift(org.eclipse.jdt.core.groovy.tests.search.OperatorOverloadingInferencingTests)  Time elapsed: 0.085 sec
09-Jan-2018 22:23:22 testAnd(org.eclipse.jdt.core.groovy.tests.search.OperatorOverloadingInferencingTests)  Time elapsed: 0.073 sec
09-Jan-2018 22:23:22 testMod(org.eclipse.jdt.core.groovy.tests.search.OperatorOverloadingInferencingTests)  Time elapsed: 0.085 sec
09-Jan-2018 22:23:22 testXor(org.eclipse.jdt.core.groovy.tests.search.OperatorOverloadingInferencingTests)  Time elapsed: 0.091 sec
09-Jan-2018 22:23:22 testPlus1(org.eclipse.jdt.core.groovy.tests.search.OperatorOverloadingInferencingTests)  Time elapsed: 0.084 sec
09-Jan-2018 22:23:22 testPlus2(org.eclipse.jdt.core.groovy.tests.search.OperatorOverloadingInferencingTests)  Time elapsed: 0.085 sec
09-Jan-2018 22:23:22 testPlus3(org.eclipse.jdt.core.groovy.tests.search.OperatorOverloadingInferencingTests)  Time elapsed: 0.084 sec
09-Jan-2018 22:23:22 testOr(org.eclipse.jdt.core.groovy.tests.search.OperatorOverloadingInferencingTests)  Time elapsed: 0.091 sec
09-Jan-2018 22:23:22 testPrefix1(org.eclipse.jdt.core.groovy.tests.search.OperatorOverloadingInferencingTests)  Time elapsed: 0.086 sec
09-Jan-2018 22:23:22 testPrefix2(org.eclipse.jdt.core.groovy.tests.search.OperatorOverloadingInferencingTests)  Time elapsed: 0.092 sec
09-Jan-2018 22:23:22 testPrefix3(org.eclipse.jdt.core.groovy.tests.search.OperatorOverloadingInferencingTests)  Time elapsed: 0.088 sec
09-Jan-2018 22:23:22 testPrefix4(org.eclipse.jdt.core.groovy.tests.search.OperatorOverloadingInferencingTests)  Time elapsed: 0.089 sec
09-Jan-2018 22:23:22 testPrefix5(org.eclipse.jdt.core.groovy.tests.search.OperatorOverloadingInferencingTests)  Time elapsed: 0.1 sec
09-Jan-2018 22:23:22 testPrefix6(org.eclipse.jdt.core.groovy.tests.search.OperatorOverloadingInferencingTests)  Time elapsed: 0.084 sec
09-Jan-2018 22:23:22 testLongExpr1(org.eclipse.jdt.core.groovy.tests.search.OperatorOverloadingInferencingTests)  Time elapsed: 0.082 sec
09-Jan-2018 22:23:22 testLongExpr2(org.eclipse.jdt.core.groovy.tests.search.OperatorOverloadingInferencingTests)  Time elapsed: 0.088 sec
09-Jan-2018 22:23:22 testLongExpr3(org.eclipse.jdt.core.groovy.tests.search.OperatorOverloadingInferencingTests)  Time elapsed: 0.091 sec
09-Jan-2018 22:23:22 testAttributeExpr1(org.eclipse.jdt.core.groovy.tests.search.OperatorOverloadingInferencingTests)  Time elapsed: 0.083 sec
09-Jan-2018 22:23:22 testAttributeExpr2(org.eclipse.jdt.core.groovy.tests.search.OperatorOverloadingInferencingTests)  Time elapsed: 0.081 sec
09-Jan-2018 22:23:22 testDivide(org.eclipse.jdt.core.groovy.tests.search.OperatorOverloadingInferencingTests)  Time elapsed: 0.086 sec
09-Jan-2018 22:23:22 testMultiply(org.eclipse.jdt.core.groovy.tests.search.OperatorOverloadingInferencingTests)  Time elapsed: 0.084 sec
09-Jan-2018 22:23:22 testGetAt1(org.eclipse.jdt.core.groovy.tests.search.OperatorOverloadingInferencingTests)  Time elapsed: 0.086 sec
09-Jan-2018 22:23:22 testGetAt2(org.eclipse.jdt.core.groovy.tests.search.OperatorOverloadingInferencingTests)  Time elapsed: 0.088 sec
09-Jan-2018 22:23:22 testGetAt3(org.eclipse.jdt.core.groovy.tests.search.OperatorOverloadingInferencingTests)  Time elapsed: 0.1 sec
09-Jan-2018 22:23:22 testGetAt4(org.eclipse.jdt.core.groovy.tests.search.OperatorOverloadingInferencingTests)  Time elapsed: 0.085 sec
09-Jan-2018 22:23:22 testGetAt5(org.eclipse.jdt.core.groovy.tests.search.OperatorOverloadingInferencingTests)  Time elapsed: 0.086 sec
09-Jan-2018 22:23:22 testGetAt6(org.eclipse.jdt.core.groovy.tests.search.OperatorOverloadingInferencingTests)  Time elapsed: 0.086 sec
09-Jan-2018 22:23:22 testGetAt7(org.eclipse.jdt.core.groovy.tests.search.OperatorOverloadingInferencingTests)  Time elapsed: 0.086 sec
09-Jan-2018 22:23:22 testGetAt8(org.eclipse.jdt.core.groovy.tests.search.OperatorOverloadingInferencingTests)  Time elapsed: 0.092 sec
09-Jan-2018 22:23:22 testGetAt9(org.eclipse.jdt.core.groovy.tests.search.OperatorOverloadingInferencingTests)  Time elapsed: 0.086 sec
09-Jan-2018 22:23:22 testPostfix1(org.eclipse.jdt.core.groovy.tests.search.OperatorOverloadingInferencingTests)  Time elapsed: 0.084 sec
09-Jan-2018 22:23:22 testPostfix2(org.eclipse.jdt.core.groovy.tests.search.OperatorOverloadingInferencingTests)  Time elapsed: 0.084 sec
09-Jan-2018 22:23:22 testMinus1(org.eclipse.jdt.core.groovy.tests.search.OperatorOverloadingInferencingTests)  Time elapsed: 0.087 sec
09-Jan-2018 22:23:22 testMinus2(org.eclipse.jdt.core.groovy.tests.search.OperatorOverloadingInferencingTests)  Time elapsed: 0.082 sec
09-Jan-2018 22:23:22 testNumberPlusString1(org.eclipse.jdt.core.groovy.tests.search.OperatorOverloadingInferencingTests)  Time elapsed: 0.07 sec
09-Jan-2018 22:23:22 testNumberPlusString2(org.eclipse.jdt.core.groovy.tests.search.OperatorOverloadingInferencingTests)  Time elapsed: 0.085 sec
09-Jan-2018 22:23:22 testCompleteExpr1(org.eclipse.jdt.core.groovy.tests.search.OperatorOverloadingInferencingTests)  Time elapsed: 0.082 sec
09-Jan-2018 22:23:22 testCompleteExpr2(org.eclipse.jdt.core.groovy.tests.search.OperatorOverloadingInferencingTests)  Time elapsed: 0.081 sec
09-Jan-2018 22:23:22 testCompleteExpr3(org.eclipse.jdt.core.groovy.tests.search.OperatorOverloadingInferencingTests)  Time elapsed: 0.081 sec
09-Jan-2018 22:23:22 testCompleteExpr4(org.eclipse.jdt.core.groovy.tests.search.OperatorOverloadingInferencingTests)  Time elapsed: 0.082 sec
09-Jan-2018 22:23:22 testCompleteExpr5(org.eclipse.jdt.core.groovy.tests.search.OperatorOverloadingInferencingTests)  Time elapsed: 0.084 sec
09-Jan-2018 22:23:22 testCompleteExpr6(org.eclipse.jdt.core.groovy.tests.search.OperatorOverloadingInferencingTests)  Time elapsed: 0.086 sec
09-Jan-2018 22:23:22 testCompleteExpr7(org.eclipse.jdt.core.groovy.tests.search.OperatorOverloadingInferencingTests)  Time elapsed: 0.083 sec
09-Jan-2018 22:23:22 testCompleteExpr8(org.eclipse.jdt.core.groovy.tests.search.OperatorOverloadingInferencingTests)  Time elapsed: 0.079 sec
09-Jan-2018 22:23:22 testNonStaticReference1(org.eclipse.jdt.core.groovy.tests.search.StaticInferencingTests)  Time elapsed: 0.085 sec
09-Jan-2018 22:23:22 testNonStaticReference2(org.eclipse.jdt.core.groovy.tests.search.StaticInferencingTests)  Time elapsed: 0.082 sec
09-Jan-2018 22:23:22 testNonStaticReference3(org.eclipse.jdt.core.groovy.tests.search.StaticInferencingTests)  Time elapsed: 0.088 sec
09-Jan-2018 22:23:22 testNonStaticReference4(org.eclipse.jdt.core.groovy.tests.search.StaticInferencingTests)  Time elapsed: 0.12 sec
09-Jan-2018 22:23:22 testNonStaticReference5(org.eclipse.jdt.core.groovy.tests.search.StaticInferencingTests)  Time elapsed: 0.084 sec
09-Jan-2018 22:23:22 testNonStaticReference6(org.eclipse.jdt.core.groovy.tests.search.StaticInferencingTests)  Time elapsed: 0.089 sec
09-Jan-2018 22:23:22 testNonStaticReference7(org.eclipse.jdt.core.groovy.tests.search.StaticInferencingTests)  Time elapsed: 0.084 sec
09-Jan-2018 22:23:22 testNonStaticReference8(org.eclipse.jdt.core.groovy.tests.search.StaticInferencingTests)  Time elapsed: 0.083 sec
09-Jan-2018 22:23:22 testStaticReference1(org.eclipse.jdt.core.groovy.tests.search.StaticInferencingTests)  Time elapsed: 0.085 sec
09-Jan-2018 22:23:22 testStaticImport1(org.eclipse.jdt.core.groovy.tests.search.StaticInferencingTests)  Time elapsed: 0.091 sec
09-Jan-2018 22:23:22 testStaticImport2(org.eclipse.jdt.core.groovy.tests.search.StaticInferencingTests)  Time elapsed: 0.1 sec
09-Jan-2018 22:23:22 testStaticImport3(org.eclipse.jdt.core.groovy.tests.search.StaticInferencingTests)  Time elapsed: 0.099 sec
09-Jan-2018 22:23:22 testStaticImport4(org.eclipse.jdt.core.groovy.tests.search.StaticInferencingTests)  Time elapsed: 0.096 sec
09-Jan-2018 22:23:22 testStaticImport5(org.eclipse.jdt.core.groovy.tests.search.StaticInferencingTests)  Time elapsed: 0.098 sec
09-Jan-2018 22:23:22 testStaticImport6(org.eclipse.jdt.core.groovy.tests.search.StaticInferencingTests)  Time elapsed: 0.128 sec
09-Jan-2018 22:23:22 testStaticImport7(org.eclipse.jdt.core.groovy.tests.search.StaticInferencingTests)  Time elapsed: 0.094 sec
09-Jan-2018 22:23:22 testStaticImport8(org.eclipse.jdt.core.groovy.tests.search.StaticInferencingTests)  Time elapsed: 0.092 sec
09-Jan-2018 22:23:22 testStaticImport9(org.eclipse.jdt.core.groovy.tests.search.StaticInferencingTests)  Time elapsed: 0.105 sec
09-Jan-2018 22:23:22 testSTCAndClassInstance(org.eclipse.jdt.core.groovy.tests.search.StaticInferencingTests)  Time elapsed: 0.09 sec
09-Jan-2018 22:23:22 testClassReference10(org.eclipse.jdt.core.groovy.tests.search.StaticInferencingTests)  Time elapsed: 0.101 sec
09-Jan-2018 22:23:22 testClassReference11(org.eclipse.jdt.core.groovy.tests.search.StaticInferencingTests)  Time elapsed: 0.096 sec
09-Jan-2018 22:23:22 testClassReference12(org.eclipse.jdt.core.groovy.tests.search.StaticInferencingTests)  Time elapsed: 0.085 sec
09-Jan-2018 22:23:22 testClassReference13(org.eclipse.jdt.core.groovy.tests.search.StaticInferencingTests)  Time elapsed: 0.082 sec
09-Jan-2018 22:23:22 testClassReference14(org.eclipse.jdt.core.groovy.tests.search.StaticInferencingTests)  Time elapsed: 0.084 sec
09-Jan-2018 22:23:22 testClassReference15(org.eclipse.jdt.core.groovy.tests.search.StaticInferencingTests)  Time elapsed: 0.104 sec
09-Jan-2018 22:23:22 testClassReference4a(org.eclipse.jdt.core.groovy.tests.search.StaticInferencingTests)  Time elapsed: 0.085 sec
09-Jan-2018 22:23:22 testClassReference1(org.eclipse.jdt.core.groovy.tests.search.StaticInferencingTests)  Time elapsed: 0.084 sec
09-Jan-2018 22:23:22 testClassReference2(org.eclipse.jdt.core.groovy.tests.search.StaticInferencingTests)  Time elapsed: 0.093 sec
09-Jan-2018 22:23:22 testClassReference3(org.eclipse.jdt.core.groovy.tests.search.StaticInferencingTests)  Time elapsed: 0.091 sec
09-Jan-2018 22:23:22 testClassReference4(org.eclipse.jdt.core.groovy.tests.search.StaticInferencingTests)  Time elapsed: 0.088 sec
09-Jan-2018 22:23:22 testClassReference5(org.eclipse.jdt.core.groovy.tests.search.StaticInferencingTests)  Time elapsed: 0.088 sec
09-Jan-2018 22:23:22 testClassReference6(org.eclipse.jdt.core.groovy.tests.search.StaticInferencingTests)  Time elapsed: 0.083 sec
09-Jan-2018 22:23:22 testClassReference7(org.eclipse.jdt.core.groovy.tests.search.StaticInferencingTests)  Time elapsed: 0.084 sec
09-Jan-2018 22:23:22 testClassReference8(org.eclipse.jdt.core.groovy.tests.search.StaticInferencingTests)  Time elapsed: 0.085 sec
09-Jan-2018 22:23:22 testClassReference9(org.eclipse.jdt.core.groovy.tests.search.StaticInferencingTests)  Time elapsed: 0.081 sec
09-Jan-2018 22:23:22 testSyntheticAccessors1(org.eclipse.jdt.core.groovy.tests.search.SyntheticAccessorInferencingTests)  Time elapsed: 0.107 sec
09-Jan-2018 22:23:22 testSyntheticAccessors2(org.eclipse.jdt.core.groovy.tests.search.SyntheticAccessorInferencingTests)  Time elapsed: 0.13 sec
09-Jan-2018 22:23:22 testSyntheticAccessors3(org.eclipse.jdt.core.groovy.tests.search.SyntheticAccessorInferencingTests)  Time elapsed: 0.109 sec
09-Jan-2018 22:23:22 testSyntheticAccessors4(org.eclipse.jdt.core.groovy.tests.search.SyntheticAccessorInferencingTests)  Time elapsed: 1.122 sec
09-Jan-2018 22:23:22 testFindClassDeclarationWithPattern(org.eclipse.jdt.core.groovy.tests.search.TypeReferenceSearchTests)  Time elapsed: 0.553 sec
09-Jan-2018 22:23:22 testInnerTypes1(org.eclipse.jdt.core.groovy.tests.search.TypeReferenceSearchTests)  Time elapsed: 1.023 sec
09-Jan-2018 22:23:22 testInnerTypes2(org.eclipse.jdt.core.groovy.tests.search.TypeReferenceSearchTests)  Time elapsed: 1.024 sec
09-Jan-2018 22:23:22 testInnerTypes3(org.eclipse.jdt.core.groovy.tests.search.TypeReferenceSearchTests)  Time elapsed: 1.027 sec
09-Jan-2018 22:23:22 testSearchForTypesScript1(org.eclipse.jdt.core.groovy.tests.search.TypeReferenceSearchTests)  Time elapsed: 0.11 sec
09-Jan-2018 22:23:22 testSearchForTypesScript2(org.eclipse.jdt.core.groovy.tests.search.TypeReferenceSearchTests)  Time elapsed: 0.103 sec
09-Jan-2018 22:23:22 testSearchForTypesScript3(org.eclipse.jdt.core.groovy.tests.search.TypeReferenceSearchTests)  Time elapsed: 0.099 sec
09-Jan-2018 22:23:22 testSearchForTypesScript4(org.eclipse.jdt.core.groovy.tests.search.TypeReferenceSearchTests)  Time elapsed: 0.126 sec
09-Jan-2018 22:23:22 testSearchForTypesScript5(org.eclipse.jdt.core.groovy.tests.search.TypeReferenceSearchTests)  Time elapsed: 0.094 sec
09-Jan-2018 22:23:22 testSearchForTypesScript6(org.eclipse.jdt.core.groovy.tests.search.TypeReferenceSearchTests)  Time elapsed: 0.094 sec
09-Jan-2018 22:23:22 testShouldntFindClassDeclarationInScript(org.eclipse.jdt.core.groovy.tests.search.TypeReferenceSearchTests)  Time elapsed: 0.087 sec
09-Jan-2018 22:23:22 testSearchForTypesArray1(org.eclipse.jdt.core.groovy.tests.search.TypeReferenceSearchTests)  Time elapsed: 0.102 sec
09-Jan-2018 22:23:22 testSearchForTypesClass1(org.eclipse.jdt.core.groovy.tests.search.TypeReferenceSearchTests)  Time elapsed: 0.089 sec
09-Jan-2018 22:23:22 testSearchForTypesClass2(org.eclipse.jdt.core.groovy.tests.search.TypeReferenceSearchTests)  Time elapsed: 0.095 sec
09-Jan-2018 22:23:22 testSearchForTypesClass3(org.eclipse.jdt.core.groovy.tests.search.TypeReferenceSearchTests)  Time elapsed: 0.093 sec
09-Jan-2018 22:23:22 testSearchForTypesClass4(org.eclipse.jdt.core.groovy.tests.search.TypeReferenceSearchTests)  Time elapsed: 0.094 sec
09-Jan-2018 22:23:22 testSearchForTypesClass5(org.eclipse.jdt.core.groovy.tests.search.TypeReferenceSearchTests)  Time elapsed: 0.098 sec
09-Jan-2018 22:23:22 testSearchForTypesClass6(org.eclipse.jdt.core.groovy.tests.search.TypeReferenceSearchTests)  Time elapsed: 0.103 sec
09-Jan-2018 22:23:22 testSearchForTypesClass7(org.eclipse.jdt.core.groovy.tests.search.TypeReferenceSearchTests)  Time elapsed: 0.122 sec
09-Jan-2018 22:23:22 testSearchForTypesClosure1(org.eclipse.jdt.core.groovy.tests.search.TypeReferenceSearchTests)  Time elapsed: 0.099 sec
09-Jan-2018 22:23:22 testSearchForTypesClosure2(org.eclipse.jdt.core.groovy.tests.search.TypeReferenceSearchTests)  Time elapsed: 0.1 sec
09-Jan-2018 22:23:22 testSearchForTypesClosure3(org.eclipse.jdt.core.groovy.tests.search.TypeReferenceSearchTests)  Time elapsed: 0.102 sec
09-Jan-2018 22:23:22 testFindClassDeclaration(org.eclipse.jdt.core.groovy.tests.search.TypeReferenceSearchTests)  Time elapsed: 0.093 sec
09-Jan-2018 22:23:22 testConstructorWithDefaultArgsInCompileStatic(org.eclipse.jdt.core.groovy.tests.search.TypeReferenceSearchTests)  Time elapsed: 0.624 sec
09-Jan-2018 22:23:22
09-Jan-2018 22:23:22 Results :
09-Jan-2018 22:23:22
09-Jan-2018 22:23:22 Tests run: 5041, Failures: 0, Errors: 0, Skipped: 167
09-Jan-2018 22:23:22
09-Jan-2018 22:23:23
09-Jan-2018 22:23:23 !ENTRY org.eclipse.e4.ui.workbench.swt 4 2 2018-01-09 22:23:23.040
09-Jan-2018 22:23:23 !MESSAGE Problems occurred when invoking code from plug-in: "org.eclipse.e4.ui.workbench.swt".
09-Jan-2018 22:23:23 !STACK 0
09-Jan-2018 22:23:23 org.eclipse.e4.core.di.InjectionException: org.eclipse.swt.SWTException: Widget is disposed
09-Jan-2018 22:23:23         at org.eclipse.e4.core.internal.di.MethodRequestor.execute(MethodRequestor.java:62)
09-Jan-2018 22:23:23         at org.eclipse.e4.core.internal.di.InjectorImpl.processAnnotated(InjectorImpl.java:888)
09-Jan-2018 22:23:23         at org.eclipse.e4.core.internal.di.InjectorImpl.disposed(InjectorImpl.java:390)
09-Jan-2018 22:23:23         at org.eclipse.e4.core.internal.di.Requestor.disposed(Requestor.java:143)
09-Jan-2018 22:23:23         at org.eclipse.e4.core.internal.contexts.ContextObjectSupplier$ContextInjectionListener.update(ContextObjectSupplier.java:76)
09-Jan-2018 22:23:23         at org.eclipse.e4.core.internal.contexts.TrackableComputationExt.update(TrackableComputationExt.java:107)
09-Jan-2018 22:23:23         at org.eclipse.e4.core.internal.contexts.TrackableComputationExt.handleInvalid(TrackableComputationExt.java:70)
09-Jan-2018 22:23:23         at org.eclipse.e4.core.internal.contexts.EclipseContext.dispose(EclipseContext.java:175)
09-Jan-2018 22:23:23         at org.eclipse.e4.ui.internal.workbench.swt.PartRenderingEngine.clearContext(PartRenderingEngine.java:974)
09-Jan-2018 22:23:23         at org.eclipse.e4.ui.internal.workbench.swt.PartRenderingEngine.safeRemoveGui(PartRenderingEngine.java:954)
09-Jan-2018 22:23:23         at org.eclipse.e4.ui.internal.workbench.swt.PartRenderingEngine.access$3(PartRenderingEngine.java:862)
09-Jan-2018 22:23:23         at org.eclipse.e4.ui.internal.workbench.swt.PartRenderingEngine$8.run(PartRenderingEngine.java:857)
09-Jan-2018 22:23:23         at org.eclipse.core.runtime.SafeRunner.run(SafeRunner.java:42)
09-Jan-2018 22:23:23         at org.eclipse.e4.ui.internal.workbench.swt.PartRenderingEngine.removeGui(PartRenderingEngine.java:841)
09-Jan-2018 22:23:23         at org.eclipse.e4.ui.internal.workbench.swt.PartRenderingEngine.stop(PartRenderingEngine.java:1220)
09-Jan-2018 22:23:23         at org.eclipse.e4.ui.internal.workbench.E4Workbench.close(E4Workbench.java:184)
09-Jan-2018 22:23:23         at org.eclipse.e4.ui.internal.workbench.swt.E4Testable$2.run(E4Testable.java:130)
09-Jan-2018 22:23:23         at org.eclipse.swt.widgets.RunnableLock.run(RunnableLock.java:35)
09-Jan-2018 22:23:23         at org.eclipse.swt.widgets.Synchronizer.runAsyncMessages(Synchronizer.java:136)
09-Jan-2018 22:23:23         at org.eclipse.swt.widgets.Display.runAsyncMessages(Display.java:3774)
09-Jan-2018 22:23:23         at org.eclipse.swt.widgets.Display.readAndDispatch(Display.java:3412)
09-Jan-2018 22:23:23         at org.eclipse.e4.ui.internal.workbench.swt.PartRenderingEngine$9.run(PartRenderingEngine.java:1151)
09-Jan-2018 22:23:23         at org.eclipse.core.databinding.observable.Realm.runWithDefault(Realm.java:332)
09-Jan-2018 22:23:23         at org.eclipse.e4.ui.internal.workbench.swt.PartRenderingEngine.run(PartRenderingEngine.java:1032)
09-Jan-2018 22:23:23         at org.eclipse.e4.ui.internal.workbench.E4Workbench.createAndRunUI(E4Workbench.java:148)
09-Jan-2018 22:23:23         at org.eclipse.ui.internal.Workbench$5.run(Workbench.java:636)
09-Jan-2018 22:23:23         at org.eclipse.core.databinding.observable.Realm.runWithDefault(Realm.java:332)
09-Jan-2018 22:23:23         at org.eclipse.ui.internal.Workbench.createAndRunWorkbench(Workbench.java:579)
09-Jan-2018 22:23:23         at org.eclipse.ui.PlatformUI.createAndRunWorkbench(PlatformUI.java:150)
09-Jan-2018 22:23:23         at org.eclipse.ui.internal.ide.application.IDEApplication.start(IDEApplication.java:135)
09-Jan-2018 22:23:23         at org.eclipse.tycho.surefire.osgibooter.UITestApplication.runApplication(UITestApplication.java:31)
09-Jan-2018 22:23:23         at org.eclipse.tycho.surefire.osgibooter.AbstractUITestApplication.run(AbstractUITestApplication.java:120)
09-Jan-2018 22:23:23         at org.eclipse.tycho.surefire.osgibooter.UITestApplication.start(UITestApplication.java:37)
09-Jan-2018 22:23:23         at org.eclipse.equinox.internal.app.EclipseAppHandle.run(EclipseAppHandle.java:196)
09-Jan-2018 22:23:23         at org.eclipse.core.runtime.internal.adaptor.EclipseAppLauncher.runApplication(EclipseAppLauncher.java:134)
09-Jan-2018 22:23:23         at org.eclipse.core.runtime.internal.adaptor.EclipseAppLauncher.start(EclipseAppLauncher.java:104)
09-Jan-2018 22:23:23         at org.eclipse.core.runtime.adaptor.EclipseStarter.run(EclipseStarter.java:380)
09-Jan-2018 22:23:23         at org.eclipse.core.runtime.adaptor.EclipseStarter.run(EclipseStarter.java:235)
09-Jan-2018 22:23:23         at sun.reflect.NativeMethodAccessorImpl.invoke0(Native Method)
09-Jan-2018 22:23:23         at sun.reflect.NativeMethodAccessorImpl.invoke(NativeMethodAccessorImpl.java:57)
09-Jan-2018 22:23:23         at sun.reflect.DelegatingMethodAccessorImpl.invoke(DelegatingMethodAccessorImpl.java:43)
09-Jan-2018 22:23:23         at java.lang.reflect.Method.invoke(Method.java:606)
09-Jan-2018 22:23:23         at org.eclipse.equinox.launcher.Main.invokeFramework(Main.java:648)
09-Jan-2018 22:23:23         at org.eclipse.equinox.launcher.Main.basicRun(Main.java:603)
09-Jan-2018 22:23:23         at org.eclipse.equinox.launcher.Main.run(Main.java:1465)
09-Jan-2018 22:23:23         at org.eclipse.equinox.launcher.Main.main(Main.java:1438)
09-Jan-2018 22:23:23 Caused by: org.eclipse.swt.SWTException: Widget is disposed
09-Jan-2018 22:23:23         at org.eclipse.swt.SWT.error(SWT.java:4441)
09-Jan-2018 22:23:23         at org.eclipse.swt.SWT.error(SWT.java:4356)
09-Jan-2018 22:23:23         at org.eclipse.swt.SWT.error(SWT.java:4327)
09-Jan-2018 22:23:23         at org.eclipse.swt.widgets.Widget.error(Widget.java:476)
09-Jan-2018 22:23:23         at org.eclipse.swt.widgets.Widget.checkWidget(Widget.java:413)
09-Jan-2018 22:23:23         at org.eclipse.swt.widgets.Shell.getSize(Shell.java:1111)
09-Jan-2018 22:23:23         at org.eclipse.ui.internal.quickaccess.SearchField.storeDialog(SearchField.java:580)
09-Jan-2018 22:23:23         at org.eclipse.ui.internal.quickaccess.SearchField.dispose(SearchField.java:557)
09-Jan-2018 22:23:23         at sun.reflect.NativeMethodAccessorImpl.invoke0(Native Method)
09-Jan-2018 22:23:23         at sun.reflect.NativeMethodAccessorImpl.invoke(NativeMethodAccessorImpl.java:57)
09-Jan-2018 22:23:23         at sun.reflect.DelegatingMethodAccessorImpl.invoke(DelegatingMethodAccessorImpl.java:43)
09-Jan-2018 22:23:23         at java.lang.reflect.Method.invoke(Method.java:606)
09-Jan-2018 22:23:23         at org.eclipse.e4.core.internal.di.MethodRequestor.execute(MethodRequestor.java:55)
09-Jan-2018 22:23:23         ... 45 more
09-Jan-2018 22:23:23
09-Jan-2018 22:23:23 !ENTRY org.eclipse.e4.ui.workbench 4 0 2018-01-09 22:23:23.044
09-Jan-2018 22:23:23 !MESSAGE Exception occurred while unrendering: org.eclipse.e4.ui.model.application.ui.basic.impl.TrimmedWindowImpl@11058410 (elementId: IDEWindow, tags: [topLevel], contributorURI: platform:/plugin/org.eclipse.ui.workbench) (widget: null, renderer: null, toBeRendered: true, onTop: false, visible: true, containerData: null, accessibilityPhrase: null) (label: %trimmedwindow.label.eclipseSDK, iconURI: null, tooltip: null, context: null, variables: [], x: 0, y: 0, width: 1024, height: 768)
09-Jan-2018 22:23:23 !STACK 0
09-Jan-2018 22:23:23 org.eclipse.e4.core.di.InjectionException: org.eclipse.swt.SWTException: Widget is disposed
09-Jan-2018 22:23:23         at org.eclipse.e4.core.internal.di.MethodRequestor.execute(MethodRequestor.java:62)
09-Jan-2018 22:23:23         at org.eclipse.e4.core.internal.di.InjectorImpl.processAnnotated(InjectorImpl.java:888)
09-Jan-2018 22:23:23         at org.eclipse.e4.core.internal.di.InjectorImpl.disposed(InjectorImpl.java:390)
09-Jan-2018 22:23:23         at org.eclipse.e4.core.internal.di.Requestor.disposed(Requestor.java:143)
09-Jan-2018 22:23:23         at org.eclipse.e4.core.internal.contexts.ContextObjectSupplier$ContextInjectionListener.update(ContextObjectSupplier.java:76)
09-Jan-2018 22:23:23         at org.eclipse.e4.core.internal.contexts.TrackableComputationExt.update(TrackableComputationExt.java:107)
09-Jan-2018 22:23:23         at org.eclipse.e4.core.internal.contexts.TrackableComputationExt.handleInvalid(TrackableComputationExt.java:70)
09-Jan-2018 22:23:23         at org.eclipse.e4.core.internal.contexts.EclipseContext.dispose(EclipseContext.java:175)
09-Jan-2018 22:23:23         at org.eclipse.e4.ui.internal.workbench.swt.PartRenderingEngine.clearContext(PartRenderingEngine.java:974)
09-Jan-2018 22:23:23         at org.eclipse.e4.ui.internal.workbench.swt.PartRenderingEngine.safeRemoveGui(PartRenderingEngine.java:954)
09-Jan-2018 22:23:23         at org.eclipse.e4.ui.internal.workbench.swt.PartRenderingEngine.access$3(PartRenderingEngine.java:862)
09-Jan-2018 22:23:23         at org.eclipse.e4.ui.internal.workbench.swt.PartRenderingEngine$8.run(PartRenderingEngine.java:857)
09-Jan-2018 22:23:23         at org.eclipse.core.runtime.SafeRunner.run(SafeRunner.java:42)
09-Jan-2018 22:23:23         at org.eclipse.e4.ui.internal.workbench.swt.PartRenderingEngine.removeGui(PartRenderingEngine.java:841)
09-Jan-2018 22:23:23         at org.eclipse.e4.ui.internal.workbench.swt.PartRenderingEngine.stop(PartRenderingEngine.java:1220)
09-Jan-2018 22:23:23         at org.eclipse.e4.ui.internal.workbench.E4Workbench.close(E4Workbench.java:184)
09-Jan-2018 22:23:23         at org.eclipse.e4.ui.internal.workbench.swt.E4Testable$2.run(E4Testable.java:130)
09-Jan-2018 22:23:23         at org.eclipse.swt.widgets.RunnableLock.run(RunnableLock.java:35)
09-Jan-2018 22:23:23         at org.eclipse.swt.widgets.Synchronizer.runAsyncMessages(Synchronizer.java:136)
09-Jan-2018 22:23:23         at org.eclipse.swt.widgets.Display.runAsyncMessages(Display.java:3774)
09-Jan-2018 22:23:23         at org.eclipse.swt.widgets.Display.readAndDispatch(Display.java:3412)
09-Jan-2018 22:23:23         at org.eclipse.e4.ui.internal.workbench.swt.PartRenderingEngine$9.run(PartRenderingEngine.java:1151)
09-Jan-2018 22:23:23         at org.eclipse.core.databinding.observable.Realm.runWithDefault(Realm.java:332)
09-Jan-2018 22:23:23         at org.eclipse.e4.ui.internal.workbench.swt.PartRenderingEngine.run(PartRenderingEngine.java:1032)
09-Jan-2018 22:23:23         at org.eclipse.e4.ui.internal.workbench.E4Workbench.createAndRunUI(E4Workbench.java:148)
09-Jan-2018 22:23:23         at org.eclipse.ui.internal.Workbench$5.run(Workbench.java:636)
09-Jan-2018 22:23:23         at org.eclipse.core.databinding.observable.Realm.runWithDefault(Realm.java:332)
09-Jan-2018 22:23:23         at org.eclipse.ui.internal.Workbench.createAndRunWorkbench(Workbench.java:579)
09-Jan-2018 22:23:23         at org.eclipse.ui.PlatformUI.createAndRunWorkbench(PlatformUI.java:150)
09-Jan-2018 22:23:23         at org.eclipse.ui.internal.ide.application.IDEApplication.start(IDEApplication.java:135)
09-Jan-2018 22:23:23         at org.eclipse.tycho.surefire.osgibooter.UITestApplication.runApplication(UITestApplication.java:31)
09-Jan-2018 22:23:23         at org.eclipse.tycho.surefire.osgibooter.AbstractUITestApplication.run(AbstractUITestApplication.java:120)
09-Jan-2018 22:23:23         at org.eclipse.tycho.surefire.osgibooter.UITestApplication.start(UITestApplication.java:37)
09-Jan-2018 22:23:23         at org.eclipse.equinox.internal.app.EclipseAppHandle.run(EclipseAppHandle.java:196)
09-Jan-2018 22:23:23         at org.eclipse.core.runtime.internal.adaptor.EclipseAppLauncher.runApplication(EclipseAppLauncher.java:134)
09-Jan-2018 22:23:23         at org.eclipse.core.runtime.internal.adaptor.EclipseAppLauncher.start(EclipseAppLauncher.java:104)
09-Jan-2018 22:23:23         at org.eclipse.core.runtime.adaptor.EclipseStarter.run(EclipseStarter.java:380)
09-Jan-2018 22:23:23         at org.eclipse.core.runtime.adaptor.EclipseStarter.run(EclipseStarter.java:235)
09-Jan-2018 22:23:23         at sun.reflect.NativeMethodAccessorImpl.invoke0(Native Method)
09-Jan-2018 22:23:23         at sun.reflect.NativeMethodAccessorImpl.invoke(NativeMethodAccessorImpl.java:57)
09-Jan-2018 22:23:23         at sun.reflect.DelegatingMethodAccessorImpl.invoke(DelegatingMethodAccessorImpl.java:43)
09-Jan-2018 22:23:23         at java.lang.reflect.Method.invoke(Method.java:606)
09-Jan-2018 22:23:23         at org.eclipse.equinox.launcher.Main.invokeFramework(Main.java:648)
09-Jan-2018 22:23:23         at org.eclipse.equinox.launcher.Main.basicRun(Main.java:603)
09-Jan-2018 22:23:23         at org.eclipse.equinox.launcher.Main.run(Main.java:1465)
09-Jan-2018 22:23:23         at org.eclipse.equinox.launcher.Main.main(Main.java:1438)
09-Jan-2018 22:23:23 Caused by: org.eclipse.swt.SWTException: Widget is disposed
09-Jan-2018 22:23:23         at org.eclipse.swt.SWT.error(SWT.java:4441)
09-Jan-2018 22:23:23         at org.eclipse.swt.SWT.error(SWT.java:4356)
09-Jan-2018 22:23:23         at org.eclipse.swt.SWT.error(SWT.java:4327)
09-Jan-2018 22:23:23         at org.eclipse.swt.widgets.Widget.error(Widget.java:476)
09-Jan-2018 22:23:23         at org.eclipse.swt.widgets.Widget.checkWidget(Widget.java:413)
09-Jan-2018 22:23:23         at org.eclipse.swt.widgets.Shell.getSize(Shell.java:1111)
09-Jan-2018 22:23:23         at org.eclipse.ui.internal.quickaccess.SearchField.storeDialog(SearchField.java:580)
09-Jan-2018 22:23:23         at org.eclipse.ui.internal.quickaccess.SearchField.dispose(SearchField.java:557)
09-Jan-2018 22:23:23         at sun.reflect.NativeMethodAccessorImpl.invoke0(Native Method)
09-Jan-2018 22:23:23         at sun.reflect.NativeMethodAccessorImpl.invoke(NativeMethodAccessorImpl.java:57)
09-Jan-2018 22:23:23         at sun.reflect.DelegatingMethodAccessorImpl.invoke(DelegatingMethodAccessorImpl.java:43)
09-Jan-2018 22:23:23         at java.lang.reflect.Method.invoke(Method.java:606)
09-Jan-2018 22:23:23         at org.eclipse.e4.core.internal.di.MethodRequestor.execute(MethodRequestor.java:55)
09-Jan-2018 22:23:23         ... 45 more
09-Jan-2018 22:23:23 [INFO] All tests passed!
09-Jan-2018 22:23:23 [INFO]
09-Jan-2018 22:23:23 [INFO] --- maven-install-plugin:2.3.1:install (default-install) @ org.codehaus.groovy.alltests ---
09-Jan-2018 22:23:23 [INFO] Installing /opt/bamboo-home/xml-data/build-dir/GRECLIPSE-E44TP-JOB1/ide-test/org.codehaus.groovy.alltests/target/org.codehaus.groovy.alltests-2.9.3-SNAPSHOT.jar to /home/bamboo/.m2/repository/org/codehaus/groovy/eclipse/org.codehaus.groovy.alltests/2.9.3-SNAPSHOT/org.codehaus.groovy.alltests-2.9.3-SNAPSHOT.jar
09-Jan-2018 22:23:23 [INFO] Installing /opt/bamboo-home/xml-data/build-dir/GRECLIPSE-E44TP-JOB1/ide-test/org.codehaus.groovy.alltests/pom.xml to /home/bamboo/.m2/repository/org/codehaus/groovy/eclipse/org.codehaus.groovy.alltests/2.9.3-SNAPSHOT/org.codehaus.groovy.alltests-2.9.3-SNAPSHOT.pom
09-Jan-2018 22:23:23 [INFO] Installing /opt/bamboo-home/xml-data/build-dir/GRECLIPSE-E44TP-JOB1/ide-test/org.codehaus.groovy.alltests/target/org.codehaus.groovy.alltests-2.9.3-SNAPSHOT-sources.jar to /home/bamboo/.m2/repository/org/codehaus/groovy/eclipse/org.codehaus.groovy.alltests/2.9.3-SNAPSHOT/org.codehaus.groovy.alltests-2.9.3-SNAPSHOT-sources.jar
09-Jan-2018 22:23:23 [INFO] Installing /opt/bamboo-home/xml-data/build-dir/GRECLIPSE-E44TP-JOB1/ide-test/org.codehaus.groovy.alltests/target/p2content.xml to /home/bamboo/.m2/repository/org/codehaus/groovy/eclipse/org.codehaus.groovy.alltests/2.9.3-SNAPSHOT/org.codehaus.groovy.alltests-2.9.3-SNAPSHOT-p2metadata.xml
09-Jan-2018 22:23:23 [INFO] Installing /opt/bamboo-home/xml-data/build-dir/GRECLIPSE-E44TP-JOB1/ide-test/org.codehaus.groovy.alltests/target/p2artifacts.xml to /home/bamboo/.m2/repository/org/codehaus/groovy/eclipse/org.codehaus.groovy.alltests/2.9.3-SNAPSHOT/org.codehaus.groovy.alltests-2.9.3-SNAPSHOT-p2artifacts.xml
09-Jan-2018 22:23:23 [INFO]
09-Jan-2018 22:23:23 [INFO] --- tycho-p2-plugin:0.24.0:update-local-index (default-update-local-index) @ org.codehaus.groovy.alltests ---
09-Jan-2018 22:23:23 [INFO]
09-Jan-2018 22:23:23 [INFO] --- maven-deploy-plugin:2.5:deploy (default-deploy) @ org.codehaus.groovy.alltests ---
09-Jan-2018 22:23:23 [INFO] Skipping artifact deployment
09-Jan-2018 22:23:23 [INFO]                                                                         
09-Jan-2018 22:23:23 [INFO] ------------------------------------------------------------------------
09-Jan-2018 22:23:23 [INFO] Building org.codehaus.groovy.alltests.feature 2.9.3-SNAPSHOT
09-Jan-2018 22:23:23 [INFO] ------------------------------------------------------------------------
09-Jan-2018 22:23:23 [INFO]
09-Jan-2018 22:23:23 [INFO] --- maven-clean-plugin:2.5:clean (default-clean) @ org.codehaus.groovy.alltests.feature ---
09-Jan-2018 22:23:23 [INFO] Deleting /opt/bamboo-home/xml-data/build-dir/GRECLIPSE-E44TP-JOB1/ide-test/Feature-org.codehaus.groovy.alltests.feature/target
09-Jan-2018 22:23:23 [INFO]
09-Jan-2018 22:23:23 [INFO] --- tycho-packaging-plugin:0.24.0:build-qualifier-aggregator (default-build-qualifier-aggregator) @ org.codehaus.groovy.alltests.feature ---
09-Jan-2018 22:23:23 [INFO] The project's OSGi version is 2.9.3.xx-201801092059-e44
09-Jan-2018 22:23:23 [INFO]
09-Jan-2018 22:23:23 [INFO] --- tycho-packaging-plugin:0.24.0:validate-id (default-validate-id) @ org.codehaus.groovy.alltests.feature ---
09-Jan-2018 22:23:23 [INFO]
09-Jan-2018 22:23:23 [INFO] --- tycho-packaging-plugin:0.24.0:validate-version (default-validate-version) @ org.codehaus.groovy.alltests.feature ---
09-Jan-2018 22:23:23 [INFO]
09-Jan-2018 22:23:23 [INFO] --- properties-maven-plugin:1.0-alpha-2:read-project-properties (default) @ org.codehaus.groovy.alltests.feature ---
09-Jan-2018 22:23:23 [INFO]
09-Jan-2018 22:23:23 [INFO] --- tycho-source-plugin:0.24.0:plugin-source (plugin-source) @ org.codehaus.groovy.alltests.feature ---
09-Jan-2018 22:23:23 [INFO]
09-Jan-2018 22:23:23 [INFO] --- target-platform-configuration:0.24.0:target-platform (default-target-platform) @ org.codehaus.groovy.alltests.feature ---
09-Jan-2018 22:23:23 [INFO]
09-Jan-2018 22:23:23 [INFO] --- tycho-packaging-plugin:0.24.0:package-feature (default-package-feature) @ org.codehaus.groovy.alltests.feature ---
09-Jan-2018 22:23:24 [INFO] Building jar: /opt/bamboo-home/xml-data/build-dir/GRECLIPSE-E44TP-JOB1/ide-test/Feature-org.codehaus.groovy.alltests.feature/target/org.codehaus.groovy.alltests.feature-2.9.3-SNAPSHOT.jar
09-Jan-2018 22:23:24 [INFO]
09-Jan-2018 22:23:24 [INFO] --- tycho-p2-plugin:0.24.0:p2-metadata-default (default-p2-metadata-default) @ org.codehaus.groovy.alltests.feature ---
09-Jan-2018 22:23:24 [INFO]
09-Jan-2018 22:23:24 [INFO] --- tycho-p2-plugin:0.24.0:feature-p2-metadata (default-feature-p2-metadata) @ org.codehaus.groovy.alltests.feature ---
09-Jan-2018 22:23:24 [INFO]
09-Jan-2018 22:23:24 [INFO] --- maven-jarsigner-plugin:1.2:sign (sign) @ org.codehaus.groovy.alltests.feature ---
09-Jan-2018 22:23:24 [INFO] 1 archive(s) processed
09-Jan-2018 22:23:24 [INFO]
09-Jan-2018 22:23:24 [INFO] --- tycho-source-feature-plugin:0.24.0:source-feature (source-feature) @ org.codehaus.groovy.alltests.feature ---
09-Jan-2018 22:23:24 [INFO] Building jar: /opt/bamboo-home/xml-data/build-dir/GRECLIPSE-E44TP-JOB1/ide-test/Feature-org.codehaus.groovy.alltests.feature/target/org.codehaus.groovy.alltests.feature-2.9.3-SNAPSHOT-sources-feature.jar
09-Jan-2018 22:23:24 [INFO]
09-Jan-2018 22:23:24 [INFO] --- tycho-p2-plugin:0.24.0:p2-metadata (attach-p2-metadata) @ org.codehaus.groovy.alltests.feature ---
09-Jan-2018 22:23:24 [INFO]
09-Jan-2018 22:23:24 [INFO] --- maven-install-plugin:2.3.1:install (default-install) @ org.codehaus.groovy.alltests.feature ---
09-Jan-2018 22:23:24 [INFO] Installing /opt/bamboo-home/xml-data/build-dir/GRECLIPSE-E44TP-JOB1/ide-test/Feature-org.codehaus.groovy.alltests.feature/target/org.codehaus.groovy.alltests.feature-2.9.3-SNAPSHOT.jar to /home/bamboo/.m2/repository/org/codehaus/groovy/eclipse/org.codehaus.groovy.alltests.feature/2.9.3-SNAPSHOT/org.codehaus.groovy.alltests.feature-2.9.3-SNAPSHOT.jar
09-Jan-2018 22:23:24 [INFO] Installing /opt/bamboo-home/xml-data/build-dir/GRECLIPSE-E44TP-JOB1/ide-test/Feature-org.codehaus.groovy.alltests.feature/pom.xml to /home/bamboo/.m2/repository/org/codehaus/groovy/eclipse/org.codehaus.groovy.alltests.feature/2.9.3-SNAPSHOT/org.codehaus.groovy.alltests.feature-2.9.3-SNAPSHOT.pom
09-Jan-2018 22:23:24 [INFO] Installing /opt/bamboo-home/xml-data/build-dir/GRECLIPSE-E44TP-JOB1/ide-test/Feature-org.codehaus.groovy.alltests.feature/target/p2content.xml to /home/bamboo/.m2/repository/org/codehaus/groovy/eclipse/org.codehaus.groovy.alltests.feature/2.9.3-SNAPSHOT/org.codehaus.groovy.alltests.feature-2.9.3-SNAPSHOT-p2metadata.xml
09-Jan-2018 22:23:24 [INFO] Installing /opt/bamboo-home/xml-data/build-dir/GRECLIPSE-E44TP-JOB1/ide-test/Feature-org.codehaus.groovy.alltests.feature/target/p2artifacts.xml to /home/bamboo/.m2/repository/org/codehaus/groovy/eclipse/org.codehaus.groovy.alltests.feature/2.9.3-SNAPSHOT/org.codehaus.groovy.alltests.feature-2.9.3-SNAPSHOT-p2artifacts.xml
09-Jan-2018 22:23:24 [INFO] Installing /opt/bamboo-home/xml-data/build-dir/GRECLIPSE-E44TP-JOB1/ide-test/Feature-org.codehaus.groovy.alltests.feature/target/org.codehaus.groovy.alltests.feature-2.9.3-SNAPSHOT-sources-feature.jar to /home/bamboo/.m2/repository/org/codehaus/groovy/eclipse/org.codehaus.groovy.alltests.feature/2.9.3-SNAPSHOT/org.codehaus.groovy.alltests.feature-2.9.3-SNAPSHOT-sources-feature.jar
09-Jan-2018 22:23:24 [INFO]
09-Jan-2018 22:23:24 [INFO] --- tycho-p2-plugin:0.24.0:update-local-index (default-update-local-index) @ org.codehaus.groovy.alltests.feature ---
09-Jan-2018 22:23:24 [INFO]
09-Jan-2018 22:23:24 [INFO] --- maven-deploy-plugin:2.5:deploy (default-deploy) @ org.codehaus.groovy.alltests.feature ---
09-Jan-2018 22:23:24 [INFO] Skipping artifact deployment
09-Jan-2018 22:23:24 [INFO]                                                                         
09-Jan-2018 22:23:24 [INFO] ------------------------------------------------------------------------
09-Jan-2018 22:23:24 [INFO] Building org.codehaus.groovy.m2eclipse 2.9.3-SNAPSHOT
09-Jan-2018 22:23:24 [INFO] ------------------------------------------------------------------------
09-Jan-2018 22:23:24 [INFO]
09-Jan-2018 22:23:24 [INFO] --- maven-clean-plugin:2.5:clean (default-clean) @ org.codehaus.groovy.m2eclipse ---
09-Jan-2018 22:23:24 [INFO]
09-Jan-2018 22:23:24 [INFO] --- tycho-packaging-plugin:0.24.0:build-qualifier (default-build-qualifier) @ org.codehaus.groovy.m2eclipse ---
09-Jan-2018 22:23:24 [INFO] The project's OSGi version is 2.9.3.xx-201801092059-e44
09-Jan-2018 22:23:24 [INFO]
09-Jan-2018 22:23:24 [INFO] --- tycho-packaging-plugin:0.24.0:validate-id (default-validate-id) @ org.codehaus.groovy.m2eclipse ---
09-Jan-2018 22:23:24 [INFO]
09-Jan-2018 22:23:24 [INFO] --- tycho-packaging-plugin:0.24.0:validate-version (default-validate-version) @ org.codehaus.groovy.m2eclipse ---
09-Jan-2018 22:23:24 [INFO]
09-Jan-2018 22:23:24 [INFO] --- properties-maven-plugin:1.0-alpha-2:read-project-properties (default) @ org.codehaus.groovy.m2eclipse ---
09-Jan-2018 22:23:24 [INFO]
09-Jan-2018 22:23:24 [INFO] --- maven-resources-plugin:2.4.3:resources (default-resources) @ org.codehaus.groovy.m2eclipse ---
09-Jan-2018 22:23:24 [WARNING] Using platform encoding (UTF-8 actually) to copy filtered resources, i.e. build is platform dependent!
09-Jan-2018 22:23:24 [INFO] skip non existing resourceDirectory /opt/bamboo-home/xml-data/build-dir/GRECLIPSE-E44TP-JOB1/extras/org.codehaus.groovy.m2eclipse/src/main/resources
09-Jan-2018 22:23:24 [INFO]
09-Jan-2018 22:23:24 [INFO] --- tycho-compiler-plugin:0.24.0:compile (default-compile) @ org.codehaus.groovy.m2eclipse ---
09-Jan-2018 22:23:24 [INFO] Compiling 2 source files to /opt/bamboo-home/xml-data/build-dir/GRECLIPSE-E44TP-JOB1/extras/org.codehaus.groovy.m2eclipse/target/classes
09-Jan-2018 22:23:24 [INFO]
09-Jan-2018 22:23:24 [INFO] --- maven-resources-plugin:2.4.3:testResources (default-testResources) @ org.codehaus.groovy.m2eclipse ---
09-Jan-2018 22:23:24 [WARNING] Using platform encoding (UTF-8 actually) to copy filtered resources, i.e. build is platform dependent!
09-Jan-2018 22:23:24 [INFO] skip non existing resourceDirectory /opt/bamboo-home/xml-data/build-dir/GRECLIPSE-E44TP-JOB1/extras/org.codehaus.groovy.m2eclipse/src/test/resources
09-Jan-2018 22:23:24 [INFO]
09-Jan-2018 22:23:24 [INFO] --- tycho-source-plugin:0.24.0:plugin-source (plugin-source) @ org.codehaus.groovy.m2eclipse ---
09-Jan-2018 22:23:24 [WARNING] bundle localization file /opt/bamboo-home/xml-data/build-dir/GRECLIPSE-E44TP-JOB1/extras/org.codehaus.groovy.m2eclipse/plugin.properties not found
09-Jan-2018 22:23:24 [INFO] Building jar: /opt/bamboo-home/xml-data/build-dir/GRECLIPSE-E44TP-JOB1/extras/org.codehaus.groovy.m2eclipse/target/org.codehaus.groovy.m2eclipse-2.9.3-SNAPSHOT-sources.jar
09-Jan-2018 22:23:24 [INFO]
09-Jan-2018 22:23:24 [INFO] --- target-platform-configuration:0.24.0:target-platform (default-target-platform) @ org.codehaus.groovy.m2eclipse ---
09-Jan-2018 22:23:24 [INFO]
09-Jan-2018 22:23:24 [INFO] --- tycho-packaging-plugin:0.24.0:package-plugin (default-package-plugin) @ org.codehaus.groovy.m2eclipse ---
09-Jan-2018 22:23:24 [INFO] Building jar: /opt/bamboo-home/xml-data/build-dir/GRECLIPSE-E44TP-JOB1/extras/org.codehaus.groovy.m2eclipse/target/org.codehaus.groovy.m2eclipse-2.9.3-SNAPSHOT.jar
09-Jan-2018 22:23:24 [INFO]
09-Jan-2018 22:23:24 [INFO] --- tycho-p2-plugin:0.24.0:p2-metadata-default (default-p2-metadata-default) @ org.codehaus.groovy.m2eclipse ---
09-Jan-2018 22:23:24 [INFO]
09-Jan-2018 22:23:24 [INFO] --- maven-jarsigner-plugin:1.2:sign (sign) @ org.codehaus.groovy.m2eclipse ---
09-Jan-2018 22:23:25 [INFO] 2 archive(s) processed
09-Jan-2018 22:23:25 [INFO]
09-Jan-2018 22:23:25 [INFO] --- tycho-source-feature-plugin:0.24.0:source-feature (source-feature) @ org.codehaus.groovy.m2eclipse ---
09-Jan-2018 22:23:25 [INFO]
09-Jan-2018 22:23:25 [INFO] --- tycho-p2-plugin:0.24.0:p2-metadata (attach-p2-metadata) @ org.codehaus.groovy.m2eclipse ---
09-Jan-2018 22:23:25 [INFO]
09-Jan-2018 22:23:25 [INFO] --- maven-install-plugin:2.3.1:install (default-install) @ org.codehaus.groovy.m2eclipse ---
09-Jan-2018 22:23:25 [INFO] Installing /opt/bamboo-home/xml-data/build-dir/GRECLIPSE-E44TP-JOB1/extras/org.codehaus.groovy.m2eclipse/target/org.codehaus.groovy.m2eclipse-2.9.3-SNAPSHOT.jar to /home/bamboo/.m2/repository/org/codehaus/groovy/eclipse/org.codehaus.groovy.m2eclipse/2.9.3-SNAPSHOT/org.codehaus.groovy.m2eclipse-2.9.3-SNAPSHOT.jar
09-Jan-2018 22:23:25 [INFO] Installing /opt/bamboo-home/xml-data/build-dir/GRECLIPSE-E44TP-JOB1/extras/org.codehaus.groovy.m2eclipse/pom.xml to /home/bamboo/.m2/repository/org/codehaus/groovy/eclipse/org.codehaus.groovy.m2eclipse/2.9.3-SNAPSHOT/org.codehaus.groovy.m2eclipse-2.9.3-SNAPSHOT.pom
09-Jan-2018 22:23:25 [INFO] Installing /opt/bamboo-home/xml-data/build-dir/GRECLIPSE-E44TP-JOB1/extras/org.codehaus.groovy.m2eclipse/target/org.codehaus.groovy.m2eclipse-2.9.3-SNAPSHOT-sources.jar to /home/bamboo/.m2/repository/org/codehaus/groovy/eclipse/org.codehaus.groovy.m2eclipse/2.9.3-SNAPSHOT/org.codehaus.groovy.m2eclipse-2.9.3-SNAPSHOT-sources.jar
09-Jan-2018 22:23:25 [INFO] Installing /opt/bamboo-home/xml-data/build-dir/GRECLIPSE-E44TP-JOB1/extras/org.codehaus.groovy.m2eclipse/target/p2content.xml to /home/bamboo/.m2/repository/org/codehaus/groovy/eclipse/org.codehaus.groovy.m2eclipse/2.9.3-SNAPSHOT/org.codehaus.groovy.m2eclipse-2.9.3-SNAPSHOT-p2metadata.xml
09-Jan-2018 22:23:25 [INFO] Installing /opt/bamboo-home/xml-data/build-dir/GRECLIPSE-E44TP-JOB1/extras/org.codehaus.groovy.m2eclipse/target/p2artifacts.xml to /home/bamboo/.m2/repository/org/codehaus/groovy/eclipse/org.codehaus.groovy.m2eclipse/2.9.3-SNAPSHOT/org.codehaus.groovy.m2eclipse-2.9.3-SNAPSHOT-p2artifacts.xml
09-Jan-2018 22:23:25 [INFO]
09-Jan-2018 22:23:25 [INFO] --- tycho-p2-plugin:0.24.0:update-local-index (default-update-local-index) @ org.codehaus.groovy.m2eclipse ---
09-Jan-2018 22:23:25 [INFO]
09-Jan-2018 22:23:25 [INFO] --- maven-deploy-plugin:2.5:deploy (default-deploy) @ org.codehaus.groovy.m2eclipse ---
09-Jan-2018 22:23:25 [INFO] Skipping artifact deployment
09-Jan-2018 22:23:25 [INFO]                                                                         
09-Jan-2018 22:23:25 [INFO] ------------------------------------------------------------------------
09-Jan-2018 22:23:25 [INFO] Building org.codehaus.groovy.m2eclipse.feature 2.9.3-SNAPSHOT
09-Jan-2018 22:23:25 [INFO] ------------------------------------------------------------------------
09-Jan-2018 22:23:25 [INFO]
09-Jan-2018 22:23:25 [INFO] --- maven-clean-plugin:2.5:clean (default-clean) @ org.codehaus.groovy.m2eclipse.feature ---
09-Jan-2018 22:23:25 [INFO] Deleting /opt/bamboo-home/xml-data/build-dir/GRECLIPSE-E44TP-JOB1/extras/Feature-org.codehaus.groovy.m2eclipse/target
09-Jan-2018 22:23:25 [INFO]
09-Jan-2018 22:23:25 [INFO] --- tycho-packaging-plugin:0.24.0:build-qualifier-aggregator (default-build-qualifier-aggregator) @ org.codehaus.groovy.m2eclipse.feature ---
09-Jan-2018 22:23:25 [INFO] The project's OSGi version is 2.9.3.xx-201801092059-e44
09-Jan-2018 22:23:25 [INFO]
09-Jan-2018 22:23:25 [INFO] --- tycho-packaging-plugin:0.24.0:validate-id (default-validate-id) @ org.codehaus.groovy.m2eclipse.feature ---
09-Jan-2018 22:23:25 [INFO]
09-Jan-2018 22:23:25 [INFO] --- tycho-packaging-plugin:0.24.0:validate-version (default-validate-version) @ org.codehaus.groovy.m2eclipse.feature ---
09-Jan-2018 22:23:25 [INFO]
09-Jan-2018 22:23:25 [INFO] --- properties-maven-plugin:1.0-alpha-2:read-project-properties (default) @ org.codehaus.groovy.m2eclipse.feature ---
09-Jan-2018 22:23:25 [INFO]
09-Jan-2018 22:23:25 [INFO] --- tycho-source-plugin:0.24.0:plugin-source (plugin-source) @ org.codehaus.groovy.m2eclipse.feature ---
09-Jan-2018 22:23:25 [INFO]
09-Jan-2018 22:23:25 [INFO] --- target-platform-configuration:0.24.0:target-platform (default-target-platform) @ org.codehaus.groovy.m2eclipse.feature ---
09-Jan-2018 22:23:25 [INFO]
09-Jan-2018 22:23:25 [INFO] --- tycho-packaging-plugin:0.24.0:package-feature (default-package-feature) @ org.codehaus.groovy.m2eclipse.feature ---
09-Jan-2018 22:23:25 [INFO] Building jar: /opt/bamboo-home/xml-data/build-dir/GRECLIPSE-E44TP-JOB1/extras/Feature-org.codehaus.groovy.m2eclipse/target/org.codehaus.groovy.m2eclipse.feature-2.9.3-SNAPSHOT.jar
09-Jan-2018 22:23:25 [INFO]
09-Jan-2018 22:23:25 [INFO] --- tycho-p2-plugin:0.24.0:p2-metadata-default (default-p2-metadata-default) @ org.codehaus.groovy.m2eclipse.feature ---
09-Jan-2018 22:23:25 [INFO]
09-Jan-2018 22:23:25 [INFO] --- tycho-p2-plugin:0.24.0:feature-p2-metadata (default-feature-p2-metadata) @ org.codehaus.groovy.m2eclipse.feature ---
09-Jan-2018 22:23:25 [INFO]
09-Jan-2018 22:23:25 [INFO] --- maven-jarsigner-plugin:1.2:sign (sign) @ org.codehaus.groovy.m2eclipse.feature ---
09-Jan-2018 22:23:26 [INFO] 1 archive(s) processed
09-Jan-2018 22:23:26 [INFO]
09-Jan-2018 22:23:26 [INFO] --- tycho-source-feature-plugin:0.24.0:source-feature (source-feature) @ org.codehaus.groovy.m2eclipse.feature ---
09-Jan-2018 22:23:26 [INFO] Building jar: /opt/bamboo-home/xml-data/build-dir/GRECLIPSE-E44TP-JOB1/extras/Feature-org.codehaus.groovy.m2eclipse/target/org.codehaus.groovy.m2eclipse.feature-2.9.3-SNAPSHOT-sources-feature.jar
09-Jan-2018 22:23:26 [INFO]
09-Jan-2018 22:23:26 [INFO] --- tycho-p2-plugin:0.24.0:p2-metadata (attach-p2-metadata) @ org.codehaus.groovy.m2eclipse.feature ---
09-Jan-2018 22:23:26 [INFO]
09-Jan-2018 22:23:26 [INFO] --- maven-install-plugin:2.3.1:install (default-install) @ org.codehaus.groovy.m2eclipse.feature ---
09-Jan-2018 22:23:26 [INFO] Installing /opt/bamboo-home/xml-data/build-dir/GRECLIPSE-E44TP-JOB1/extras/Feature-org.codehaus.groovy.m2eclipse/target/org.codehaus.groovy.m2eclipse.feature-2.9.3-SNAPSHOT.jar to /home/bamboo/.m2/repository/org/codehaus/groovy/eclipse/org.codehaus.groovy.m2eclipse.feature/2.9.3-SNAPSHOT/org.codehaus.groovy.m2eclipse.feature-2.9.3-SNAPSHOT.jar
09-Jan-2018 22:23:26 [INFO] Installing /opt/bamboo-home/xml-data/build-dir/GRECLIPSE-E44TP-JOB1/extras/Feature-org.codehaus.groovy.m2eclipse/pom.xml to /home/bamboo/.m2/repository/org/codehaus/groovy/eclipse/org.codehaus.groovy.m2eclipse.feature/2.9.3-SNAPSHOT/org.codehaus.groovy.m2eclipse.feature-2.9.3-SNAPSHOT.pom
09-Jan-2018 22:23:26 [INFO] Installing /opt/bamboo-home/xml-data/build-dir/GRECLIPSE-E44TP-JOB1/extras/Feature-org.codehaus.groovy.m2eclipse/target/p2content.xml to /home/bamboo/.m2/repository/org/codehaus/groovy/eclipse/org.codehaus.groovy.m2eclipse.feature/2.9.3-SNAPSHOT/org.codehaus.groovy.m2eclipse.feature-2.9.3-SNAPSHOT-p2metadata.xml
09-Jan-2018 22:23:26 [INFO] Installing /opt/bamboo-home/xml-data/build-dir/GRECLIPSE-E44TP-JOB1/extras/Feature-org.codehaus.groovy.m2eclipse/target/p2artifacts.xml to /home/bamboo/.m2/repository/org/codehaus/groovy/eclipse/org.codehaus.groovy.m2eclipse.feature/2.9.3-SNAPSHOT/org.codehaus.groovy.m2eclipse.feature-2.9.3-SNAPSHOT-p2artifacts.xml
09-Jan-2018 22:23:26 [INFO] Installing /opt/bamboo-home/xml-data/build-dir/GRECLIPSE-E44TP-JOB1/extras/Feature-org.codehaus.groovy.m2eclipse/target/org.codehaus.groovy.m2eclipse.feature-2.9.3-SNAPSHOT-sources-feature.jar to /home/bamboo/.m2/repository/org/codehaus/groovy/eclipse/org.codehaus.groovy.m2eclipse.feature/2.9.3-SNAPSHOT/org.codehaus.groovy.m2eclipse.feature-2.9.3-SNAPSHOT-sources-feature.jar
09-Jan-2018 22:23:26 [INFO]
09-Jan-2018 22:23:26 [INFO] --- tycho-p2-plugin:0.24.0:update-local-index (default-update-local-index) @ org.codehaus.groovy.m2eclipse.feature ---
09-Jan-2018 22:23:26 [INFO]
09-Jan-2018 22:23:26 [INFO] --- maven-deploy-plugin:2.5:deploy (default-deploy) @ org.codehaus.groovy.m2eclipse.feature ---
09-Jan-2018 22:23:26 [INFO] Skipping artifact deployment
09-Jan-2018 22:23:26 [INFO]                                                                         
09-Jan-2018 22:23:26 [INFO] ------------------------------------------------------------------------
09-Jan-2018 22:23:26 [INFO] Building org.codehaus.groovy.eclipse.site 2.9.3-SNAPSHOT
09-Jan-2018 22:23:26 [INFO] ------------------------------------------------------------------------
09-Jan-2018 22:23:26 [INFO]
09-Jan-2018 22:23:26 [INFO] --- maven-clean-plugin:2.5:clean (default-clean) @ org.codehaus.groovy.eclipse.site ---
09-Jan-2018 22:23:26 [INFO]
09-Jan-2018 22:23:26 [INFO] --- tycho-packaging-plugin:0.24.0:build-qualifier (default-build-qualifier) @ org.codehaus.groovy.eclipse.site ---
09-Jan-2018 22:23:26 [INFO] The project's OSGi version is 2.9.3.xx-201801092059-e44
09-Jan-2018 22:23:26 [INFO]
09-Jan-2018 22:23:26 [INFO] --- properties-maven-plugin:1.0-alpha-2:read-project-properties (default) @ org.codehaus.groovy.eclipse.site ---
09-Jan-2018 22:23:26 [INFO]
09-Jan-2018 22:23:26 [INFO] --- tycho-source-plugin:0.24.0:plugin-source (plugin-source) @ org.codehaus.groovy.eclipse.site ---
09-Jan-2018 22:23:26 [INFO]
09-Jan-2018 22:23:26 [INFO] --- tycho-packaging-plugin:0.24.0:update-site (default-update-site) @ org.codehaus.groovy.eclipse.site ---
09-Jan-2018 22:23:26 [INFO]
09-Jan-2018 22:23:26 [INFO] --- tycho-p2-plugin:0.24.0:update-site-p2-metadata (default-update-site-p2-metadata) @ org.codehaus.groovy.eclipse.site ---
09-Jan-2018 22:23:26 [INFO] Command line:
09-Jan-2018 22:23:26         [/opt/jdk1.7.0_80/jre/bin/java, -jar, /opt/users/bamboo/.m2/repository/org/eclipse/tycho/tycho-bundles-external/0.24.0/eclipse/plugins/org.eclipse.equinox.launcher_1.3.100.v20150511-1540.jar, -configuration, /tmp/GRECLIPSE-E44TP-JOB1/tycho-p2-runtime4645805498162643193.tmp/configuration, -nosplash, -application, org.eclipse.equinox.p2.publisher.UpdateSitePublisher, -source, /opt/bamboo-home/xml-data/build-dir/GRECLIPSE-E44TP-JOB1/Site-org.codehaus.groovy.eclipse/target/site, -metadataRepository, file:/opt/bamboo-home/xml-data/build-dir/GRECLIPSE-E44TP-JOB1/Site-org.codehaus.groovy.eclipse/target/site/, -metadataRepositoryName, org.codehaus.groovy.eclipse.site, -artifactRepository, file:/opt/bamboo-home/xml-data/build-dir/GRECLIPSE-E44TP-JOB1/Site-org.codehaus.groovy.eclipse/target/site/, -artifactRepositoryName, org.codehaus.groovy.eclipse.site Artifacts, -noDefaultIUs, -compress]
09-Jan-2018 22:23:28 Generating metadata for ..
09-Jan-2018 22:23:28 Generation completed with success [0 seconds].
09-Jan-2018 22:23:29 [INFO]
09-Jan-2018 22:23:29 [INFO] --- tycho-packaging-plugin:0.24.0:update-site-packaging (default-update-site-packaging) @ org.codehaus.groovy.eclipse.site ---
09-Jan-2018 22:23:29 [INFO] Building zip: /opt/bamboo-home/xml-data/build-dir/GRECLIPSE-E44TP-JOB1/Site-org.codehaus.groovy.eclipse/target/site.zip
09-Jan-2018 22:23:29 [INFO]
09-Jan-2018 22:23:29 [INFO] --- maven-jarsigner-plugin:1.2:sign (sign) @ org.codehaus.groovy.eclipse.site ---
09-Jan-2018 22:23:29 [INFO] 1 archive(s) processed
09-Jan-2018 22:23:29 [INFO]
09-Jan-2018 22:23:29 [INFO] --- tycho-source-feature-plugin:0.24.0:source-feature (source-feature) @ org.codehaus.groovy.eclipse.site ---
09-Jan-2018 22:23:29 [INFO]
09-Jan-2018 22:23:29 [INFO] --- tycho-p2-plugin:0.24.0:p2-metadata (attach-p2-metadata) @ org.codehaus.groovy.eclipse.site ---
09-Jan-2018 22:23:29 [INFO]
09-Jan-2018 22:23:29 [INFO] --- maven-install-plugin:2.3.1:install (default-install) @ org.codehaus.groovy.eclipse.site ---
09-Jan-2018 22:23:29 [INFO] Installing /opt/bamboo-home/xml-data/build-dir/GRECLIPSE-E44TP-JOB1/Site-org.codehaus.groovy.eclipse/target/site.zip to /home/bamboo/.m2/repository/org/codehaus/groovy/eclipse/org.codehaus.groovy.eclipse.site/2.9.3-SNAPSHOT/org.codehaus.groovy.eclipse.site-2.9.3-SNAPSHOT.zip
09-Jan-2018 22:23:29 [INFO] Installing /opt/bamboo-home/xml-data/build-dir/GRECLIPSE-E44TP-JOB1/Site-org.codehaus.groovy.eclipse/pom.xml to /home/bamboo/.m2/repository/org/codehaus/groovy/eclipse/org.codehaus.groovy.eclipse.site/2.9.3-SNAPSHOT/org.codehaus.groovy.eclipse.site-2.9.3-SNAPSHOT.pom
09-Jan-2018 22:23:29 [INFO]
09-Jan-2018 22:23:29 [INFO] --- maven-deploy-plugin:2.5:deploy (default-deploy) @ org.codehaus.groovy.eclipse.site ---
09-Jan-2018 22:23:29 [INFO] Skipping artifact deployment
09-Jan-2018 22:23:29 [INFO]
09-Jan-2018 22:23:29 [INFO] --- maven-antrun-plugin:1.6:run (upload-dist) @ org.codehaus.groovy.eclipse.site ---
09-Jan-2018 22:23:29 [INFO] Executing tasks
09-Jan-2018 22:23:29
09-Jan-2018 22:23:29 main:
09-Jan-2018 22:23:29      [echo] Uploading main update site to s3..."
09-Jan-2018 22:23:29      [echo] ==== dist props are set so we can deploy? ===
09-Jan-2018 22:23:29      [echo] bamboo.s3.properties=${bamboo.s3.properties}
09-Jan-2018 22:23:29      [echo] dist_properties=/home/bamboo/tools/s3.properties
09-Jan-2018 22:23:29      [echo] env.bamboo_s3_properties_rel=/home/bamboo/tools/s3.properties
09-Jan-2018 22:23:29      [echo] dist.accessKey=AKIAJKUKWKYLMXOFIFDA
09-Jan-2018 22:23:29      [echo] accessKey=AKIAJKUKWKYLMXOFIFDA
09-Jan-2018 22:23:29      [echo] site.target.dir=/opt/bamboo-home/xml-data/build-dir/GRECLIPSE-E44TP-JOB1/Site-org.codehaus.groovy.eclipse/target
09-Jan-2018 22:23:29      [echo] unqualifiedVersion=2.9.3
09-Jan-2018 22:23:29      [echo] buildQualifier=xx-201801092059-e44
09-Jan-2018 22:23:29      [echo] dist.full.version=2.9.3.xx-201801092059-e44
09-Jan-2018 22:23:29      [echo] dist.file.name=org.codehaus.groovy-2.9.3.xx-201801092059-e44-updatesite.zip
09-Jan-2018 22:23:29       [zip] Building zip: /opt/bamboo-home/xml-data/build-dir/GRECLIPSE-E44TP-JOB1/Site-org.codehaus.groovy.eclipse/target/site/org.codehaus.groovy-2.9.3.xx-201801092059-e44-updatesite.zip
09-Jan-2018 22:23:35      [echo] Preparing for upload... This will happen:
09-Jan-2018 22:23:35      [echo] Will Delete:
09-Jan-2018 22:23:35      [echo] dist.bucket=dist.springsource.org
09-Jan-2018 22:23:35      [echo] dist.path=snapshot/GRECLIPSE/e4.4
09-Jan-2018 22:23:35      [echo] Will Upload:
09-Jan-2018 22:23:35      [echo] dist.bucket=dist.springsource.org
09-Jan-2018 22:23:35      [echo] toDir=snapshot/GRECLIPSE/e4.4
09-Jan-2018 22:23:35      [echo] fromDir=/opt/bamboo-home/xml-data/build-dir/GRECLIPSE-E44TP-JOB1/Site-org.codehaus.groovy.eclipse/target/site
09-Jan-2018 22:23:35      [echo] Will Upload:
09-Jan-2018 22:23:35      [echo] dist.bucket=dist.springsource.org
09-Jan-2018 22:23:35      [echo] toFile=snapshot/GRECLIPSE/e4.4/org.codehaus.groovy-2.9.3.xx-201801092059-e44-updatesite.zip
09-Jan-2018 22:23:35      [echo] fromFile=snapshot/GRECLIPSE/e4.4/org.codehaus.groovy-2.9.3.xx-201801092059-e44-updatesite.zip
09-Jan-2018 22:23:35      [echo] metadata project.name=Groovy Eclipse
09-Jan-2018 22:23:35      [echo] metadata release.type=snapshot
09-Jan-2018 22:23:35      [echo] metadata bundle.version=2.9.3.xx-201801092059-e44
09-Jan-2018 22:23:35      [echo] metadata package.file.name=org.codehaus.groovy-2.9.3.xx-201801092059-e44-updatesite.zip
09-Jan-2018 22:23:38 Deleted s3://dist.springsource.org/snapshot/GRECLIPSE/e4.4/artifacts.jar
09-Jan-2018 22:23:38 Deleted s3://dist.springsource.org/snapshot/GRECLIPSE/e4.4/content.jar
09-Jan-2018 22:23:38 Deleted s3://dist.springsource.org/snapshot/GRECLIPSE/e4.4/features/
09-Jan-2018 22:23:38 Deleted s3://dist.springsource.org/snapshot/GRECLIPSE/e4.4/features/org.codehaus.groovy.compilerless.feature_2.9.2.xx-201712202153-e44.jar
09-Jan-2018 22:23:38 Deleted s3://dist.springsource.org/snapshot/GRECLIPSE/e4.4/features/org.codehaus.groovy.eclipse.feature_2.9.2.xx-201712202153-e44.jar
09-Jan-2018 22:23:38 Deleted s3://dist.springsource.org/snapshot/GRECLIPSE/e4.4/features/org.codehaus.groovy.headless.feature_2.9.2.xx-201712202153-e44.jar
09-Jan-2018 22:23:38 Deleted s3://dist.springsource.org/snapshot/GRECLIPSE/e4.4/features/org.codehaus.groovy.jdt.patch_2.9.2.xx-201712202153-e44.jar
09-Jan-2018 22:23:38 Deleted s3://dist.springsource.org/snapshot/GRECLIPSE/e4.4/features/org.codehaus.groovy.m2eclipse.feature_2.9.2.xx-201712202153-e44.jar
09-Jan-2018 22:23:38 Deleted s3://dist.springsource.org/snapshot/GRECLIPSE/e4.4/features/org.codehaus.groovy18.feature_2.9.2.xx-201712202153-e44.jar
09-Jan-2018 22:23:38 Deleted s3://dist.springsource.org/snapshot/GRECLIPSE/e4.4/features/org.codehaus.groovy20.feature_2.9.2.xx-201712202153-e44.jar
09-Jan-2018 22:23:38 Deleted s3://dist.springsource.org/snapshot/GRECLIPSE/e4.4/features/org.codehaus.groovy21.feature_2.9.2.xx-201712202153-e44.jar
09-Jan-2018 22:23:39 Deleted s3://dist.springsource.org/snapshot/GRECLIPSE/e4.4/features/org.codehaus.groovy22.feature_2.9.2.xx-201712202153-e44.jar
09-Jan-2018 22:23:39 Deleted s3://dist.springsource.org/snapshot/GRECLIPSE/e4.4/features/org.codehaus.groovy23.feature_2.9.2.xx-201712202153-e44.jar
09-Jan-2018 22:23:39 Deleted s3://dist.springsource.org/snapshot/GRECLIPSE/e4.4/features/org.codehaus.groovy24.feature_2.9.2.xx-201712202153-e44.jar
09-Jan-2018 22:23:39 Deleted s3://dist.springsource.org/snapshot/GRECLIPSE/e4.4/features/org.codehaus.groovy25.feature_2.9.2.xx-201712202153-e44.jar
09-Jan-2018 22:23:39 Deleted s3://dist.springsource.org/snapshot/GRECLIPSE/e4.4/plugins/
09-Jan-2018 22:23:39 Deleted s3://dist.springsource.org/snapshot/GRECLIPSE/e4.4/plugins/org.codehaus.groovy.eclipse.ant_2.9.2.xx-201712202153-e44.jar
09-Jan-2018 22:23:39 Deleted s3://dist.springsource.org/snapshot/GRECLIPSE/e4.4/plugins/org.codehaus.groovy.eclipse.astviews_2.9.2.xx-201712202153-e44.jar
09-Jan-2018 22:23:39 Deleted s3://dist.springsource.org/snapshot/GRECLIPSE/e4.4/plugins/org.codehaus.groovy.eclipse.codeassist.completion_2.9.2.xx-201712202153-e44.jar
09-Jan-2018 22:23:39 Deleted s3://dist.springsource.org/snapshot/GRECLIPSE/e4.4/plugins/org.codehaus.groovy.eclipse.codebrowsing_2.9.2.xx-201712202153-e44.jar
09-Jan-2018 22:23:39 Deleted s3://dist.springsource.org/snapshot/GRECLIPSE/e4.4/plugins/org.codehaus.groovy.eclipse.compilerResolver_2.9.2.xx-201712202153-e44.jar
09-Jan-2018 22:23:40 Deleted s3://dist.springsource.org/snapshot/GRECLIPSE/e4.4/plugins/org.codehaus.groovy.eclipse.core_2.9.2.xx-201712202153-e44.jar
09-Jan-2018 22:23:40 Deleted s3://dist.springsource.org/snapshot/GRECLIPSE/e4.4/plugins/org.codehaus.groovy.eclipse.dsl_2.9.2.xx-201712202153-e44.jar
09-Jan-2018 22:23:40 Deleted s3://dist.springsource.org/snapshot/GRECLIPSE/e4.4/plugins/org.codehaus.groovy.eclipse.quickfix_2.9.2.xx-201712202153-e44.jar
09-Jan-2018 22:23:40 Deleted s3://dist.springsource.org/snapshot/GRECLIPSE/e4.4/plugins/org.codehaus.groovy.eclipse.refactoring_2.9.2.xx-201712202153-e44.jar
09-Jan-2018 22:23:40 Deleted s3://dist.springsource.org/snapshot/GRECLIPSE/e4.4/plugins/org.codehaus.groovy.eclipse.ui_2.9.2.xx-201712202153-e44.jar
09-Jan-2018 22:23:40 Deleted s3://dist.springsource.org/snapshot/GRECLIPSE/e4.4/plugins/org.codehaus.groovy.eclipse_2.9.2.xx-201712202153-e44.jar
09-Jan-2018 22:23:40 Deleted s3://dist.springsource.org/snapshot/GRECLIPSE/e4.4/plugins/org.codehaus.groovy.m2eclipse_2.9.2.xx-201712202153-e44.jar
09-Jan-2018 22:23:40 Deleted s3://dist.springsource.org/snapshot/GRECLIPSE/e4.4/plugins/org.codehaus.groovy_1.8.9.xx-201712202153-e44.jar
09-Jan-2018 22:23:40 Deleted s3://dist.springsource.org/snapshot/GRECLIPSE/e4.4/plugins/org.codehaus.groovy_2.0.8.xx-201712202153-e44.jar
09-Jan-2018 22:23:40 Deleted s3://dist.springsource.org/snapshot/GRECLIPSE/e4.4/plugins/org.codehaus.groovy_2.1.9.xx-201712202153-e44.jar
09-Jan-2018 22:23:40 Deleted s3://dist.springsource.org/snapshot/GRECLIPSE/e4.4/plugins/org.codehaus.groovy_2.2.2.xx-201712202153-e44.jar
09-Jan-2018 22:23:40 Deleted s3://dist.springsource.org/snapshot/GRECLIPSE/e4.4/plugins/org.codehaus.groovy_2.3.11.xx-201712202153-e44.jar
09-Jan-2018 22:23:41 Deleted s3://dist.springsource.org/snapshot/GRECLIPSE/e4.4/plugins/org.codehaus.groovy_2.4.13.xx-201712202153-e44.jar
09-Jan-2018 22:23:41 Deleted s3://dist.springsource.org/snapshot/GRECLIPSE/e4.4/plugins/org.codehaus.groovy_2.5.0.xx-201712202153-e44.jar
09-Jan-2018 22:23:41 Deleted s3://dist.springsource.org/snapshot/GRECLIPSE/e4.4/plugins/org.eclipse.jdt.core_3.10.2.xx-201712202153-e44.jar
09-Jan-2018 22:23:41 Deleted s3://dist.springsource.org/snapshot/GRECLIPSE/e4.4/plugins/org.eclipse.jdt.groovy.core_2.9.2.xx-201712202153-e44.jar
09-Jan-2018 22:23:41 Deleted s3://dist.springsource.org/snapshot/GRECLIPSE/e4.4/site.xml
09-Jan-2018 22:23:42 Uploading /opt/bamboo-home/xml-data/build-dir/GRECLIPSE-E44TP-JOB1/Site-org.codehaus.groovy.eclipse/target/site/artifacts.jar (1.9 KB) to s3://dist.springsource.org/snapshot/GRECLIPSE/e4.4/artifacts.jar
09-Jan-2018 22:23:42 Transfer Time: .2 s - Transfer Rate: 11.6 KB/s
09-Jan-2018 22:23:42 Uploading /opt/bamboo-home/xml-data/build-dir/GRECLIPSE-E44TP-JOB1/Site-org.codehaus.groovy.eclipse/target/site/content.jar (17.2 KB) to s3://dist.springsource.org/snapshot/GRECLIPSE/e4.4/content.jar
09-Jan-2018 22:23:43 Transfer Time: .4 s - Transfer Rate: 40.4 KB/s
09-Jan-2018 22:23:43 Uploading /opt/bamboo-home/xml-data/build-dir/GRECLIPSE-E44TP-JOB1/Site-org.codehaus.groovy.eclipse/target/site/features/org.codehaus.groovy.compilerless.feature_2.9.3.xx-201801092059-e44.jar (15.7 KB) to s3://dist.springsource.org/snapshot/GRECLIPSE/e4.4/features/org.codehaus.groovy.compilerless.feature_2.9.3.xx-201801092059-e44.jar
09-Jan-2018 22:23:43 Transfer Time: .2 s - Transfer Rate: 68.3 KB/s
09-Jan-2018 22:23:43 Uploading /opt/bamboo-home/xml-data/build-dir/GRECLIPSE-E44TP-JOB1/Site-org.codehaus.groovy.eclipse/target/site/features/org.codehaus.groovy.eclipse.feature_2.9.3.xx-201801092059-e44.jar (15.2 KB) to s3://dist.springsource.org/snapshot/GRECLIPSE/e4.4/features/org.codehaus.groovy.eclipse.feature_2.9.3.xx-201801092059-e44.jar
09-Jan-2018 22:23:44 Transfer Time: .2 s - Transfer Rate: 94.2 KB/s
09-Jan-2018 22:23:44 Uploading /opt/bamboo-home/xml-data/build-dir/GRECLIPSE-E44TP-JOB1/Site-org.codehaus.groovy.eclipse/target/site/features/org.codehaus.groovy.headless.feature_2.9.3.xx-201801092059-e44.jar (15.5 KB) to s3://dist.springsource.org/snapshot/GRECLIPSE/e4.4/features/org.codehaus.groovy.headless.feature_2.9.3.xx-201801092059-e44.jar
09-Jan-2018 22:23:44 Transfer Time: .2 s - Transfer Rate: 95.6 KB/s
09-Jan-2018 22:23:44 Uploading /opt/bamboo-home/xml-data/build-dir/GRECLIPSE-E44TP-JOB1/Site-org.codehaus.groovy.eclipse/target/site/features/org.codehaus.groovy.jdt.patch_2.9.3.xx-201801092059-e44.jar (9.6 KB) to s3://dist.springsource.org/snapshot/GRECLIPSE/e4.4/features/org.codehaus.groovy.jdt.patch_2.9.3.xx-201801092059-e44.jar
09-Jan-2018 22:23:45 Transfer Time: .3 s - Transfer Rate: 34.4 KB/s
09-Jan-2018 22:23:45 Uploading /opt/bamboo-home/xml-data/build-dir/GRECLIPSE-E44TP-JOB1/Site-org.codehaus.groovy.eclipse/target/site/features/org.codehaus.groovy.m2eclipse.feature_2.9.3.xx-201801092059-e44.jar (15.2 KB) to s3://dist.springsource.org/snapshot/GRECLIPSE/e4.4/features/org.codehaus.groovy.m2eclipse.feature_2.9.3.xx-201801092059-e44.jar
09-Jan-2018 22:23:45 Transfer Time: .2 s - Transfer Rate: 83.8 KB/s
09-Jan-2018 22:23:46 Uploading /opt/bamboo-home/xml-data/build-dir/GRECLIPSE-E44TP-JOB1/Site-org.codehaus.groovy.eclipse/target/site/features/org.codehaus.groovy18.feature_2.9.3.xx-201801092059-e44.jar (15.3 KB) to s3://dist.springsource.org/snapshot/GRECLIPSE/e4.4/features/org.codehaus.groovy18.feature_2.9.3.xx-201801092059-e44.jar
09-Jan-2018 22:23:46 Transfer Time: .2 s - Transfer Rate: 91.7 KB/s
09-Jan-2018 22:23:46 Uploading /opt/bamboo-home/xml-data/build-dir/GRECLIPSE-E44TP-JOB1/Site-org.codehaus.groovy.eclipse/target/site/features/org.codehaus.groovy20.feature_2.9.3.xx-201801092059-e44.jar (15.3 KB) to s3://dist.springsource.org/snapshot/GRECLIPSE/e4.4/features/org.codehaus.groovy20.feature_2.9.3.xx-201801092059-e44.jar
09-Jan-2018 22:23:46 Transfer Time: .2 s - Transfer Rate: 93.4 KB/s
09-Jan-2018 22:23:47 Uploading /opt/bamboo-home/xml-data/build-dir/GRECLIPSE-E44TP-JOB1/Site-org.codehaus.groovy.eclipse/target/site/features/org.codehaus.groovy21.feature_2.9.3.xx-201801092059-e44.jar (15.3 KB) to s3://dist.springsource.org/snapshot/GRECLIPSE/e4.4/features/org.codehaus.groovy21.feature_2.9.3.xx-201801092059-e44.jar
09-Jan-2018 22:23:47 Transfer Time: .2 s - Transfer Rate: 83.2 KB/s
09-Jan-2018 22:23:47 Uploading /opt/bamboo-home/xml-data/build-dir/GRECLIPSE-E44TP-JOB1/Site-org.codehaus.groovy.eclipse/target/site/features/org.codehaus.groovy22.feature_2.9.3.xx-201801092059-e44.jar (15.3 KB) to s3://dist.springsource.org/snapshot/GRECLIPSE/e4.4/features/org.codehaus.groovy22.feature_2.9.3.xx-201801092059-e44.jar
09-Jan-2018 22:23:47 Transfer Time: .2 s - Transfer Rate: 92.3 KB/s
09-Jan-2018 22:23:48 Uploading /opt/bamboo-home/xml-data/build-dir/GRECLIPSE-E44TP-JOB1/Site-org.codehaus.groovy.eclipse/target/site/features/org.codehaus.groovy23.feature_2.9.3.xx-201801092059-e44.jar (15.3 KB) to s3://dist.springsource.org/snapshot/GRECLIPSE/e4.4/features/org.codehaus.groovy23.feature_2.9.3.xx-201801092059-e44.jar
09-Jan-2018 22:23:48 Transfer Time: .2 s - Transfer Rate: 94.5 KB/s
09-Jan-2018 22:23:49 Uploading /opt/bamboo-home/xml-data/build-dir/GRECLIPSE-E44TP-JOB1/Site-org.codehaus.groovy.eclipse/target/site/features/org.codehaus.groovy24.feature_2.9.3.xx-201801092059-e44.jar (15.1 KB) to s3://dist.springsource.org/snapshot/GRECLIPSE/e4.4/features/org.codehaus.groovy24.feature_2.9.3.xx-201801092059-e44.jar
09-Jan-2018 22:23:49 Transfer Time: .2 s - Transfer Rate: 61.0 KB/s
09-Jan-2018 22:23:49 Uploading /opt/bamboo-home/xml-data/build-dir/GRECLIPSE-E44TP-JOB1/Site-org.codehaus.groovy.eclipse/target/site/features/org.codehaus.groovy25.feature_2.9.3.xx-201801092059-e44.jar (15.1 KB) to s3://dist.springsource.org/snapshot/GRECLIPSE/e4.4/features/org.codehaus.groovy25.feature_2.9.3.xx-201801092059-e44.jar
09-Jan-2018 22:23:49 Transfer Time: .2 s - Transfer Rate: 82.3 KB/s
09-Jan-2018 22:23:50 Uploading /opt/bamboo-home/xml-data/build-dir/GRECLIPSE-E44TP-JOB1/Site-org.codehaus.groovy.eclipse/target/site/org.codehaus.groovy-2.9.3.xx-201801092059-e44-updatesite.zip.md5 (.0 KB) to s3://dist.springsource.org/snapshot/GRECLIPSE/e4.4/org.codehaus.groovy-2.9.3.xx-201801092059-e44-updatesite.zip.md5
09-Jan-2018 22:23:50 Transfer Time: .2 s - Transfer Rate: .2 KB/s
09-Jan-2018 22:23:50 Uploading /opt/bamboo-home/xml-data/build-dir/GRECLIPSE-E44TP-JOB1/Site-org.codehaus.groovy.eclipse/target/site/org.codehaus.groovy-2.9.3.xx-201801092059-e44-updatesite.zip.sha1 (.0 KB) to s3://dist.springsource.org/snapshot/GRECLIPSE/e4.4/org.codehaus.groovy-2.9.3.xx-201801092059-e44-updatesite.zip.sha1
09-Jan-2018 22:23:50 Transfer Time: .2 s - Transfer Rate: .2 KB/s
09-Jan-2018 22:23:51 Uploading /opt/bamboo-home/xml-data/build-dir/GRECLIPSE-E44TP-JOB1/Site-org.codehaus.groovy.eclipse/target/site/plugins/org.codehaus.groovy.eclipse.ant_2.9.3.xx-201801092059-e44.jar (11.3 KB) to s3://dist.springsource.org/snapshot/GRECLIPSE/e4.4/plugins/org.codehaus.groovy.eclipse.ant_2.9.3.xx-201801092059-e44.jar
09-Jan-2018 22:23:51 Transfer Time: .2 s - Transfer Rate: 62.3 KB/s
09-Jan-2018 22:23:51 Uploading /opt/bamboo-home/xml-data/build-dir/GRECLIPSE-E44TP-JOB1/Site-org.codehaus.groovy.eclipse/target/site/plugins/org.codehaus.groovy.eclipse.astviews_2.9.3.xx-201801092059-e44.jar (69.1 KB) to s3://dist.springsource.org/snapshot/GRECLIPSE/e4.4/plugins/org.codehaus.groovy.eclipse.astviews_2.9.3.xx-201801092059-e44.jar
09-Jan-2018 22:23:51 Transfer Time: .3 s - Transfer Rate: 230.4 KB/s
09-Jan-2018 22:23:52 Uploading /opt/bamboo-home/xml-data/build-dir/GRECLIPSE-E44TP-JOB1/Site-org.codehaus.groovy.eclipse/target/site/plugins/org.codehaus.groovy.eclipse.codeassist.completion_2.9.3.xx-201801092059-e44.jar (234.6 KB) to s3://dist.springsource.org/snapshot/GRECLIPSE/e4.4/plugins/org.codehaus.groovy.eclipse.codeassist.completion_2.9.3.xx-201801092059-e44.jar
09-Jan-2018 22:23:52 Transfer Time: .4 s - Transfer Rate: 600.0 KB/s
09-Jan-2018 22:23:52 Uploading /opt/bamboo-home/xml-data/build-dir/GRECLIPSE-E44TP-JOB1/Site-org.codehaus.groovy.eclipse/target/site/plugins/org.codehaus.groovy.eclipse.codebrowsing_2.9.3.xx-201801092059-e44.jar (82.3 KB) to s3://dist.springsource.org/snapshot/GRECLIPSE/e4.4/plugins/org.codehaus.groovy.eclipse.codebrowsing_2.9.3.xx-201801092059-e44.jar
09-Jan-2018 22:23:53 Transfer Time: .2 s - Transfer Rate: 433.4 KB/s
09-Jan-2018 22:23:53 Uploading /opt/bamboo-home/xml-data/build-dir/GRECLIPSE-E44TP-JOB1/Site-org.codehaus.groovy.eclipse/target/site/plugins/org.codehaus.groovy.eclipse.compilerResolver_2.9.3.xx-201801092059-e44.jar (18.1 KB) to s3://dist.springsource.org/snapshot/GRECLIPSE/e4.4/plugins/org.codehaus.groovy.eclipse.compilerResolver_2.9.3.xx-201801092059-e44.jar
09-Jan-2018 22:23:53 Transfer Time: .2 s - Transfer Rate: 103.4 KB/s
09-Jan-2018 22:23:54 Uploading /opt/bamboo-home/xml-data/build-dir/GRECLIPSE-E44TP-JOB1/Site-org.codehaus.groovy.eclipse/target/site/plugins/org.codehaus.groovy.eclipse.core_2.9.3.xx-201801092059-e44.jar (92.4 KB) to s3://dist.springsource.org/snapshot/GRECLIPSE/e4.4/plugins/org.codehaus.groovy.eclipse.core_2.9.3.xx-201801092059-e44.jar
09-Jan-2018 22:23:54 Transfer Time: .2 s - Transfer Rate: 491.5 KB/s
09-Jan-2018 22:23:54 Uploading /opt/bamboo-home/xml-data/build-dir/GRECLIPSE-E44TP-JOB1/Site-org.codehaus.groovy.eclipse/target/site/plugins/org.codehaus.groovy.eclipse.dsl_2.9.3.xx-201801092059-e44.jar (373.6 KB) to s3://dist.springsource.org/snapshot/GRECLIPSE/e4.4/plugins/org.codehaus.groovy.eclipse.dsl_2.9.3.xx-201801092059-e44.jar
09-Jan-2018 22:23:54 Transfer Time: .3 s - Transfer Rate: 1.1 MB/s
09-Jan-2018 22:23:55 Uploading /opt/bamboo-home/xml-data/build-dir/GRECLIPSE-E44TP-JOB1/Site-org.codehaus.groovy.eclipse/target/site/plugins/org.codehaus.groovy.eclipse.quickfix_2.9.3.xx-201801092059-e44.jar (100.0 KB) to s3://dist.springsource.org/snapshot/GRECLIPSE/e4.4/plugins/org.codehaus.groovy.eclipse.quickfix_2.9.3.xx-201801092059-e44.jar
09-Jan-2018 22:23:55 Transfer Time: .2 s - Transfer Rate: 537.4 KB/s
09-Jan-2018 22:23:55 Uploading /opt/bamboo-home/xml-data/build-dir/GRECLIPSE-E44TP-JOB1/Site-org.codehaus.groovy.eclipse/target/site/plugins/org.codehaus.groovy.eclipse.refactoring_2.9.3.xx-201801092059-e44.jar (251.8 KB) to s3://dist.springsource.org/snapshot/GRECLIPSE/e4.4/plugins/org.codehaus.groovy.eclipse.refactoring_2.9.3.xx-201801092059-e44.jar
09-Jan-2018 22:23:55 Transfer Time: .2 s - Transfer Rate: 1.2 MB/s
09-Jan-2018 22:23:56 Uploading /opt/bamboo-home/xml-data/build-dir/GRECLIPSE-E44TP-JOB1/Site-org.codehaus.groovy.eclipse/target/site/plugins/org.codehaus.groovy.eclipse.ui_2.9.3.xx-201801092059-e44.jar (520.5 KB) to s3://dist.springsource.org/snapshot/GRECLIPSE/e4.4/plugins/org.codehaus.groovy.eclipse.ui_2.9.3.xx-201801092059-e44.jar
09-Jan-2018 22:23:56 Transfer Time: .6 s - Transfer Rate: 876.2 KB/s
09-Jan-2018 22:23:57 Uploading /opt/bamboo-home/xml-data/build-dir/GRECLIPSE-E44TP-JOB1/Site-org.codehaus.groovy.eclipse/target/site/plugins/org.codehaus.groovy.eclipse_2.9.3.xx-201801092059-e44.jar (16.8 KB) to s3://dist.springsource.org/snapshot/GRECLIPSE/e4.4/plugins/org.codehaus.groovy.eclipse_2.9.3.xx-201801092059-e44.jar
09-Jan-2018 22:23:57 Transfer Time: .2 s - Transfer Rate: 89.2 KB/s
09-Jan-2018 22:23:58 Uploading /opt/bamboo-home/xml-data/build-dir/GRECLIPSE-E44TP-JOB1/Site-org.codehaus.groovy.eclipse/target/site/plugins/org.codehaus.groovy.m2eclipse_2.9.3.xx-201801092059-e44.jar (14.3 KB) to s3://dist.springsource.org/snapshot/GRECLIPSE/e4.4/plugins/org.codehaus.groovy.m2eclipse_2.9.3.xx-201801092059-e44.jar
09-Jan-2018 22:23:58 Transfer Time: .2 s - Transfer Rate: 82.5 KB/s
09-Jan-2018 22:23:58 Uploading /opt/bamboo-home/xml-data/build-dir/GRECLIPSE-E44TP-JOB1/Site-org.codehaus.groovy.eclipse/target/site/plugins/org.codehaus.groovy_1.8.9.xx-201801092059-e44.jar (9.7 MB) to s3://dist.springsource.org/snapshot/GRECLIPSE/e4.4/plugins/org.codehaus.groovy_1.8.9.xx-201801092059-e44.jar
09-Jan-2018 22:24:00 Transfer Time: 1.5 s - Transfer Rate: 6.3 MB/s
09-Jan-2018 22:24:00 Uploading /opt/bamboo-home/xml-data/build-dir/GRECLIPSE-E44TP-JOB1/Site-org.codehaus.groovy.eclipse/target/site/plugins/org.codehaus.groovy_2.0.8.xx-201801092059-e44.jar (10.0 MB) to s3://dist.springsource.org/snapshot/GRECLIPSE/e4.4/plugins/org.codehaus.groovy_2.0.8.xx-201801092059-e44.jar
09-Jan-2018 22:24:02 Transfer Time: 2.2 s - Transfer Rate: 4.6 MB/s
09-Jan-2018 22:24:03 Uploading /opt/bamboo-home/xml-data/build-dir/GRECLIPSE-E44TP-JOB1/Site-org.codehaus.groovy.eclipse/target/site/plugins/org.codehaus.groovy_2.1.9.xx-201801092059-e44.jar (10.1 MB) to s3://dist.springsource.org/snapshot/GRECLIPSE/e4.4/plugins/org.codehaus.groovy_2.1.9.xx-201801092059-e44.jar
09-Jan-2018 22:24:05 Transfer Time: 2.1 s - Transfer Rate: 4.8 MB/s
09-Jan-2018 22:24:05 Uploading /opt/bamboo-home/xml-data/build-dir/GRECLIPSE-E44TP-JOB1/Site-org.codehaus.groovy.eclipse/target/site/plugins/org.codehaus.groovy_2.2.2.xx-201801092059-e44.jar (10.7 MB) to s3://dist.springsource.org/snapshot/GRECLIPSE/e4.4/plugins/org.codehaus.groovy_2.2.2.xx-201801092059-e44.jar
09-Jan-2018 22:24:08 Transfer Time: 3.2 s - Transfer Rate: 3.3 MB/s
09-Jan-2018 22:24:09 Uploading /opt/bamboo-home/xml-data/build-dir/GRECLIPSE-E44TP-JOB1/Site-org.codehaus.groovy.eclipse/target/site/plugins/org.codehaus.groovy_2.3.11.xx-201801092059-e44.jar (11.7 MB) to s3://dist.springsource.org/snapshot/GRECLIPSE/e4.4/plugins/org.codehaus.groovy_2.3.11.xx-201801092059-e44.jar
09-Jan-2018 22:24:11 Transfer Time: 2.3 s - Transfer Rate: 5.0 MB/s
09-Jan-2018 22:24:12 Uploading /opt/bamboo-home/xml-data/build-dir/GRECLIPSE-E44TP-JOB1/Site-org.codehaus.groovy.eclipse/target/site/plugins/org.codehaus.groovy_2.4.13.xx-201801092059-e44.jar (11.7 MB) to s3://dist.springsource.org/snapshot/GRECLIPSE/e4.4/plugins/org.codehaus.groovy_2.4.13.xx-201801092059-e44.jar
09-Jan-2018 22:24:13 Transfer Time: .9 s - Transfer Rate: 12.6 MB/s
09-Jan-2018 22:24:13 Uploading /opt/bamboo-home/xml-data/build-dir/GRECLIPSE-E44TP-JOB1/Site-org.codehaus.groovy.eclipse/target/site/plugins/org.codehaus.groovy_2.5.0.xx-201801092059-e44.jar (19.7 MB) to s3://dist.springsource.org/snapshot/GRECLIPSE/e4.4/plugins/org.codehaus.groovy_2.5.0.xx-201801092059-e44.jar
09-Jan-2018 22:24:16 Transfer Time: 2.8 s - Transfer Rate: 7.1 MB/s
09-Jan-2018 22:24:16 Uploading /opt/bamboo-home/xml-data/build-dir/GRECLIPSE-E44TP-JOB1/Site-org.codehaus.groovy.eclipse/target/site/plugins/org.eclipse.jdt.core_3.10.2.xx-201801092059-e44.jar (5.4 MB) to s3://dist.springsource.org/snapshot/GRECLIPSE/e4.4/plugins/org.eclipse.jdt.core_3.10.2.xx-201801092059-e44.jar
09-Jan-2018 22:24:17 Transfer Time: .8 s - Transfer Rate: 6.9 MB/s
09-Jan-2018 22:24:17 Uploading /opt/bamboo-home/xml-data/build-dir/GRECLIPSE-E44TP-JOB1/Site-org.codehaus.groovy.eclipse/target/site/plugins/org.eclipse.jdt.groovy.core_2.9.3.xx-201801092059-e44.jar (408.2 KB) to s3://dist.springsource.org/snapshot/GRECLIPSE/e4.4/plugins/org.eclipse.jdt.groovy.core_2.9.3.xx-201801092059-e44.jar
09-Jan-2018 22:24:18 Transfer Time: .2 s - Transfer Rate: 1.8 MB/s
09-Jan-2018 22:24:18 Uploading /opt/bamboo-home/xml-data/build-dir/GRECLIPSE-E44TP-JOB1/Site-org.codehaus.groovy.eclipse/target/site/site.xml (3.8 KB) to s3://dist.springsource.org/snapshot/GRECLIPSE/e4.4/site.xml
09-Jan-2018 22:24:18 Transfer Time: .2 s - Transfer Rate: 21.8 KB/s
09-Jan-2018 22:24:18 Uploading /opt/bamboo-home/xml-data/build-dir/GRECLIPSE-E44TP-JOB1/Site-org.codehaus.groovy.eclipse/target/site/org.codehaus.groovy-2.9.3.xx-201801092059-e44-updatesite.zip (90.8 MB) to s3://dist.springsource.org/snapshot/GRECLIPSE/e4.4/org.codehaus.groovy-2.9.3.xx-201801092059-e44-updatesite.zip
09-Jan-2018 22:24:21 Transfer Time: 3.1 s - Transfer Rate: 29.6 MB/s
09-Jan-2018 22:24:21 [INFO] Executed tasks
09-Jan-2018 22:24:21 [INFO] ------------------------------------------------------------------------
09-Jan-2018 22:24:21 [INFO] Reactor Summary:
09-Jan-2018 22:24:21 [INFO]
09-Jan-2018 22:24:21 [INFO] org.codehaus.groovy.eclipse.parent ................ SUCCESS [0.189s]
09-Jan-2018 22:24:21 [INFO] org.codehaus.groovy ............................... SUCCESS [7.895s]
09-Jan-2018 22:24:21 [INFO] org.codehaus.groovy ............................... SUCCESS [5.129s]
09-Jan-2018 22:24:21 [INFO] org.codehaus.groovy ............................... SUCCESS [4.128s]
09-Jan-2018 22:24:21 [INFO] org.codehaus.groovy ............................... SUCCESS [4.130s]
09-Jan-2018 22:24:21 [INFO] org.codehaus.groovy ............................... SUCCESS [4.864s]
09-Jan-2018 22:24:21 [INFO] org.codehaus.groovy ............................... SUCCESS [4.163s]
09-Jan-2018 22:24:21 [INFO] org.codehaus.groovy ............................... SUCCESS [5.334s]
09-Jan-2018 22:24:21 [INFO] org.codehaus.groovy.eclipse.compilerResolver ...... SUCCESS [0.985s]
09-Jan-2018 22:24:21 [INFO] org.eclipse.jdt.core .............................. SUCCESS [15.382s]
09-Jan-2018 22:24:21 [INFO] org.eclipse.jdt.groovy.core ....................... SUCCESS [1.982s]
09-Jan-2018 22:24:21 [INFO] org.codehaus.groovy.eclipse ....................... SUCCESS [0.484s]
09-Jan-2018 22:24:21 [INFO] org.codehaus.groovy.eclipse.core .................. SUCCESS [1.283s]
09-Jan-2018 22:24:22 [INFO] org.codehaus.groovy.eclipse.ant ................... SUCCESS [0.997s]
09-Jan-2018 22:24:22 [INFO] org.codehaus.groovy.eclipse.codebrowsing .......... SUCCESS [1.481s]
09-Jan-2018 22:24:22 [INFO] org.codehaus.groovy.eclipse.refactoring ........... SUCCESS [1.899s]
09-Jan-2018 22:24:22 [INFO] org.codehaus.groovy.eclipse.ui .................... SUCCESS [2.308s]
09-Jan-2018 22:24:22 [INFO] org.codehaus.groovy.eclipse.astviews .............. SUCCESS [3.188s]
09-Jan-2018 22:24:22 [INFO] org.codehaus.groovy.eclipse.codeassist.completion . SUCCESS [1.719s]
09-Jan-2018 22:24:22 [INFO] org.codehaus.groovy.eclipse.dsl ................... SUCCESS [2.024s]
09-Jan-2018 22:24:22 [INFO] org.codehaus.groovy.eclipse.quickfix .............. SUCCESS [1.510s]
09-Jan-2018 22:24:22 [INFO] org.codehaus.groovy18.feature ..................... SUCCESS [0.683s]
09-Jan-2018 22:24:22 [INFO] org.codehaus.groovy20.feature ..................... SUCCESS [0.562s]
09-Jan-2018 22:24:22 [INFO] org.codehaus.groovy21.feature ..................... SUCCESS [0.550s]
09-Jan-2018 22:24:22 [INFO] org.codehaus.groovy22.feature ..................... SUCCESS [0.542s]
09-Jan-2018 22:24:22 [INFO] org.codehaus.groovy23.feature ..................... SUCCESS [0.534s]
09-Jan-2018 22:24:22 [INFO] org.codehaus.groovy24.feature ..................... SUCCESS [0.540s]
09-Jan-2018 22:24:22 [INFO] org.codehaus.groovy25.feature ..................... SUCCESS [0.535s]
09-Jan-2018 22:24:22 [INFO] org.codehaus.groovy.jdt.patch ..................... SUCCESS [0.567s]
09-Jan-2018 22:24:22 [INFO] org.codehaus.groovy.headless.feature .............. SUCCESS [0.701s]
09-Jan-2018 22:24:22 [INFO] org.codehaus.groovy.compilerless.feature .......... SUCCESS [0.805s]
09-Jan-2018 22:24:22 [INFO] org.codehaus.groovy.eclipse.feature ............... SUCCESS [0.595s]
09-Jan-2018 22:24:22 [INFO] org.eclipse.jdt.core.tests.compiler ............... SUCCESS [6.995s]
09-Jan-2018 22:24:22 [INFO] org.eclipse.jdt.core.tests.builder ................ SUCCESS [1.450s]
09-Jan-2018 22:24:22 [INFO] org.eclipse.jdt.groovy.core.tests.compiler ........ SUCCESS [1.206s]
09-Jan-2018 22:24:22 [INFO] org.eclipse.jdt.groovy.core.tests.builder ......... SUCCESS [1.839s]
09-Jan-2018 22:24:22 [INFO] org.codehaus.groovy.eclipse.tests ................. SUCCESS [5.818s]
09-Jan-2018 22:24:22 [INFO] org.codehaus.groovy.eclipse.codeassist.completion.test  SUCCESS [2.718s]
09-Jan-2018 22:24:22 [INFO] org.codehaus.groovy.eclipse.codebrowsing.test ..... SUCCESS [2.010s]
09-Jan-2018 22:24:22 [INFO] org.codehaus.groovy.eclipse.core.test ............. SUCCESS [1.356s]
09-Jan-2018 22:24:22 [INFO] org.codehaus.groovy.eclipse.dsl.tests ............. SUCCESS [2.183s]
09-Jan-2018 22:24:22 [INFO] org.codehaus.groovy.eclipse.junit.test ............ SUCCESS [1.417s]
09-Jan-2018 22:24:22 [INFO] org.codehaus.groovy.eclipse.refactoring.test ...... SUCCESS [2.976s]
09-Jan-2018 22:24:22 [INFO] org.codehaus.groovy.eclipse.quickfix.test ......... SUCCESS [1.757s]
09-Jan-2018 22:24:22 [INFO] org.codehaus.groovy.alltests ...................... SUCCESS [1:22:16.605s]
09-Jan-2018 22:24:22 [INFO] org.codehaus.groovy.alltests.feature .............. SUCCESS [0.942s]
09-Jan-2018 22:24:22 [INFO] org.codehaus.groovy.m2eclipse ..................... SUCCESS [1.008s]
09-Jan-2018 22:24:22 [INFO] org.codehaus.groovy.m2eclipse.feature ............. SUCCESS [0.549s]
09-Jan-2018 22:24:22 [INFO] org.codehaus.groovy.eclipse.site .................. SUCCESS [55.634s]
09-Jan-2018 22:24:22 [INFO] ------------------------------------------------------------------------
09-Jan-2018 22:24:22 [INFO] BUILD SUCCESS
09-Jan-2018 22:24:22 [INFO] ------------------------------------------------------------------------
09-Jan-2018 22:24:22 [INFO] Total time: 1:29:02.955s
09-Jan-2018 22:24:22 [INFO] Finished at: Tue Jan 09 22:24:22 UTC 2018
09-Jan-2018 22:24:23 [INFO] Final Memory: 283M/1056M
09-Jan-2018 22:24:23 [INFO] ------------------------------------------------------------------------
09-Jan-2018 22:24:23 Parsing test results under /opt/bamboo-home/xml-data/build-dir/GRECLIPSE-E44TP-JOB1...
09-Jan-2018 22:24:24 Finished task 'Maven 3.x' with result: Success
09-Jan-2018 22:24:24 Running post build plugin 'Docker Container Cleanup'
09-Jan-2018 22:24:24 Running post build plugin 'NCover Results Collector'
09-Jan-2018 22:24:24 Running post build plugin 'Artifactory Release Management Staging'
09-Jan-2018 22:24:24 Running post build plugin 'Artifactory Build Info Copier'
09-Jan-2018 22:24:24 Running post build plugin 'Artifactory Gradle Properties Info Copier'
09-Jan-2018 22:24:24 Running post build plugin 'Clover Results Collector'
09-Jan-2018 22:24:24 Running post build plugin 'npm Cache Cleanup'
09-Jan-2018 22:24:24 Running post build plugin 'Artifact Copier'
09-Jan-2018 22:24:24 Publishing an artifact: Zipped Update Site
09-Jan-2018 22:24:29 Finished publishing of artifact Job artifact: [Zipped Update Site], pattern: [**/*updatesite.zip] anchored at: [Site-org.codehaus.groovy.eclipse/target/site] in 5.333 s
09-Jan-2018 22:24:29 Publishing an artifact: surefire-reports
09-Jan-2018 22:24:30 Finished publishing of artifact Job artifact: [surefire-reports], pattern: [**/target/TEST-*.xml] in 997.9 ms
09-Jan-2018 22:24:31 Successfully removed working directory at '/opt/bamboo-home/xml-data/build-dir/GRECLIPSE-E44TP-JOB1'
09-Jan-2018 22:24:31 Finalising the build...
09-Jan-2018 22:24:31 Stopping timer.
09-Jan-2018 22:24:31 Build GRECLIPSE-E44TP-JOB1-801 completed.
09-Jan-2018 22:24:31 Running on server: post build plugin 'NCover Results Collector'
09-Jan-2018 22:24:31 Running on server: post build plugin 'Build Hanging Detection Configuration'
09-Jan-2018 22:24:31 Running on server: post build plugin 'Clover Delta Calculator'
09-Jan-2018 22:24:31 Running on server: post build plugin 'Maven Dependencies Postprocessor'
09-Jan-2018 22:24:31 All post build plugins have finished
09-Jan-2018 22:24:31 Generating build results summary...
09-Jan-2018 22:24:32 Saving build results to disk...
09-Jan-2018 22:24:32 Logging substituted variables...
09-Jan-2018 22:24:32 Indexing build results...
09-Jan-2018 22:24:32 Finished building GRECLIPSE-E44TP-JOB1-801.