E44 build, test and publish

Build: #802 was successful

Job: Default Job was successful

Stages & jobs

  1. Default Stage

Build log

The build generated 35,920 lines of output.The output is too long and has been truncated to the last 1,000 lines. Download or view full build log

02-Feb-2018 21:16:29 testForLoop4(org.eclipse.jdt.core.groovy.tests.search.GenericInferencingTests)  Time elapsed: 0.085 sec
02-Feb-2018 21:16:29 testForLoop5(org.eclipse.jdt.core.groovy.tests.search.GenericInferencingTests)  Time elapsed: 0.097 sec
02-Feb-2018 21:16:29 testForLoop6(org.eclipse.jdt.core.groovy.tests.search.GenericInferencingTests)  Time elapsed: 0.084 sec
02-Feb-2018 21:16:29 testForLoop7(org.eclipse.jdt.core.groovy.tests.search.GenericInferencingTests)  Time elapsed: 0.087 sec
02-Feb-2018 21:16:29 testForLoop8(org.eclipse.jdt.core.groovy.tests.search.GenericInferencingTests)  Time elapsed: 0.086 sec
02-Feb-2018 21:16:29 testForLoop9(org.eclipse.jdt.core.groovy.tests.search.GenericInferencingTests)  Time elapsed: 0.093 sec
02-Feb-2018 21:16:29 testInferringRange1(org.eclipse.jdt.core.groovy.tests.search.GenericInferencingTests)  Time elapsed: 0.109 sec
02-Feb-2018 21:16:29 testInferringRange2(org.eclipse.jdt.core.groovy.tests.search.GenericInferencingTests)  Time elapsed: 0.086 sec
02-Feb-2018 21:16:29 testMapOfList(org.eclipse.jdt.core.groovy.tests.search.GenericInferencingTests)  Time elapsed: 0.089 sec
02-Feb-2018 21:16:29 testList10(org.eclipse.jdt.core.groovy.tests.search.GenericInferencingTests)  Time elapsed: 0.094 sec
02-Feb-2018 21:16:29 testForLoop11(org.eclipse.jdt.core.groovy.tests.search.GenericInferencingTests)  Time elapsed: 0.087 sec
02-Feb-2018 21:16:29 testForLoop2a(org.eclipse.jdt.core.groovy.tests.search.GenericInferencingTests)  Time elapsed: 0.083 sec
02-Feb-2018 21:16:29 testDGMClosure10(org.eclipse.jdt.core.groovy.tests.search.GenericInferencingTests)  Time elapsed: 0.085 sec
02-Feb-2018 21:16:29 testDGMClosure11(org.eclipse.jdt.core.groovy.tests.search.GenericInferencingTests)  Time elapsed: 0.098 sec
02-Feb-2018 21:16:29 testDGMClosure12(org.eclipse.jdt.core.groovy.tests.search.GenericInferencingTests)  Time elapsed: 0.093 sec
02-Feb-2018 21:16:29 testDGMClosure13(org.eclipse.jdt.core.groovy.tests.search.GenericInferencingTests)  Time elapsed: 0.089 sec
02-Feb-2018 21:16:29 testDGMClosure14(org.eclipse.jdt.core.groovy.tests.search.GenericInferencingTests)  Time elapsed: 0.092 sec
02-Feb-2018 21:16:29 testDGMClosure15(org.eclipse.jdt.core.groovy.tests.search.GenericInferencingTests)  Time elapsed: 0.1 sec
02-Feb-2018 21:16:29 testDGMClosure16(org.eclipse.jdt.core.groovy.tests.search.GenericInferencingTests)  Time elapsed: 0.086 sec
02-Feb-2018 21:16:29 testDGMClosure17(org.eclipse.jdt.core.groovy.tests.search.GenericInferencingTests)  Time elapsed: 0.089 sec
02-Feb-2018 21:16:29 testDGMClosure18(org.eclipse.jdt.core.groovy.tests.search.GenericInferencingTests)  Time elapsed: 0.101 sec
02-Feb-2018 21:16:29 testDGMClosure19(org.eclipse.jdt.core.groovy.tests.search.GenericInferencingTests)  Time elapsed: 0.099 sec
02-Feb-2018 21:16:29 testDGMClosure20(org.eclipse.jdt.core.groovy.tests.search.GenericInferencingTests)  Time elapsed: 0.086 sec
02-Feb-2018 21:16:29 testDGMClosure21(org.eclipse.jdt.core.groovy.tests.search.GenericInferencingTests)  Time elapsed: 0.089 sec
02-Feb-2018 21:16:29 testDGMClosure22(org.eclipse.jdt.core.groovy.tests.search.GenericInferencingTests)  Time elapsed: 0.088 sec
02-Feb-2018 21:16:29 testDGMClosure23(org.eclipse.jdt.core.groovy.tests.search.GenericInferencingTests)  Time elapsed: 0.088 sec
02-Feb-2018 21:16:29 testClosure1(org.eclipse.jdt.core.groovy.tests.search.GenericInferencingTests)  Time elapsed: 0.087 sec
02-Feb-2018 21:16:29 testClosure2(org.eclipse.jdt.core.groovy.tests.search.GenericInferencingTests)  Time elapsed: 0.087 sec
02-Feb-2018 21:16:29 testClosure3(org.eclipse.jdt.core.groovy.tests.search.GenericInferencingTests)  Time elapsed: 0.089 sec
02-Feb-2018 21:16:29 testClosure4(org.eclipse.jdt.core.groovy.tests.search.GenericInferencingTests)  Time elapsed: 0.089 sec
02-Feb-2018 21:16:29 testInferringList1(org.eclipse.jdt.core.groovy.tests.search.GenericInferencingTests)  Time elapsed: 0.086 sec
02-Feb-2018 21:16:29 testInferringList2(org.eclipse.jdt.core.groovy.tests.search.GenericInferencingTests)  Time elapsed: 0.084 sec
02-Feb-2018 21:16:29 testInferringList3(org.eclipse.jdt.core.groovy.tests.search.GenericInferencingTests)  Time elapsed: 0.087 sec
02-Feb-2018 21:16:29 testMapOfList2(org.eclipse.jdt.core.groovy.tests.search.GenericInferencingTests)  Time elapsed: 0.088 sec
02-Feb-2018 21:16:29 testMapOfList3(org.eclipse.jdt.core.groovy.tests.search.GenericInferencingTests)  Time elapsed: 0.092 sec
02-Feb-2018 21:16:29 testMapOfList4(org.eclipse.jdt.core.groovy.tests.search.GenericInferencingTests)  Time elapsed: 0.092 sec
02-Feb-2018 21:16:29 testMapOfList5(org.eclipse.jdt.core.groovy.tests.search.GenericInferencingTests)  Time elapsed: 0.087 sec
02-Feb-2018 21:16:29 testMapOfList6(org.eclipse.jdt.core.groovy.tests.search.GenericInferencingTests)  Time elapsed: 0.092 sec
02-Feb-2018 21:16:29 testMapOfList7(org.eclipse.jdt.core.groovy.tests.search.GenericInferencingTests)  Time elapsed: 0.096 sec
02-Feb-2018 21:16:29 testGenericsMapper(org.eclipse.jdt.core.groovy.tests.search.GenericsMappingTests)  Time elapsed: 0.096 sec
02-Feb-2018 21:16:29 testCompileStatic10(org.eclipse.jdt.core.groovy.tests.search.Groovy20InferencingTests)  Time elapsed: 0.119 sec
02-Feb-2018 21:16:29 testCompileStatic1(org.eclipse.jdt.core.groovy.tests.search.Groovy20InferencingTests)  Time elapsed: 0.089 sec
02-Feb-2018 21:16:29 testCompileStatic2(org.eclipse.jdt.core.groovy.tests.search.Groovy20InferencingTests)  Time elapsed: 0.091 sec
02-Feb-2018 21:16:29 testCompileStatic3(org.eclipse.jdt.core.groovy.tests.search.Groovy20InferencingTests)  Time elapsed: 0.092 sec
02-Feb-2018 21:16:29 testCompileStatic4(org.eclipse.jdt.core.groovy.tests.search.Groovy20InferencingTests)  Time elapsed: 0.095 sec
02-Feb-2018 21:16:29 testCompileStatic5(org.eclipse.jdt.core.groovy.tests.search.Groovy20InferencingTests)  Time elapsed: 0.091 sec
02-Feb-2018 21:16:29 testCompileStatic6(org.eclipse.jdt.core.groovy.tests.search.Groovy20InferencingTests)  Time elapsed: 0.118 sec
02-Feb-2018 21:16:29 testCompileStatic7(org.eclipse.jdt.core.groovy.tests.search.Groovy20InferencingTests)  Time elapsed: 0.103 sec
02-Feb-2018 21:16:29 testCompileStatic8(org.eclipse.jdt.core.groovy.tests.search.Groovy20InferencingTests)  Time elapsed: 0.098 sec
02-Feb-2018 21:16:29 testCompileStatic9(org.eclipse.jdt.core.groovy.tests.search.Groovy20InferencingTests)  Time elapsed: 0.095 sec
02-Feb-2018 21:16:29 testTypeChecked1(org.eclipse.jdt.core.groovy.tests.search.Groovy20InferencingTests)  Time elapsed: 0.088 sec
02-Feb-2018 21:16:29 testTypeChecked2(org.eclipse.jdt.core.groovy.tests.search.Groovy20InferencingTests)  Time elapsed: 0.1 sec
02-Feb-2018 21:16:29 testTypeChecked3(org.eclipse.jdt.core.groovy.tests.search.Groovy20InferencingTests)  Time elapsed: 0.095 sec
02-Feb-2018 21:16:29 testTypeChecked4(org.eclipse.jdt.core.groovy.tests.search.Groovy20InferencingTests)  Time elapsed: 0.102 sec
02-Feb-2018 21:16:29 testTypeChecked5(org.eclipse.jdt.core.groovy.tests.search.Groovy20InferencingTests)  Time elapsed: 0.098 sec
02-Feb-2018 21:16:29 testTypeChecked6(org.eclipse.jdt.core.groovy.tests.search.Groovy20InferencingTests)  Time elapsed: 0.093 sec
02-Feb-2018 21:16:29 testTypeChecked7(org.eclipse.jdt.core.groovy.tests.search.Groovy20InferencingTests)  Time elapsed: 0.09 sec
02-Feb-2018 21:16:29 testTypeChecked8(org.eclipse.jdt.core.groovy.tests.search.Groovy20InferencingTests)  Time elapsed: 0.09 sec
02-Feb-2018 21:16:29 testTypeCheckingExtension(org.eclipse.jdt.core.groovy.tests.search.Groovy21InferencingTests)  Time elapsed: 0.586 sec
02-Feb-2018 21:16:29 testDelegatesToTarget1(org.eclipse.jdt.core.groovy.tests.search.Groovy21InferencingTests)  Time elapsed: 0.144 sec
02-Feb-2018 21:16:29 testDelegatesToTarget2(org.eclipse.jdt.core.groovy.tests.search.Groovy21InferencingTests)  Time elapsed: 0.142 sec
02-Feb-2018 21:16:29 testDelegatesToTarget3(org.eclipse.jdt.core.groovy.tests.search.Groovy21InferencingTests)  Time elapsed: 0.186 sec
02-Feb-2018 21:16:29 testDelegatesToTarget4(org.eclipse.jdt.core.groovy.tests.search.Groovy21InferencingTests)  Time elapsed: 0.15 sec
02-Feb-2018 21:16:29 testDelegatesToTarget5(org.eclipse.jdt.core.groovy.tests.search.Groovy21InferencingTests)  Time elapsed: 0.143 sec
02-Feb-2018 21:16:29 testDelegatesToValue2(org.eclipse.jdt.core.groovy.tests.search.Groovy21InferencingTests)  Time elapsed: 0.108 sec
02-Feb-2018 21:16:29 testDelegatesToValue3(org.eclipse.jdt.core.groovy.tests.search.Groovy21InferencingTests)  Time elapsed: 0.096 sec
02-Feb-2018 21:16:29 testDelegatesToValue4(org.eclipse.jdt.core.groovy.tests.search.Groovy21InferencingTests)  Time elapsed: 0.102 sec
02-Feb-2018 21:16:29 testDelegatesToValue5(org.eclipse.jdt.core.groovy.tests.search.Groovy21InferencingTests)  Time elapsed: 0.123 sec
02-Feb-2018 21:16:29 testDelegatesToValue6(org.eclipse.jdt.core.groovy.tests.search.Groovy21InferencingTests)  Time elapsed: 0.145 sec
02-Feb-2018 21:16:29 testDelegatesToValue(org.eclipse.jdt.core.groovy.tests.search.Groovy21InferencingTests)  Time elapsed: 0.109 sec
02-Feb-2018 21:16:29 testEnumOverrides(org.eclipse.jdt.core.groovy.tests.search.Groovy21InferencingTests)  Time elapsed: 0.106 sec
02-Feb-2018 21:16:29 testEnumOverrides2(org.eclipse.jdt.core.groovy.tests.search.Groovy21InferencingTests)  Time elapsed: 0.145 sec
02-Feb-2018 21:16:29 testFieldAndPropertyWithSameName(org.eclipse.jdt.core.groovy.tests.search.InferencingTests)  Time elapsed: 0.091 sec
02-Feb-2018 21:16:29 testObjectMethodOnInterface(org.eclipse.jdt.core.groovy.tests.search.InferencingTests)  Time elapsed: 0.093 sec
02-Feb-2018 21:16:29 testNothingIsUnknown(org.eclipse.jdt.core.groovy.tests.search.InferencingTests)  Time elapsed: 0.093 sec
02-Feb-2018 21:16:29 testInnerClass1(org.eclipse.jdt.core.groovy.tests.search.InferencingTests)  Time elapsed: 0.097 sec
02-Feb-2018 21:16:29 testInnerClass2(org.eclipse.jdt.core.groovy.tests.search.InferencingTests)  Time elapsed: 0.107 sec
02-Feb-2018 21:16:29 testInnerClass3(org.eclipse.jdt.core.groovy.tests.search.InferencingTests)  Time elapsed: 0.109 sec
02-Feb-2018 21:16:29 testInnerClass4(org.eclipse.jdt.core.groovy.tests.search.InferencingTests)  Time elapsed: 0.097 sec
02-Feb-2018 21:16:29 testInnerClass5(org.eclipse.jdt.core.groovy.tests.search.InferencingTests)  Time elapsed: 0.088 sec
02-Feb-2018 21:16:29 testInnerClass6(org.eclipse.jdt.core.groovy.tests.search.InferencingTests)  Time elapsed: 0.084 sec
02-Feb-2018 21:16:29 testInnerClass7(org.eclipse.jdt.core.groovy.tests.search.InferencingTests)  Time elapsed: 0.147 sec
02-Feb-2018 21:16:29 testInnerClass8(org.eclipse.jdt.core.groovy.tests.search.InferencingTests)  Time elapsed: 0.157 sec
02-Feb-2018 21:16:29 testInnerClass9(org.eclipse.jdt.core.groovy.tests.search.InferencingTests)  Time elapsed: 0.111 sec
02-Feb-2018 21:16:29 testBoolean1(org.eclipse.jdt.core.groovy.tests.search.InferencingTests)  Time elapsed: 0.097 sec
02-Feb-2018 21:16:29 testBoolean2(org.eclipse.jdt.core.groovy.tests.search.InferencingTests)  Time elapsed: 0.101 sec
02-Feb-2018 21:16:29 testBoolean3(org.eclipse.jdt.core.groovy.tests.search.InferencingTests)  Time elapsed: 0.091 sec
02-Feb-2018 21:16:29 testBoolean4(org.eclipse.jdt.core.groovy.tests.search.InferencingTests)  Time elapsed: 0.099 sec
02-Feb-2018 21:16:29 testBoolean5(org.eclipse.jdt.core.groovy.tests.search.InferencingTests)  Time elapsed: 0.09 sec
02-Feb-2018 21:16:29 testBoolean6(org.eclipse.jdt.core.groovy.tests.search.InferencingTests)  Time elapsed: 0.096 sec
02-Feb-2018 21:16:29 testBoolean7(org.eclipse.jdt.core.groovy.tests.search.InferencingTests)  Time elapsed: 0.098 sec
02-Feb-2018 21:16:29 testDeclarationAtBeginningOfMethod(org.eclipse.jdt.core.groovy.tests.search.InferencingTests)  Time elapsed: 0.087 sec
02-Feb-2018 21:16:29 testLocalTypeAndDefaultImportCollision(org.eclipse.jdt.core.groovy.tests.search.InferencingTests)  Time elapsed: 0.107 sec
02-Feb-2018 21:16:29 testSuperClassMethod(org.eclipse.jdt.core.groovy.tests.search.InferencingTests)  Time elapsed: 0.091 sec
02-Feb-2018 21:16:29 testGRECLIPSE731a(org.eclipse.jdt.core.groovy.tests.search.InferencingTests)  Time elapsed: 0.092 sec
02-Feb-2018 21:16:29 testGRECLIPSE731b(org.eclipse.jdt.core.groovy.tests.search.InferencingTests)  Time elapsed: 0.093 sec
02-Feb-2018 21:16:29 testGRECLIPSE731c(org.eclipse.jdt.core.groovy.tests.search.InferencingTests)  Time elapsed: 0.093 sec
02-Feb-2018 21:16:29 testGRECLIPSE731d(org.eclipse.jdt.core.groovy.tests.search.InferencingTests)  Time elapsed: 0.09 sec
02-Feb-2018 21:16:29 testGRECLIPSE731e(org.eclipse.jdt.core.groovy.tests.search.InferencingTests)  Time elapsed: 0.102 sec
02-Feb-2018 21:16:29 testGRECLIPSE731f(org.eclipse.jdt.core.groovy.tests.search.InferencingTests)  Time elapsed: 0.092 sec
02-Feb-2018 21:16:29 testSpecialConstructor1(org.eclipse.jdt.core.groovy.tests.search.InferencingTests)  Time elapsed: 0.094 sec
02-Feb-2018 21:16:29 testSpecialConstructor2(org.eclipse.jdt.core.groovy.tests.search.InferencingTests)  Time elapsed: 0.114 sec
02-Feb-2018 21:16:29 testInnerClass10(org.eclipse.jdt.core.groovy.tests.search.InferencingTests)  Time elapsed: 0.116 sec
02-Feb-2018 21:16:29 testInnerClass11(org.eclipse.jdt.core.groovy.tests.search.InferencingTests)  Time elapsed: 0.13 sec
02-Feb-2018 21:16:29 testMultiDecl10(org.eclipse.jdt.core.groovy.tests.search.InferencingTests)  Time elapsed: 0.112 sec
02-Feb-2018 21:16:29 testMultiDecl11(org.eclipse.jdt.core.groovy.tests.search.InferencingTests)  Time elapsed: 0.116 sec
02-Feb-2018 21:16:29 testMultiDecl12(org.eclipse.jdt.core.groovy.tests.search.InferencingTests)  Time elapsed: 0.1 sec
02-Feb-2018 21:16:29 testMultiDecl13(org.eclipse.jdt.core.groovy.tests.search.InferencingTests)  Time elapsed: 0.103 sec
02-Feb-2018 21:16:29 testAssignementInInnerBlock(org.eclipse.jdt.core.groovy.tests.search.InferencingTests)  Time elapsed: 0.087 sec
02-Feb-2018 21:16:29 testConstantFromSuper(org.eclipse.jdt.core.groovy.tests.search.InferencingTests)  Time elapsed: 0.096 sec
02-Feb-2018 21:16:29 testAsExpression1(org.eclipse.jdt.core.groovy.tests.search.InferencingTests)  Time elapsed: 0.089 sec
02-Feb-2018 21:16:29 testAsExpression2(org.eclipse.jdt.core.groovy.tests.search.InferencingTests)  Time elapsed: 0.1 sec
02-Feb-2018 21:16:29 testSuperClassMethod2(org.eclipse.jdt.core.groovy.tests.search.InferencingTests)  Time elapsed: 0.094 sec
02-Feb-2018 21:16:29 testNumber1a(org.eclipse.jdt.core.groovy.tests.search.InferencingTests)  Time elapsed: 0.088 sec
02-Feb-2018 21:16:29 testDGM1(org.eclipse.jdt.core.groovy.tests.search.InferencingTests)  Time elapsed: 0.089 sec
02-Feb-2018 21:16:29 testDGM2(org.eclipse.jdt.core.groovy.tests.search.InferencingTests)  Time elapsed: 0.087 sec
02-Feb-2018 21:16:29 testDGM3(org.eclipse.jdt.core.groovy.tests.search.InferencingTests)  Time elapsed: 0.084 sec
02-Feb-2018 21:16:29 testRangeExpression1(org.eclipse.jdt.core.groovy.tests.search.InferencingTests)  Time elapsed: 0.089 sec
02-Feb-2018 21:16:29 testRangeExpression2(org.eclipse.jdt.core.groovy.tests.search.InferencingTests)  Time elapsed: 0.086 sec
02-Feb-2018 21:16:29 testRangeExpression3(org.eclipse.jdt.core.groovy.tests.search.InferencingTests)  Time elapsed: 0.112 sec
02-Feb-2018 21:16:29 testRangeExpression4(org.eclipse.jdt.core.groovy.tests.search.InferencingTests)  Time elapsed: 0.089 sec
02-Feb-2018 21:16:29 testRangeExpression5(org.eclipse.jdt.core.groovy.tests.search.InferencingTests)  Time elapsed: 0.114 sec
02-Feb-2018 21:16:29 testRangeExpression6(org.eclipse.jdt.core.groovy.tests.search.InferencingTests)  Time elapsed: 0.106 sec
02-Feb-2018 21:16:29 testSpread10(org.eclipse.jdt.core.groovy.tests.search.InferencingTests)  Time elapsed: 0.099 sec
02-Feb-2018 21:16:29 testSpread11(org.eclipse.jdt.core.groovy.tests.search.InferencingTests)  Time elapsed: 0.095 sec
02-Feb-2018 21:16:29 testSpread12(org.eclipse.jdt.core.groovy.tests.search.InferencingTests)  Time elapsed: 0.094 sec
02-Feb-2018 21:16:29 testSpread13(org.eclipse.jdt.core.groovy.tests.search.InferencingTests)  Time elapsed: 0.135 sec
02-Feb-2018 21:16:29 testStaticThisAndSuper2(org.eclipse.jdt.core.groovy.tests.search.InferencingTests)  Time elapsed: 0.099 sec
02-Feb-2018 21:16:29 testConstructor1(org.eclipse.jdt.core.groovy.tests.search.InferencingTests)  Time elapsed: 0.165 sec
02-Feb-2018 21:16:29 testConstructor2(org.eclipse.jdt.core.groovy.tests.search.InferencingTests)  Time elapsed: 0.17 sec
02-Feb-2018 21:16:29 testConstructor3(org.eclipse.jdt.core.groovy.tests.search.InferencingTests)  Time elapsed: 0.127 sec
02-Feb-2018 21:16:29 testConstructor4(org.eclipse.jdt.core.groovy.tests.search.InferencingTests)  Time elapsed: 0.166 sec
02-Feb-2018 21:16:29 testConstructor5(org.eclipse.jdt.core.groovy.tests.search.InferencingTests)  Time elapsed: 0.136 sec
02-Feb-2018 21:16:29 testConstructor6(org.eclipse.jdt.core.groovy.tests.search.InferencingTests)  Time elapsed: 0.235 sec
02-Feb-2018 21:16:29 testInterfaceMethodsAsProperty(org.eclipse.jdt.core.groovy.tests.search.InferencingTests)  Time elapsed: 0.135 sec
02-Feb-2018 21:16:29 testPostfix(org.eclipse.jdt.core.groovy.tests.search.InferencingTests)  Time elapsed: 0.088 sec
02-Feb-2018 21:16:29 testListSort1(org.eclipse.jdt.core.groovy.tests.search.InferencingTests)  Time elapsed: 0.097 sec
02-Feb-2018 21:16:29 testListSort2(org.eclipse.jdt.core.groovy.tests.search.InferencingTests)  Time elapsed: 0.121 sec
02-Feb-2018 21:16:29 testListSort3(org.eclipse.jdt.core.groovy.tests.search.InferencingTests)  Time elapsed: 0.108 sec
02-Feb-2018 21:16:29 testLocalVar1(org.eclipse.jdt.core.groovy.tests.search.InferencingTests)  Time elapsed: 0.086 sec
02-Feb-2018 21:16:29 testLocalVar2(org.eclipse.jdt.core.groovy.tests.search.InferencingTests)  Time elapsed: 0.092 sec
02-Feb-2018 21:16:29 testLocalVar3(org.eclipse.jdt.core.groovy.tests.search.InferencingTests)  Time elapsed: 0.09 sec
02-Feb-2018 21:16:29 testLocalVar4(org.eclipse.jdt.core.groovy.tests.search.InferencingTests)  Time elapsed: 0.087 sec
02-Feb-2018 21:16:29 testIndirectInterfaceMethod(org.eclipse.jdt.core.groovy.tests.search.InferencingTests)  Time elapsed: 0.127 sec
02-Feb-2018 21:16:29 testMapLiteral(org.eclipse.jdt.core.groovy.tests.search.InferencingTests)  Time elapsed: 0.085 sec
02-Feb-2018 21:16:29 testListRemove(org.eclipse.jdt.core.groovy.tests.search.InferencingTests)  Time elapsed: 0.11 sec
02-Feb-2018 21:16:29 testCategoryMethodAsProperty(org.eclipse.jdt.core.groovy.tests.search.InferencingTests)  Time elapsed: 0.087 sec
02-Feb-2018 21:16:29 testNothingIsUnknownWithCategories(org.eclipse.jdt.core.groovy.tests.search.InferencingTests)  Time elapsed: 0.099 sec
02-Feb-2018 21:16:29 testImplicitVar1(org.eclipse.jdt.core.groovy.tests.search.InferencingTests)  Time elapsed: 0.08 sec
02-Feb-2018 21:16:29 testImplicitVar2(org.eclipse.jdt.core.groovy.tests.search.InferencingTests)  Time elapsed: 0.116 sec
02-Feb-2018 21:16:29 testImplicitVar3(org.eclipse.jdt.core.groovy.tests.search.InferencingTests)  Time elapsed: 0.086 sec
02-Feb-2018 21:16:29 testImplicitVar4(org.eclipse.jdt.core.groovy.tests.search.InferencingTests)  Time elapsed: 0.1 sec
02-Feb-2018 21:16:29 testImplicitVar5(org.eclipse.jdt.core.groovy.tests.search.InferencingTests)  Time elapsed: 0.088 sec
02-Feb-2018 21:16:29 testImplicitVar6(org.eclipse.jdt.core.groovy.tests.search.InferencingTests)  Time elapsed: 0.094 sec
02-Feb-2018 21:16:29 testImplicitVar7(org.eclipse.jdt.core.groovy.tests.search.InferencingTests)  Time elapsed: 0.09 sec
02-Feb-2018 21:16:29 testClassLiteral1(org.eclipse.jdt.core.groovy.tests.search.InferencingTests)  Time elapsed: 0.091 sec
02-Feb-2018 21:16:29 testClassLiteral2(org.eclipse.jdt.core.groovy.tests.search.InferencingTests)  Time elapsed: 0.096 sec
02-Feb-2018 21:16:29 testClassLiteral3(org.eclipse.jdt.core.groovy.tests.search.InferencingTests)  Time elapsed: 0.087 sec
02-Feb-2018 21:16:29 testClassLiteral4(org.eclipse.jdt.core.groovy.tests.search.InferencingTests)  Time elapsed: 0.085 sec
02-Feb-2018 21:16:29 testClassLiteral5(org.eclipse.jdt.core.groovy.tests.search.InferencingTests)  Time elapsed: 0.089 sec
02-Feb-2018 21:16:29 testScriptDeclaringType(org.eclipse.jdt.core.groovy.tests.search.InferencingTests)  Time elapsed: 0.085 sec
02-Feb-2018 21:16:29 testInstanceOf10(org.eclipse.jdt.core.groovy.tests.search.InferencingTests)  Time elapsed: 0.153 sec
02-Feb-2018 21:16:29 testInstanceOf1a(org.eclipse.jdt.core.groovy.tests.search.InferencingTests)  Time elapsed: 0.161 sec
02-Feb-2018 21:16:29 testInstanceOf1b(org.eclipse.jdt.core.groovy.tests.search.InferencingTests)  Time elapsed: 0.169 sec
02-Feb-2018 21:16:29 testStaticImports1(org.eclipse.jdt.core.groovy.tests.search.InferencingTests)  Time elapsed: 0.097 sec
02-Feb-2018 21:16:29 testStaticImports2(org.eclipse.jdt.core.groovy.tests.search.InferencingTests)  Time elapsed: 0.098 sec
02-Feb-2018 21:16:29 testStaticImports3(org.eclipse.jdt.core.groovy.tests.search.InferencingTests)  Time elapsed: 0.103 sec
02-Feb-2018 21:16:29 testStaticImports4(org.eclipse.jdt.core.groovy.tests.search.InferencingTests)  Time elapsed: 0.112 sec
02-Feb-2018 21:16:29 testElvisOperator(org.eclipse.jdt.core.groovy.tests.search.InferencingTests)  Time elapsed: 0.086 sec
02-Feb-2018 21:16:29 testMultiDecl1(org.eclipse.jdt.core.groovy.tests.search.InferencingTests)  Time elapsed: 0.1 sec
02-Feb-2018 21:16:29 testMultiDecl2(org.eclipse.jdt.core.groovy.tests.search.InferencingTests)  Time elapsed: 0.1 sec
02-Feb-2018 21:16:29 testMultiDecl3(org.eclipse.jdt.core.groovy.tests.search.InferencingTests)  Time elapsed: 0.099 sec
02-Feb-2018 21:16:29 testMultiDecl4(org.eclipse.jdt.core.groovy.tests.search.InferencingTests)  Time elapsed: 0.091 sec
02-Feb-2018 21:16:29 testMultiDecl6(org.eclipse.jdt.core.groovy.tests.search.InferencingTests)  Time elapsed: 0.121 sec
02-Feb-2018 21:16:29 testMultiDecl7(org.eclipse.jdt.core.groovy.tests.search.InferencingTests)  Time elapsed: 0.107 sec
02-Feb-2018 21:16:29 testMultiDecl8(org.eclipse.jdt.core.groovy.tests.search.InferencingTests)  Time elapsed: 0.101 sec
02-Feb-2018 21:16:29 testMultiDecl9(org.eclipse.jdt.core.groovy.tests.search.InferencingTests)  Time elapsed: 0.106 sec
02-Feb-2018 21:16:29 testStaticThisAndSuper(org.eclipse.jdt.core.groovy.tests.search.InferencingTests)  Time elapsed: 0.098 sec
02-Feb-2018 21:16:29 testLocalMethod1(org.eclipse.jdt.core.groovy.tests.search.InferencingTests)  Time elapsed: 0.09 sec
02-Feb-2018 21:16:29 testLocalMethod2(org.eclipse.jdt.core.groovy.tests.search.InferencingTests)  Time elapsed: 0.088 sec
02-Feb-2018 21:16:29 testLocalMethod3(org.eclipse.jdt.core.groovy.tests.search.InferencingTests)  Time elapsed: 0.091 sec
02-Feb-2018 21:16:29 testLocalMethod4(org.eclipse.jdt.core.groovy.tests.search.InferencingTests)  Time elapsed: 0.09 sec
02-Feb-2018 21:16:29 testLocalMethod5(org.eclipse.jdt.core.groovy.tests.search.InferencingTests)  Time elapsed: 0.095 sec
02-Feb-2018 21:16:29 testLocalMethod6(org.eclipse.jdt.core.groovy.tests.search.InferencingTests)  Time elapsed: 0.089 sec
02-Feb-2018 21:16:29 testLocalMethod7(org.eclipse.jdt.core.groovy.tests.search.InferencingTests)  Time elapsed: 0.105 sec
02-Feb-2018 21:16:29 testLocalVar2a(org.eclipse.jdt.core.groovy.tests.search.InferencingTests)  Time elapsed: 0.089 sec
02-Feb-2018 21:16:29 testNoGString(org.eclipse.jdt.core.groovy.tests.search.InferencingTests)  Time elapsed: 0.085 sec
02-Feb-2018 21:16:29 testMapEntries1(org.eclipse.jdt.core.groovy.tests.search.InferencingTests)  Time elapsed: 0.118 sec
02-Feb-2018 21:16:29 testObjectMethodOnInterfaceAsProperty(org.eclipse.jdt.core.groovy.tests.search.InferencingTests)  Time elapsed: 0.089 sec
02-Feb-2018 21:16:29 testMatcher1(org.eclipse.jdt.core.groovy.tests.search.InferencingTests)  Time elapsed: 0.087 sec
02-Feb-2018 21:16:29 testMatcher2(org.eclipse.jdt.core.groovy.tests.search.InferencingTests)  Time elapsed: 0.086 sec
02-Feb-2018 21:16:29 testSuperFieldReference(org.eclipse.jdt.core.groovy.tests.search.InferencingTests)  Time elapsed: 0.086 sec
02-Feb-2018 21:16:29 testAssignementInInnerBlock2(org.eclipse.jdt.core.groovy.tests.search.InferencingTests)  Time elapsed: 0.076 sec
02-Feb-2018 21:16:29 testAssignment1(org.eclipse.jdt.core.groovy.tests.search.InferencingTests)  Time elapsed: 0.086 sec
02-Feb-2018 21:16:29 testAssignment2(org.eclipse.jdt.core.groovy.tests.search.InferencingTests)  Time elapsed: 0.074 sec
02-Feb-2018 21:16:29 testAssignment3(org.eclipse.jdt.core.groovy.tests.search.InferencingTests)  Time elapsed: 0.086 sec
02-Feb-2018 21:16:29 testAssignment4(org.eclipse.jdt.core.groovy.tests.search.InferencingTests)  Time elapsed: 0.088 sec
02-Feb-2018 21:16:29 testAssignment5(org.eclipse.jdt.core.groovy.tests.search.InferencingTests)  Time elapsed: 0.092 sec
02-Feb-2018 21:16:29 testStaticMethodCall2(org.eclipse.jdt.core.groovy.tests.search.InferencingTests)  Time elapsed: 0.089 sec
02-Feb-2018 21:16:29 testStaticMethodCall3(org.eclipse.jdt.core.groovy.tests.search.InferencingTests)  Time elapsed: 0.093 sec
02-Feb-2018 21:16:29 testStaticMethodCall4(org.eclipse.jdt.core.groovy.tests.search.InferencingTests)  Time elapsed: 0.081 sec
02-Feb-2018 21:16:29 testStaticMethodCall5(org.eclipse.jdt.core.groovy.tests.search.InferencingTests)  Time elapsed: 0.087 sec
02-Feb-2018 21:16:29 testStaticMethodCall6(org.eclipse.jdt.core.groovy.tests.search.InferencingTests)  Time elapsed: 0.112 sec
02-Feb-2018 21:16:29 testStaticMethodCall7(org.eclipse.jdt.core.groovy.tests.search.InferencingTests)  Time elapsed: 0.098 sec
02-Feb-2018 21:16:29 testStaticMethodCall8(org.eclipse.jdt.core.groovy.tests.search.InferencingTests)  Time elapsed: 0.097 sec
02-Feb-2018 21:16:29 testStaticMethodCall9(org.eclipse.jdt.core.groovy.tests.search.InferencingTests)  Time elapsed: 0.099 sec
02-Feb-2018 21:16:29 testCatchBlock1(org.eclipse.jdt.core.groovy.tests.search.InferencingTests)  Time elapsed: 0.092 sec
02-Feb-2018 21:16:29 testCatchBlock2(org.eclipse.jdt.core.groovy.tests.search.InferencingTests)  Time elapsed: 0.088 sec
02-Feb-2018 21:16:29 testCatchBlock3(org.eclipse.jdt.core.groovy.tests.search.InferencingTests)  Time elapsed: 0.091 sec
02-Feb-2018 21:16:29 testCatchBlock4(org.eclipse.jdt.core.groovy.tests.search.InferencingTests)  Time elapsed: 0.086 sec
02-Feb-2018 21:16:29 testCatchBlock5(org.eclipse.jdt.core.groovy.tests.search.InferencingTests)  Time elapsed: 0.086 sec
02-Feb-2018 21:16:29 testTernaryExpression(org.eclipse.jdt.core.groovy.tests.search.InferencingTests)  Time elapsed: 0.089 sec
02-Feb-2018 21:16:29 testInterfaceMethodAsProperty2(org.eclipse.jdt.core.groovy.tests.search.InferencingTests)  Time elapsed: 0.119 sec
02-Feb-2018 21:16:29 testInterfaceMethodAsProperty3(org.eclipse.jdt.core.groovy.tests.search.InferencingTests)  Time elapsed: 0.126 sec
02-Feb-2018 21:16:29 testGetAt1(org.eclipse.jdt.core.groovy.tests.search.InferencingTests)  Time elapsed: 0.102 sec
02-Feb-2018 21:16:29 testGetAt2(org.eclipse.jdt.core.groovy.tests.search.InferencingTests)  Time elapsed: 0.092 sec
02-Feb-2018 21:16:29 testGetAt3(org.eclipse.jdt.core.groovy.tests.search.InferencingTests)  Time elapsed: 0.095 sec
02-Feb-2018 21:16:29 testGetAt4(org.eclipse.jdt.core.groovy.tests.search.InferencingTests)  Time elapsed: 0.085 sec
02-Feb-2018 21:16:29 testGetAt5(org.eclipse.jdt.core.groovy.tests.search.InferencingTests)  Time elapsed: 0.102 sec
02-Feb-2018 21:16:29 testGetAt6(org.eclipse.jdt.core.groovy.tests.search.InferencingTests)  Time elapsed: 0.117 sec
02-Feb-2018 21:16:29 testGetAt7(org.eclipse.jdt.core.groovy.tests.search.InferencingTests)  Time elapsed: 0.11 sec
02-Feb-2018 21:16:29 testFieldWithInitializer1(org.eclipse.jdt.core.groovy.tests.search.InferencingTests)  Time elapsed: 0.091 sec
02-Feb-2018 21:16:29 testFieldWithInitializer2(org.eclipse.jdt.core.groovy.tests.search.InferencingTests)  Time elapsed: 0.105 sec
02-Feb-2018 21:16:29 testNested1(org.eclipse.jdt.core.groovy.tests.search.InferencingTests)  Time elapsed: 0.083 sec
02-Feb-2018 21:16:29 testNested2(org.eclipse.jdt.core.groovy.tests.search.InferencingTests)  Time elapsed: 0.088 sec
02-Feb-2018 21:16:29 testNested3(org.eclipse.jdt.core.groovy.tests.search.InferencingTests)  Time elapsed: 0.089 sec
02-Feb-2018 21:16:29 testNested4(org.eclipse.jdt.core.groovy.tests.search.InferencingTests)  Time elapsed: 0.098 sec
02-Feb-2018 21:16:29 testIndirectInterfaceConstant(org.eclipse.jdt.core.groovy.tests.search.InferencingTests)  Time elapsed: 0.139 sec
02-Feb-2018 21:16:29 testInstanceOf1(org.eclipse.jdt.core.groovy.tests.search.InferencingTests)  Time elapsed: 0.135 sec
02-Feb-2018 21:16:29 testInstanceOf2(org.eclipse.jdt.core.groovy.tests.search.InferencingTests)  Time elapsed: 0.14 sec
02-Feb-2018 21:16:29 testInstanceOf3(org.eclipse.jdt.core.groovy.tests.search.InferencingTests)  Time elapsed: 0.153 sec
02-Feb-2018 21:16:29 testInstanceOf4(org.eclipse.jdt.core.groovy.tests.search.InferencingTests)  Time elapsed: 0.229 sec
02-Feb-2018 21:16:29 testInstanceOf5(org.eclipse.jdt.core.groovy.tests.search.InferencingTests)  Time elapsed: 0.184 sec
02-Feb-2018 21:16:29 testInstanceOf6(org.eclipse.jdt.core.groovy.tests.search.InferencingTests)  Time elapsed: 0.163 sec
02-Feb-2018 21:16:29 testInstanceOf7(org.eclipse.jdt.core.groovy.tests.search.InferencingTests)  Time elapsed: 0.151 sec
02-Feb-2018 21:16:29 testInstanceOf8(org.eclipse.jdt.core.groovy.tests.search.InferencingTests)  Time elapsed: 0.163 sec
02-Feb-2018 21:16:29 testInstanceOf9(org.eclipse.jdt.core.groovy.tests.search.InferencingTests)  Time elapsed: 0.153 sec
02-Feb-2018 21:16:29 testAnonInner1(org.eclipse.jdt.core.groovy.tests.search.InferencingTests)  Time elapsed: 0.094 sec
02-Feb-2018 21:16:29 testAnonInner2(org.eclipse.jdt.core.groovy.tests.search.InferencingTests)  Time elapsed: 0.094 sec
02-Feb-2018 21:16:29 testAnonInner3(org.eclipse.jdt.core.groovy.tests.search.InferencingTests)  Time elapsed: 0.09 sec
02-Feb-2018 21:16:29 testAnonInner4(org.eclipse.jdt.core.groovy.tests.search.InferencingTests)  Time elapsed: 0.095 sec
02-Feb-2018 21:16:29 testAnonInner5(org.eclipse.jdt.core.groovy.tests.search.InferencingTests)  Time elapsed: 0.094 sec
02-Feb-2018 21:16:29 testAnonInner6(org.eclipse.jdt.core.groovy.tests.search.InferencingTests)  Time elapsed: 0.113 sec
02-Feb-2018 21:16:29 testAnonInner7(org.eclipse.jdt.core.groovy.tests.search.InferencingTests)  Time elapsed: 0.166 sec
02-Feb-2018 21:16:29 testThisInInnerClass1(org.eclipse.jdt.core.groovy.tests.search.InferencingTests)  Time elapsed: 0.127 sec
02-Feb-2018 21:16:29 testNumber1(org.eclipse.jdt.core.groovy.tests.search.InferencingTests)  Time elapsed: 0.108 sec
02-Feb-2018 21:16:29 testNumber2(org.eclipse.jdt.core.groovy.tests.search.InferencingTests)  Time elapsed: 0.09 sec
02-Feb-2018 21:16:29 testNumber3(org.eclipse.jdt.core.groovy.tests.search.InferencingTests)  Time elapsed: 0.091 sec
02-Feb-2018 21:16:29 testNumber4(org.eclipse.jdt.core.groovy.tests.search.InferencingTests)  Time elapsed: 0.089 sec
02-Feb-2018 21:16:29 testNumber5(org.eclipse.jdt.core.groovy.tests.search.InferencingTests)  Time elapsed: 0.091 sec
02-Feb-2018 21:16:29 testNumber6(org.eclipse.jdt.core.groovy.tests.search.InferencingTests)  Time elapsed: 0.098 sec
02-Feb-2018 21:16:29 testSpread1(org.eclipse.jdt.core.groovy.tests.search.InferencingTests)  Time elapsed: 0.089 sec
02-Feb-2018 21:16:29 testSpread2(org.eclipse.jdt.core.groovy.tests.search.InferencingTests)  Time elapsed: 0.095 sec
02-Feb-2018 21:16:29 testSpread3(org.eclipse.jdt.core.groovy.tests.search.InferencingTests)  Time elapsed: 0.091 sec
02-Feb-2018 21:16:29 testSpread4(org.eclipse.jdt.core.groovy.tests.search.InferencingTests)  Time elapsed: 0.089 sec
02-Feb-2018 21:16:29 testSpread5(org.eclipse.jdt.core.groovy.tests.search.InferencingTests)  Time elapsed: 0.092 sec
02-Feb-2018 21:16:29 testSpread6(org.eclipse.jdt.core.groovy.tests.search.InferencingTests)  Time elapsed: 0.091 sec
02-Feb-2018 21:16:29 testSpread7(org.eclipse.jdt.core.groovy.tests.search.InferencingTests)  Time elapsed: 0.089 sec
02-Feb-2018 21:16:29 testSpread8(org.eclipse.jdt.core.groovy.tests.search.InferencingTests)  Time elapsed: 0.093 sec
02-Feb-2018 21:16:29 testSpread9(org.eclipse.jdt.core.groovy.tests.search.InferencingTests)  Time elapsed: 0.085 sec
02-Feb-2018 21:16:29 testPattern1(org.eclipse.jdt.core.groovy.tests.search.InferencingTests)  Time elapsed: 0.093 sec
02-Feb-2018 21:16:29 testPattern2(org.eclipse.jdt.core.groovy.tests.search.InferencingTests)  Time elapsed: 0.086 sec
02-Feb-2018 21:16:29 testString1(org.eclipse.jdt.core.groovy.tests.search.InferencingTests)  Time elapsed: 0.089 sec
02-Feb-2018 21:16:29 testString2(org.eclipse.jdt.core.groovy.tests.search.InferencingTests)  Time elapsed: 0.108 sec
02-Feb-2018 21:16:29 testString3(org.eclipse.jdt.core.groovy.tests.search.InferencingTests)  Time elapsed: 0.101 sec
02-Feb-2018 21:16:29 testString4(org.eclipse.jdt.core.groovy.tests.search.InferencingTests)  Time elapsed: 0.102 sec
02-Feb-2018 21:16:29 testStaticMethodCall(org.eclipse.jdt.core.groovy.tests.search.InferencingTests)  Time elapsed: 0.095 sec
02-Feb-2018 21:16:29 testClassReference1(org.eclipse.jdt.core.groovy.tests.search.InferencingTests)  Time elapsed: 0.088 sec
02-Feb-2018 21:16:29 testClassReference2(org.eclipse.jdt.core.groovy.tests.search.InferencingTests)  Time elapsed: 0.098 sec
02-Feb-2018 21:16:29 testClassReference3(org.eclipse.jdt.core.groovy.tests.search.InferencingTests)  Time elapsed: 0.09 sec
02-Feb-2018 21:16:29 testClassReference4(org.eclipse.jdt.core.groovy.tests.search.InferencingTests)  Time elapsed: 0.089 sec
02-Feb-2018 21:16:29 testPropertyNodeFromJava1(org.eclipse.jdt.core.groovy.tests.search.JDTPropertyNodeInferencingTests)  Time elapsed: 0.09 sec
02-Feb-2018 21:16:29 testPropertyNodeFromJava2(org.eclipse.jdt.core.groovy.tests.search.JDTPropertyNodeInferencingTests)  Time elapsed: 0.094 sec
02-Feb-2018 21:16:29 testPropertyNodeFromJava3(org.eclipse.jdt.core.groovy.tests.search.JDTPropertyNodeInferencingTests)  Time elapsed: 0.09 sec
02-Feb-2018 21:16:29 testPropertyNodeFromJava4(org.eclipse.jdt.core.groovy.tests.search.JDTPropertyNodeInferencingTests)  Time elapsed: 0.093 sec
02-Feb-2018 21:16:29 testNodeFromJava1(org.eclipse.jdt.core.groovy.tests.search.JDTPropertyNodeInferencingTests)  Time elapsed: 0.092 sec
02-Feb-2018 21:16:29 testPropertyNodeReferenceInBinary1(org.eclipse.jdt.core.groovy.tests.search.JDTPropertyNodeInferencingTests)  Time elapsed: 0.098 sec
02-Feb-2018 21:16:29 testvarReferenceInGString1(org.eclipse.jdt.core.groovy.tests.search.LocalVariableReferenceSearchTests)  Time elapsed: 0.093 sec
02-Feb-2018 21:16:29 testvarReferenceInGString2(org.eclipse.jdt.core.groovy.tests.search.LocalVariableReferenceSearchTests)  Time elapsed: 0.093 sec
02-Feb-2018 21:16:29 testvarReferenceInGString3(org.eclipse.jdt.core.groovy.tests.search.LocalVariableReferenceSearchTests)  Time elapsed: 0.081 sec
02-Feb-2018 21:16:29 testvarReferenceInGString4(org.eclipse.jdt.core.groovy.tests.search.LocalVariableReferenceSearchTests)  Time elapsed: 0.095 sec
02-Feb-2018 21:16:29 testvarReferenceInGString5(org.eclipse.jdt.core.groovy.tests.search.LocalVariableReferenceSearchTests)  Time elapsed: 0.107 sec
02-Feb-2018 21:16:29 testvarReference1(org.eclipse.jdt.core.groovy.tests.search.LocalVariableReferenceSearchTests)  Time elapsed: 0.092 sec
02-Feb-2018 21:16:29 testvarReference2(org.eclipse.jdt.core.groovy.tests.search.LocalVariableReferenceSearchTests)  Time elapsed: 0.095 sec
02-Feb-2018 21:16:29 testvarReference3(org.eclipse.jdt.core.groovy.tests.search.LocalVariableReferenceSearchTests)  Time elapsed: 0.092 sec
02-Feb-2018 21:16:29 testvarReference4(org.eclipse.jdt.core.groovy.tests.search.LocalVariableReferenceSearchTests)  Time elapsed: 0.092 sec
02-Feb-2018 21:16:29 testvarReference5(org.eclipse.jdt.core.groovy.tests.search.LocalVariableReferenceSearchTests)  Time elapsed: 0.098 sec
02-Feb-2018 21:16:29 testvarReference6(org.eclipse.jdt.core.groovy.tests.search.LocalVariableReferenceSearchTests)  Time elapsed: 0.093 sec
02-Feb-2018 21:16:29 testvarReference7(org.eclipse.jdt.core.groovy.tests.search.LocalVariableReferenceSearchTests)  Time elapsed: 0.098 sec
02-Feb-2018 21:16:29 testvarReference8(org.eclipse.jdt.core.groovy.tests.search.LocalVariableReferenceSearchTests)  Time elapsed: 0.089 sec
02-Feb-2018 21:16:29 testvarReference9(org.eclipse.jdt.core.groovy.tests.search.LocalVariableReferenceSearchTests)  Time elapsed: 0.092 sec
02-Feb-2018 21:16:29 testvarReference10(org.eclipse.jdt.core.groovy.tests.search.LocalVariableReferenceSearchTests)  Time elapsed: 0.09 sec
02-Feb-2018 21:16:29 testConstructorReferenceSearch(org.eclipse.jdt.core.groovy.tests.search.MethodReferenceSearchTests)  Time elapsed: 0.157 sec
02-Feb-2018 21:16:29 testOverloadedMethodReferences1(org.eclipse.jdt.core.groovy.tests.search.MethodReferenceSearchTests)  Time elapsed: 0.178 sec
02-Feb-2018 21:16:29 testOverloadedMethodReferences2(org.eclipse.jdt.core.groovy.tests.search.MethodReferenceSearchTests)  Time elapsed: 0.162 sec
02-Feb-2018 21:16:29 testOverloadedMethodReferences3(org.eclipse.jdt.core.groovy.tests.search.MethodReferenceSearchTests)  Time elapsed: 0.172 sec
02-Feb-2018 21:16:29 testOverloadedMethodReferences4(org.eclipse.jdt.core.groovy.tests.search.MethodReferenceSearchTests)  Time elapsed: 0.199 sec
02-Feb-2018 21:16:29 testOverloadedMethodReferences5(org.eclipse.jdt.core.groovy.tests.search.MethodReferenceSearchTests)  Time elapsed: 0.204 sec
02-Feb-2018 21:16:29 testOverloadedMethodReferences6(org.eclipse.jdt.core.groovy.tests.search.MethodReferenceSearchTests)  Time elapsed: 0.2 sec
02-Feb-2018 21:16:29 testStaticMethodReferenceSearch(org.eclipse.jdt.core.groovy.tests.search.MethodReferenceSearchTests)  Time elapsed: 0.095 sec
02-Feb-2018 21:16:29 testMethodReferencesInClass1(org.eclipse.jdt.core.groovy.tests.search.MethodReferenceSearchTests)  Time elapsed: 0.181 sec
02-Feb-2018 21:16:29 testMethodReferencesInClass2(org.eclipse.jdt.core.groovy.tests.search.MethodReferenceSearchTests)  Time elapsed: 0.182 sec
02-Feb-2018 21:16:29 testMethodReferencesInClass3(org.eclipse.jdt.core.groovy.tests.search.MethodReferenceSearchTests)  Time elapsed: 0.176 sec
02-Feb-2018 21:16:29 testMethodReferencesInClass4(org.eclipse.jdt.core.groovy.tests.search.MethodReferenceSearchTests)  Time elapsed: 0.211 sec
02-Feb-2018 21:16:29 testGenericsMethodReferenceSearch(org.eclipse.jdt.core.groovy.tests.search.MethodReferenceSearchTests)  Time elapsed: 0.168 sec
02-Feb-2018 21:16:29 testMethodReferencesInScript1GRE_1180(org.eclipse.jdt.core.groovy.tests.search.MethodReferenceSearchTests)  Time elapsed: 0.18 sec
02-Feb-2018 21:16:29 testMethodReferencesInScript1(org.eclipse.jdt.core.groovy.tests.search.MethodReferenceSearchTests)  Time elapsed: 0.185 sec
02-Feb-2018 21:16:29 testMethodReferencesInScript2(org.eclipse.jdt.core.groovy.tests.search.MethodReferenceSearchTests)  Time elapsed: 0.178 sec
02-Feb-2018 21:16:29 testMethodReferencesInScript3(org.eclipse.jdt.core.groovy.tests.search.MethodReferenceSearchTests)  Time elapsed: 0.187 sec
02-Feb-2018 21:16:29 testMethodReferencesInScript4(org.eclipse.jdt.core.groovy.tests.search.MethodReferenceSearchTests)  Time elapsed: 0.185 sec
02-Feb-2018 21:16:29 testMethodReferencesInScript5(org.eclipse.jdt.core.groovy.tests.search.MethodReferenceSearchTests)  Time elapsed: 0.184 sec
02-Feb-2018 21:16:29 testMethodReferencesInScript6(org.eclipse.jdt.core.groovy.tests.search.MethodReferenceSearchTests)  Time elapsed: 0.197 sec
02-Feb-2018 21:16:29 testMethodReferencesInScript7(org.eclipse.jdt.core.groovy.tests.search.MethodReferenceSearchTests)  Time elapsed: 0.194 sec
02-Feb-2018 21:16:29 testMethodReferencesInScript8(org.eclipse.jdt.core.groovy.tests.search.MethodReferenceSearchTests)  Time elapsed: 0.195 sec
02-Feb-2018 21:16:29 testMethodWithDefaultParameters1(org.eclipse.jdt.core.groovy.tests.search.MethodReferenceSearchTests)  Time elapsed: 0.182 sec
02-Feb-2018 21:16:29 testMethodWithDefaultParameters2(org.eclipse.jdt.core.groovy.tests.search.MethodReferenceSearchTests)  Time elapsed: 0.182 sec
02-Feb-2018 21:16:29 testRightShift(org.eclipse.jdt.core.groovy.tests.search.OperatorOverloadingInferencingTests)  Time elapsed: 0.097 sec
02-Feb-2018 21:16:29 testLeftShift(org.eclipse.jdt.core.groovy.tests.search.OperatorOverloadingInferencingTests)  Time elapsed: 0.09 sec
02-Feb-2018 21:16:29 testAnd(org.eclipse.jdt.core.groovy.tests.search.OperatorOverloadingInferencingTests)  Time elapsed: 0.096 sec
02-Feb-2018 21:16:29 testMod(org.eclipse.jdt.core.groovy.tests.search.OperatorOverloadingInferencingTests)  Time elapsed: 0.093 sec
02-Feb-2018 21:16:29 testXor(org.eclipse.jdt.core.groovy.tests.search.OperatorOverloadingInferencingTests)  Time elapsed: 0.098 sec
02-Feb-2018 21:16:29 testPlus1(org.eclipse.jdt.core.groovy.tests.search.OperatorOverloadingInferencingTests)  Time elapsed: 0.106 sec
02-Feb-2018 21:16:29 testPlus2(org.eclipse.jdt.core.groovy.tests.search.OperatorOverloadingInferencingTests)  Time elapsed: 0.095 sec
02-Feb-2018 21:16:29 testPlus3(org.eclipse.jdt.core.groovy.tests.search.OperatorOverloadingInferencingTests)  Time elapsed: 0.089 sec
02-Feb-2018 21:16:29 testOr(org.eclipse.jdt.core.groovy.tests.search.OperatorOverloadingInferencingTests)  Time elapsed: 0.094 sec
02-Feb-2018 21:16:29 testPrefix1(org.eclipse.jdt.core.groovy.tests.search.OperatorOverloadingInferencingTests)  Time elapsed: 0.092 sec
02-Feb-2018 21:16:29 testPrefix2(org.eclipse.jdt.core.groovy.tests.search.OperatorOverloadingInferencingTests)  Time elapsed: 0.091 sec
02-Feb-2018 21:16:29 testPrefix3(org.eclipse.jdt.core.groovy.tests.search.OperatorOverloadingInferencingTests)  Time elapsed: 0.095 sec
02-Feb-2018 21:16:29 testPrefix4(org.eclipse.jdt.core.groovy.tests.search.OperatorOverloadingInferencingTests)  Time elapsed: 0.094 sec
02-Feb-2018 21:16:29 testPrefix5(org.eclipse.jdt.core.groovy.tests.search.OperatorOverloadingInferencingTests)  Time elapsed: 0.093 sec
02-Feb-2018 21:16:29 testPrefix6(org.eclipse.jdt.core.groovy.tests.search.OperatorOverloadingInferencingTests)  Time elapsed: 0.092 sec
02-Feb-2018 21:16:29 testLongExpr1(org.eclipse.jdt.core.groovy.tests.search.OperatorOverloadingInferencingTests)  Time elapsed: 0.099 sec
02-Feb-2018 21:16:29 testLongExpr2(org.eclipse.jdt.core.groovy.tests.search.OperatorOverloadingInferencingTests)  Time elapsed: 0.092 sec
02-Feb-2018 21:16:29 testLongExpr3(org.eclipse.jdt.core.groovy.tests.search.OperatorOverloadingInferencingTests)  Time elapsed: 0.096 sec
02-Feb-2018 21:16:29 testAttributeExpr1(org.eclipse.jdt.core.groovy.tests.search.OperatorOverloadingInferencingTests)  Time elapsed: 0.092 sec
02-Feb-2018 21:16:29 testAttributeExpr2(org.eclipse.jdt.core.groovy.tests.search.OperatorOverloadingInferencingTests)  Time elapsed: 0.095 sec
02-Feb-2018 21:16:29 testDivide(org.eclipse.jdt.core.groovy.tests.search.OperatorOverloadingInferencingTests)  Time elapsed: 0.098 sec
02-Feb-2018 21:16:29 testMultiply(org.eclipse.jdt.core.groovy.tests.search.OperatorOverloadingInferencingTests)  Time elapsed: 0.093 sec
02-Feb-2018 21:16:29 testGetAt1(org.eclipse.jdt.core.groovy.tests.search.OperatorOverloadingInferencingTests)  Time elapsed: 0.107 sec
02-Feb-2018 21:16:29 testGetAt2(org.eclipse.jdt.core.groovy.tests.search.OperatorOverloadingInferencingTests)  Time elapsed: 0.093 sec
02-Feb-2018 21:16:29 testGetAt3(org.eclipse.jdt.core.groovy.tests.search.OperatorOverloadingInferencingTests)  Time elapsed: 0.093 sec
02-Feb-2018 21:16:29 testGetAt4(org.eclipse.jdt.core.groovy.tests.search.OperatorOverloadingInferencingTests)  Time elapsed: 0.091 sec
02-Feb-2018 21:16:29 testGetAt5(org.eclipse.jdt.core.groovy.tests.search.OperatorOverloadingInferencingTests)  Time elapsed: 0.095 sec
02-Feb-2018 21:16:29 testGetAt6(org.eclipse.jdt.core.groovy.tests.search.OperatorOverloadingInferencingTests)  Time elapsed: 0.112 sec
02-Feb-2018 21:16:29 testGetAt7(org.eclipse.jdt.core.groovy.tests.search.OperatorOverloadingInferencingTests)  Time elapsed: 0.096 sec
02-Feb-2018 21:16:29 testGetAt8(org.eclipse.jdt.core.groovy.tests.search.OperatorOverloadingInferencingTests)  Time elapsed: 0.096 sec
02-Feb-2018 21:16:29 testGetAt9(org.eclipse.jdt.core.groovy.tests.search.OperatorOverloadingInferencingTests)  Time elapsed: 0.092 sec
02-Feb-2018 21:16:29 testPostfix1(org.eclipse.jdt.core.groovy.tests.search.OperatorOverloadingInferencingTests)  Time elapsed: 0.093 sec
02-Feb-2018 21:16:29 testPostfix2(org.eclipse.jdt.core.groovy.tests.search.OperatorOverloadingInferencingTests)  Time elapsed: 0.097 sec
02-Feb-2018 21:16:29 testMinus1(org.eclipse.jdt.core.groovy.tests.search.OperatorOverloadingInferencingTests)  Time elapsed: 0.095 sec
02-Feb-2018 21:16:29 testMinus2(org.eclipse.jdt.core.groovy.tests.search.OperatorOverloadingInferencingTests)  Time elapsed: 0.09 sec
02-Feb-2018 21:16:29 testNumberPlusString1(org.eclipse.jdt.core.groovy.tests.search.OperatorOverloadingInferencingTests)  Time elapsed: 0.092 sec
02-Feb-2018 21:16:29 testNumberPlusString2(org.eclipse.jdt.core.groovy.tests.search.OperatorOverloadingInferencingTests)  Time elapsed: 0.09 sec
02-Feb-2018 21:16:29 testCompleteExpr1(org.eclipse.jdt.core.groovy.tests.search.OperatorOverloadingInferencingTests)  Time elapsed: 0.09 sec
02-Feb-2018 21:16:29 testCompleteExpr2(org.eclipse.jdt.core.groovy.tests.search.OperatorOverloadingInferencingTests)  Time elapsed: 0.092 sec
02-Feb-2018 21:16:29 testCompleteExpr3(org.eclipse.jdt.core.groovy.tests.search.OperatorOverloadingInferencingTests)  Time elapsed: 0.098 sec
02-Feb-2018 21:16:29 testCompleteExpr4(org.eclipse.jdt.core.groovy.tests.search.OperatorOverloadingInferencingTests)  Time elapsed: 0.097 sec
02-Feb-2018 21:16:29 testCompleteExpr5(org.eclipse.jdt.core.groovy.tests.search.OperatorOverloadingInferencingTests)  Time elapsed: 0.094 sec
02-Feb-2018 21:16:29 testCompleteExpr6(org.eclipse.jdt.core.groovy.tests.search.OperatorOverloadingInferencingTests)  Time elapsed: 0.17 sec
02-Feb-2018 21:16:29 testCompleteExpr7(org.eclipse.jdt.core.groovy.tests.search.OperatorOverloadingInferencingTests)  Time elapsed: 0.09 sec
02-Feb-2018 21:16:29 testCompleteExpr8(org.eclipse.jdt.core.groovy.tests.search.OperatorOverloadingInferencingTests)  Time elapsed: 0.089 sec
02-Feb-2018 21:16:29 testNonStaticReference1(org.eclipse.jdt.core.groovy.tests.search.StaticInferencingTests)  Time elapsed: 0.095 sec
02-Feb-2018 21:16:29 testNonStaticReference2(org.eclipse.jdt.core.groovy.tests.search.StaticInferencingTests)  Time elapsed: 0.1 sec
02-Feb-2018 21:16:29 testNonStaticReference3(org.eclipse.jdt.core.groovy.tests.search.StaticInferencingTests)  Time elapsed: 0.094 sec
02-Feb-2018 21:16:29 testNonStaticReference4(org.eclipse.jdt.core.groovy.tests.search.StaticInferencingTests)  Time elapsed: 0.095 sec
02-Feb-2018 21:16:29 testNonStaticReference5(org.eclipse.jdt.core.groovy.tests.search.StaticInferencingTests)  Time elapsed: 0.092 sec
02-Feb-2018 21:16:29 testNonStaticReference6(org.eclipse.jdt.core.groovy.tests.search.StaticInferencingTests)  Time elapsed: 0.094 sec
02-Feb-2018 21:16:29 testNonStaticReference7(org.eclipse.jdt.core.groovy.tests.search.StaticInferencingTests)  Time elapsed: 0.204 sec
02-Feb-2018 21:16:29 testNonStaticReference8(org.eclipse.jdt.core.groovy.tests.search.StaticInferencingTests)  Time elapsed: 0.08 sec
02-Feb-2018 21:16:29 testStaticReference1(org.eclipse.jdt.core.groovy.tests.search.StaticInferencingTests)  Time elapsed: 0.113 sec
02-Feb-2018 21:16:29 testStaticImport1(org.eclipse.jdt.core.groovy.tests.search.StaticInferencingTests)  Time elapsed: 0.106 sec
02-Feb-2018 21:16:29 testStaticImport2(org.eclipse.jdt.core.groovy.tests.search.StaticInferencingTests)  Time elapsed: 0.097 sec
02-Feb-2018 21:16:29 testStaticImport3(org.eclipse.jdt.core.groovy.tests.search.StaticInferencingTests)  Time elapsed: 0.112 sec
02-Feb-2018 21:16:29 testStaticImport4(org.eclipse.jdt.core.groovy.tests.search.StaticInferencingTests)  Time elapsed: 0.102 sec
02-Feb-2018 21:16:29 testStaticImport5(org.eclipse.jdt.core.groovy.tests.search.StaticInferencingTests)  Time elapsed: 0.109 sec
02-Feb-2018 21:16:29 testStaticImport6(org.eclipse.jdt.core.groovy.tests.search.StaticInferencingTests)  Time elapsed: 0.128 sec
02-Feb-2018 21:16:29 testStaticImport7(org.eclipse.jdt.core.groovy.tests.search.StaticInferencingTests)  Time elapsed: 0.112 sec
02-Feb-2018 21:16:29 testStaticImport8(org.eclipse.jdt.core.groovy.tests.search.StaticInferencingTests)  Time elapsed: 0.119 sec
02-Feb-2018 21:16:29 testStaticImport9(org.eclipse.jdt.core.groovy.tests.search.StaticInferencingTests)  Time elapsed: 0.101 sec
02-Feb-2018 21:16:29 testSTCAndClassInstance(org.eclipse.jdt.core.groovy.tests.search.StaticInferencingTests)  Time elapsed: 0.094 sec
02-Feb-2018 21:16:29 testClassReference10(org.eclipse.jdt.core.groovy.tests.search.StaticInferencingTests)  Time elapsed: 0.097 sec
02-Feb-2018 21:16:29 testClassReference11(org.eclipse.jdt.core.groovy.tests.search.StaticInferencingTests)  Time elapsed: 0.098 sec
02-Feb-2018 21:16:29 testClassReference12(org.eclipse.jdt.core.groovy.tests.search.StaticInferencingTests)  Time elapsed: 0.09 sec
02-Feb-2018 21:16:29 testClassReference13(org.eclipse.jdt.core.groovy.tests.search.StaticInferencingTests)  Time elapsed: 0.092 sec
02-Feb-2018 21:16:29 testClassReference14(org.eclipse.jdt.core.groovy.tests.search.StaticInferencingTests)  Time elapsed: 0.09 sec
02-Feb-2018 21:16:29 testClassReference15(org.eclipse.jdt.core.groovy.tests.search.StaticInferencingTests)  Time elapsed: 0.109 sec
02-Feb-2018 21:16:29 testClassReference4a(org.eclipse.jdt.core.groovy.tests.search.StaticInferencingTests)  Time elapsed: 0.091 sec
02-Feb-2018 21:16:29 testClassReference1(org.eclipse.jdt.core.groovy.tests.search.StaticInferencingTests)  Time elapsed: 0.091 sec
02-Feb-2018 21:16:29 testClassReference2(org.eclipse.jdt.core.groovy.tests.search.StaticInferencingTests)  Time elapsed: 0.111 sec
02-Feb-2018 21:16:29 testClassReference3(org.eclipse.jdt.core.groovy.tests.search.StaticInferencingTests)  Time elapsed: 0.089 sec
02-Feb-2018 21:16:29 testClassReference4(org.eclipse.jdt.core.groovy.tests.search.StaticInferencingTests)  Time elapsed: 0.091 sec
02-Feb-2018 21:16:29 testClassReference5(org.eclipse.jdt.core.groovy.tests.search.StaticInferencingTests)  Time elapsed: 0.092 sec
02-Feb-2018 21:16:29 testClassReference6(org.eclipse.jdt.core.groovy.tests.search.StaticInferencingTests)  Time elapsed: 0.092 sec
02-Feb-2018 21:16:29 testClassReference7(org.eclipse.jdt.core.groovy.tests.search.StaticInferencingTests)  Time elapsed: 0.093 sec
02-Feb-2018 21:16:29 testClassReference8(org.eclipse.jdt.core.groovy.tests.search.StaticInferencingTests)  Time elapsed: 0.093 sec
02-Feb-2018 21:16:29 testClassReference9(org.eclipse.jdt.core.groovy.tests.search.StaticInferencingTests)  Time elapsed: 0.1 sec
02-Feb-2018 21:16:29 testSyntheticAccessors1(org.eclipse.jdt.core.groovy.tests.search.SyntheticAccessorInferencingTests)  Time elapsed: 0.126 sec
02-Feb-2018 21:16:29 testSyntheticAccessors2(org.eclipse.jdt.core.groovy.tests.search.SyntheticAccessorInferencingTests)  Time elapsed: 0.131 sec
02-Feb-2018 21:16:29 testSyntheticAccessors3(org.eclipse.jdt.core.groovy.tests.search.SyntheticAccessorInferencingTests)  Time elapsed: 0.139 sec
02-Feb-2018 21:16:29 testSyntheticAccessors4(org.eclipse.jdt.core.groovy.tests.search.SyntheticAccessorInferencingTests)  Time elapsed: 1.102 sec
02-Feb-2018 21:16:29 testFindClassDeclarationWithPattern(org.eclipse.jdt.core.groovy.tests.search.TypeReferenceSearchTests)  Time elapsed: 0.605 sec
02-Feb-2018 21:16:29 testInnerTypes1(org.eclipse.jdt.core.groovy.tests.search.TypeReferenceSearchTests)  Time elapsed: 1.021 sec
02-Feb-2018 21:16:29 testInnerTypes2(org.eclipse.jdt.core.groovy.tests.search.TypeReferenceSearchTests)  Time elapsed: 1.025 sec
02-Feb-2018 21:16:29 testInnerTypes3(org.eclipse.jdt.core.groovy.tests.search.TypeReferenceSearchTests)  Time elapsed: 1.035 sec
02-Feb-2018 21:16:29 testSearchForTypesScript1(org.eclipse.jdt.core.groovy.tests.search.TypeReferenceSearchTests)  Time elapsed: 0.094 sec
02-Feb-2018 21:16:29 testSearchForTypesScript2(org.eclipse.jdt.core.groovy.tests.search.TypeReferenceSearchTests)  Time elapsed: 0.107 sec
02-Feb-2018 21:16:29 testSearchForTypesScript3(org.eclipse.jdt.core.groovy.tests.search.TypeReferenceSearchTests)  Time elapsed: 0.104 sec
02-Feb-2018 21:16:29 testSearchForTypesScript4(org.eclipse.jdt.core.groovy.tests.search.TypeReferenceSearchTests)  Time elapsed: 0.11 sec
02-Feb-2018 21:16:29 testSearchForTypesScript5(org.eclipse.jdt.core.groovy.tests.search.TypeReferenceSearchTests)  Time elapsed: 0.105 sec
02-Feb-2018 21:16:29 testSearchForTypesScript6(org.eclipse.jdt.core.groovy.tests.search.TypeReferenceSearchTests)  Time elapsed: 0.104 sec
02-Feb-2018 21:16:29 testShouldntFindClassDeclarationInScript(org.eclipse.jdt.core.groovy.tests.search.TypeReferenceSearchTests)  Time elapsed: 0.108 sec
02-Feb-2018 21:16:29 testSearchForTypesArray1(org.eclipse.jdt.core.groovy.tests.search.TypeReferenceSearchTests)  Time elapsed: 0.107 sec
02-Feb-2018 21:16:29 testSearchForTypesClass1(org.eclipse.jdt.core.groovy.tests.search.TypeReferenceSearchTests)  Time elapsed: 0.103 sec
02-Feb-2018 21:16:29 testSearchForTypesClass2(org.eclipse.jdt.core.groovy.tests.search.TypeReferenceSearchTests)  Time elapsed: 0.103 sec
02-Feb-2018 21:16:29 testSearchForTypesClass3(org.eclipse.jdt.core.groovy.tests.search.TypeReferenceSearchTests)  Time elapsed: 0.102 sec
02-Feb-2018 21:16:29 testSearchForTypesClass4(org.eclipse.jdt.core.groovy.tests.search.TypeReferenceSearchTests)  Time elapsed: 0.103 sec
02-Feb-2018 21:16:29 testSearchForTypesClass5(org.eclipse.jdt.core.groovy.tests.search.TypeReferenceSearchTests)  Time elapsed: 0.209 sec
02-Feb-2018 21:16:29 testSearchForTypesClass6(org.eclipse.jdt.core.groovy.tests.search.TypeReferenceSearchTests)  Time elapsed: 0.101 sec
02-Feb-2018 21:16:29 testSearchForTypesClass7(org.eclipse.jdt.core.groovy.tests.search.TypeReferenceSearchTests)  Time elapsed: 0.115 sec
02-Feb-2018 21:16:29 testSearchForTypesClosure1(org.eclipse.jdt.core.groovy.tests.search.TypeReferenceSearchTests)  Time elapsed: 0.109 sec
02-Feb-2018 21:16:29 testSearchForTypesClosure2(org.eclipse.jdt.core.groovy.tests.search.TypeReferenceSearchTests)  Time elapsed: 0.105 sec
02-Feb-2018 21:16:29 testSearchForTypesClosure3(org.eclipse.jdt.core.groovy.tests.search.TypeReferenceSearchTests)  Time elapsed: 0.105 sec
02-Feb-2018 21:16:29 testFindClassDeclaration(org.eclipse.jdt.core.groovy.tests.search.TypeReferenceSearchTests)  Time elapsed: 0.094 sec
02-Feb-2018 21:16:29 testConstructorWithDefaultArgsInCompileStatic(org.eclipse.jdt.core.groovy.tests.search.TypeReferenceSearchTests)  Time elapsed: 0.433 sec
02-Feb-2018 21:16:29
02-Feb-2018 21:16:29 Results :
02-Feb-2018 21:16:29
02-Feb-2018 21:16:29 Tests run: 5041, Failures: 0, Errors: 0, Skipped: 167
02-Feb-2018 21:16:29
02-Feb-2018 21:16:30
02-Feb-2018 21:16:30 !ENTRY org.eclipse.e4.ui.workbench.swt 4 2 2018-02-02 21:16:30.251
02-Feb-2018 21:16:30 !MESSAGE Problems occurred when invoking code from plug-in: "org.eclipse.e4.ui.workbench.swt".
02-Feb-2018 21:16:30 !STACK 0
02-Feb-2018 21:16:30 org.eclipse.e4.core.di.InjectionException: org.eclipse.swt.SWTException: Widget is disposed
02-Feb-2018 21:16:30         at org.eclipse.e4.core.internal.di.MethodRequestor.execute(MethodRequestor.java:62)
02-Feb-2018 21:16:30         at org.eclipse.e4.core.internal.di.InjectorImpl.processAnnotated(InjectorImpl.java:888)
02-Feb-2018 21:16:30         at org.eclipse.e4.core.internal.di.InjectorImpl.disposed(InjectorImpl.java:390)
02-Feb-2018 21:16:30         at org.eclipse.e4.core.internal.di.Requestor.disposed(Requestor.java:143)
02-Feb-2018 21:16:30         at org.eclipse.e4.core.internal.contexts.ContextObjectSupplier$ContextInjectionListener.update(ContextObjectSupplier.java:76)
02-Feb-2018 21:16:30         at org.eclipse.e4.core.internal.contexts.TrackableComputationExt.update(TrackableComputationExt.java:107)
02-Feb-2018 21:16:30         at org.eclipse.e4.core.internal.contexts.TrackableComputationExt.handleInvalid(TrackableComputationExt.java:70)
02-Feb-2018 21:16:30         at org.eclipse.e4.core.internal.contexts.EclipseContext.dispose(EclipseContext.java:175)
02-Feb-2018 21:16:30         at org.eclipse.e4.ui.internal.workbench.swt.PartRenderingEngine.clearContext(PartRenderingEngine.java:974)
02-Feb-2018 21:16:30         at org.eclipse.e4.ui.internal.workbench.swt.PartRenderingEngine.safeRemoveGui(PartRenderingEngine.java:954)
02-Feb-2018 21:16:30         at org.eclipse.e4.ui.internal.workbench.swt.PartRenderingEngine.access$3(PartRenderingEngine.java:862)
02-Feb-2018 21:16:30         at org.eclipse.e4.ui.internal.workbench.swt.PartRenderingEngine$8.run(PartRenderingEngine.java:857)
02-Feb-2018 21:16:30         at org.eclipse.core.runtime.SafeRunner.run(SafeRunner.java:42)
02-Feb-2018 21:16:30         at org.eclipse.e4.ui.internal.workbench.swt.PartRenderingEngine.removeGui(PartRenderingEngine.java:841)
02-Feb-2018 21:16:30         at org.eclipse.e4.ui.internal.workbench.swt.PartRenderingEngine.stop(PartRenderingEngine.java:1220)
02-Feb-2018 21:16:30         at org.eclipse.e4.ui.internal.workbench.E4Workbench.close(E4Workbench.java:184)
02-Feb-2018 21:16:30         at org.eclipse.e4.ui.internal.workbench.swt.E4Testable$2.run(E4Testable.java:130)
02-Feb-2018 21:16:30         at org.eclipse.swt.widgets.RunnableLock.run(RunnableLock.java:35)
02-Feb-2018 21:16:30         at org.eclipse.swt.widgets.Synchronizer.runAsyncMessages(Synchronizer.java:136)
02-Feb-2018 21:16:30         at org.eclipse.swt.widgets.Display.runAsyncMessages(Display.java:3774)
02-Feb-2018 21:16:30         at org.eclipse.swt.widgets.Display.readAndDispatch(Display.java:3412)
02-Feb-2018 21:16:30         at org.eclipse.e4.ui.internal.workbench.swt.PartRenderingEngine$9.run(PartRenderingEngine.java:1151)
02-Feb-2018 21:16:30         at org.eclipse.core.databinding.observable.Realm.runWithDefault(Realm.java:332)
02-Feb-2018 21:16:30         at org.eclipse.e4.ui.internal.workbench.swt.PartRenderingEngine.run(PartRenderingEngine.java:1032)
02-Feb-2018 21:16:30         at org.eclipse.e4.ui.internal.workbench.E4Workbench.createAndRunUI(E4Workbench.java:148)
02-Feb-2018 21:16:30         at org.eclipse.ui.internal.Workbench$5.run(Workbench.java:636)
02-Feb-2018 21:16:30         at org.eclipse.core.databinding.observable.Realm.runWithDefault(Realm.java:332)
02-Feb-2018 21:16:30         at org.eclipse.ui.internal.Workbench.createAndRunWorkbench(Workbench.java:579)
02-Feb-2018 21:16:30         at org.eclipse.ui.PlatformUI.createAndRunWorkbench(PlatformUI.java:150)
02-Feb-2018 21:16:30         at org.eclipse.ui.internal.ide.application.IDEApplication.start(IDEApplication.java:135)
02-Feb-2018 21:16:30         at org.eclipse.tycho.surefire.osgibooter.UITestApplication.runApplication(UITestApplication.java:31)
02-Feb-2018 21:16:30         at org.eclipse.tycho.surefire.osgibooter.AbstractUITestApplication.run(AbstractUITestApplication.java:120)
02-Feb-2018 21:16:30         at org.eclipse.tycho.surefire.osgibooter.UITestApplication.start(UITestApplication.java:37)
02-Feb-2018 21:16:30         at org.eclipse.equinox.internal.app.EclipseAppHandle.run(EclipseAppHandle.java:196)
02-Feb-2018 21:16:30         at org.eclipse.core.runtime.internal.adaptor.EclipseAppLauncher.runApplication(EclipseAppLauncher.java:134)
02-Feb-2018 21:16:30         at org.eclipse.core.runtime.internal.adaptor.EclipseAppLauncher.start(EclipseAppLauncher.java:104)
02-Feb-2018 21:16:30         at org.eclipse.core.runtime.adaptor.EclipseStarter.run(EclipseStarter.java:380)
02-Feb-2018 21:16:30         at org.eclipse.core.runtime.adaptor.EclipseStarter.run(EclipseStarter.java:235)
02-Feb-2018 21:16:30         at sun.reflect.NativeMethodAccessorImpl.invoke0(Native Method)
02-Feb-2018 21:16:30         at sun.reflect.NativeMethodAccessorImpl.invoke(NativeMethodAccessorImpl.java:57)
02-Feb-2018 21:16:30         at sun.reflect.DelegatingMethodAccessorImpl.invoke(DelegatingMethodAccessorImpl.java:43)
02-Feb-2018 21:16:30         at java.lang.reflect.Method.invoke(Method.java:606)
02-Feb-2018 21:16:30         at org.eclipse.equinox.launcher.Main.invokeFramework(Main.java:648)
02-Feb-2018 21:16:30         at org.eclipse.equinox.launcher.Main.basicRun(Main.java:603)
02-Feb-2018 21:16:30         at org.eclipse.equinox.launcher.Main.run(Main.java:1465)
02-Feb-2018 21:16:30         at org.eclipse.equinox.launcher.Main.main(Main.java:1438)
02-Feb-2018 21:16:30 Caused by: org.eclipse.swt.SWTException: Widget is disposed
02-Feb-2018 21:16:30         at org.eclipse.swt.SWT.error(SWT.java:4441)
02-Feb-2018 21:16:30         at org.eclipse.swt.SWT.error(SWT.java:4356)
02-Feb-2018 21:16:30         at org.eclipse.swt.SWT.error(SWT.java:4327)
02-Feb-2018 21:16:30         at org.eclipse.swt.widgets.Widget.error(Widget.java:476)
02-Feb-2018 21:16:30         at org.eclipse.swt.widgets.Widget.checkWidget(Widget.java:413)
02-Feb-2018 21:16:30         at org.eclipse.swt.widgets.Shell.getSize(Shell.java:1111)
02-Feb-2018 21:16:30         at org.eclipse.ui.internal.quickaccess.SearchField.storeDialog(SearchField.java:580)
02-Feb-2018 21:16:30         at org.eclipse.ui.internal.quickaccess.SearchField.dispose(SearchField.java:557)
02-Feb-2018 21:16:30         at sun.reflect.NativeMethodAccessorImpl.invoke0(Native Method)
02-Feb-2018 21:16:30         at sun.reflect.NativeMethodAccessorImpl.invoke(NativeMethodAccessorImpl.java:57)
02-Feb-2018 21:16:30         at sun.reflect.DelegatingMethodAccessorImpl.invoke(DelegatingMethodAccessorImpl.java:43)
02-Feb-2018 21:16:30         at java.lang.reflect.Method.invoke(Method.java:606)
02-Feb-2018 21:16:30         at org.eclipse.e4.core.internal.di.MethodRequestor.execute(MethodRequestor.java:55)
02-Feb-2018 21:16:30         ... 45 more
02-Feb-2018 21:16:30
02-Feb-2018 21:16:30 !ENTRY org.eclipse.e4.ui.workbench 4 0 2018-02-02 21:16:30.252
02-Feb-2018 21:16:30 !MESSAGE Exception occurred while unrendering: org.eclipse.e4.ui.model.application.ui.basic.impl.TrimmedWindowImpl@57d9ea59 (elementId: IDEWindow, tags: [topLevel], contributorURI: platform:/plugin/org.eclipse.ui.workbench) (widget: null, renderer: null, toBeRendered: true, onTop: false, visible: true, containerData: null, accessibilityPhrase: null) (label: %trimmedwindow.label.eclipseSDK, iconURI: null, tooltip: null, context: null, variables: [], x: 0, y: 0, width: 1024, height: 768)
02-Feb-2018 21:16:30 !STACK 0
02-Feb-2018 21:16:30 org.eclipse.e4.core.di.InjectionException: org.eclipse.swt.SWTException: Widget is disposed
02-Feb-2018 21:16:30         at org.eclipse.e4.core.internal.di.MethodRequestor.execute(MethodRequestor.java:62)
02-Feb-2018 21:16:30         at org.eclipse.e4.core.internal.di.InjectorImpl.processAnnotated(InjectorImpl.java:888)
02-Feb-2018 21:16:30         at org.eclipse.e4.core.internal.di.InjectorImpl.disposed(InjectorImpl.java:390)
02-Feb-2018 21:16:30         at org.eclipse.e4.core.internal.di.Requestor.disposed(Requestor.java:143)
02-Feb-2018 21:16:30         at org.eclipse.e4.core.internal.contexts.ContextObjectSupplier$ContextInjectionListener.update(ContextObjectSupplier.java:76)
02-Feb-2018 21:16:30         at org.eclipse.e4.core.internal.contexts.TrackableComputationExt.update(TrackableComputationExt.java:107)
02-Feb-2018 21:16:30         at org.eclipse.e4.core.internal.contexts.TrackableComputationExt.handleInvalid(TrackableComputationExt.java:70)
02-Feb-2018 21:16:30         at org.eclipse.e4.core.internal.contexts.EclipseContext.dispose(EclipseContext.java:175)
02-Feb-2018 21:16:30         at org.eclipse.e4.ui.internal.workbench.swt.PartRenderingEngine.clearContext(PartRenderingEngine.java:974)
02-Feb-2018 21:16:30         at org.eclipse.e4.ui.internal.workbench.swt.PartRenderingEngine.safeRemoveGui(PartRenderingEngine.java:954)
02-Feb-2018 21:16:30         at org.eclipse.e4.ui.internal.workbench.swt.PartRenderingEngine.access$3(PartRenderingEngine.java:862)
02-Feb-2018 21:16:30         at org.eclipse.e4.ui.internal.workbench.swt.PartRenderingEngine$8.run(PartRenderingEngine.java:857)
02-Feb-2018 21:16:30         at org.eclipse.core.runtime.SafeRunner.run(SafeRunner.java:42)
02-Feb-2018 21:16:30         at org.eclipse.e4.ui.internal.workbench.swt.PartRenderingEngine.removeGui(PartRenderingEngine.java:841)
02-Feb-2018 21:16:30         at org.eclipse.e4.ui.internal.workbench.swt.PartRenderingEngine.stop(PartRenderingEngine.java:1220)
02-Feb-2018 21:16:30         at org.eclipse.e4.ui.internal.workbench.E4Workbench.close(E4Workbench.java:184)
02-Feb-2018 21:16:30         at org.eclipse.e4.ui.internal.workbench.swt.E4Testable$2.run(E4Testable.java:130)
02-Feb-2018 21:16:30         at org.eclipse.swt.widgets.RunnableLock.run(RunnableLock.java:35)
02-Feb-2018 21:16:30         at org.eclipse.swt.widgets.Synchronizer.runAsyncMessages(Synchronizer.java:136)
02-Feb-2018 21:16:30         at org.eclipse.swt.widgets.Display.runAsyncMessages(Display.java:3774)
02-Feb-2018 21:16:30         at org.eclipse.swt.widgets.Display.readAndDispatch(Display.java:3412)
02-Feb-2018 21:16:30         at org.eclipse.e4.ui.internal.workbench.swt.PartRenderingEngine$9.run(PartRenderingEngine.java:1151)
02-Feb-2018 21:16:30         at org.eclipse.core.databinding.observable.Realm.runWithDefault(Realm.java:332)
02-Feb-2018 21:16:30         at org.eclipse.e4.ui.internal.workbench.swt.PartRenderingEngine.run(PartRenderingEngine.java:1032)
02-Feb-2018 21:16:30         at org.eclipse.e4.ui.internal.workbench.E4Workbench.createAndRunUI(E4Workbench.java:148)
02-Feb-2018 21:16:30         at org.eclipse.ui.internal.Workbench$5.run(Workbench.java:636)
02-Feb-2018 21:16:30         at org.eclipse.core.databinding.observable.Realm.runWithDefault(Realm.java:332)
02-Feb-2018 21:16:30         at org.eclipse.ui.internal.Workbench.createAndRunWorkbench(Workbench.java:579)
02-Feb-2018 21:16:30         at org.eclipse.ui.PlatformUI.createAndRunWorkbench(PlatformUI.java:150)
02-Feb-2018 21:16:30         at org.eclipse.ui.internal.ide.application.IDEApplication.start(IDEApplication.java:135)
02-Feb-2018 21:16:30         at org.eclipse.tycho.surefire.osgibooter.UITestApplication.runApplication(UITestApplication.java:31)
02-Feb-2018 21:16:30         at org.eclipse.tycho.surefire.osgibooter.AbstractUITestApplication.run(AbstractUITestApplication.java:120)
02-Feb-2018 21:16:30         at org.eclipse.tycho.surefire.osgibooter.UITestApplication.start(UITestApplication.java:37)
02-Feb-2018 21:16:30         at org.eclipse.equinox.internal.app.EclipseAppHandle.run(EclipseAppHandle.java:196)
02-Feb-2018 21:16:30         at org.eclipse.core.runtime.internal.adaptor.EclipseAppLauncher.runApplication(EclipseAppLauncher.java:134)
02-Feb-2018 21:16:30         at org.eclipse.core.runtime.internal.adaptor.EclipseAppLauncher.start(EclipseAppLauncher.java:104)
02-Feb-2018 21:16:30         at org.eclipse.core.runtime.adaptor.EclipseStarter.run(EclipseStarter.java:380)
02-Feb-2018 21:16:30         at org.eclipse.core.runtime.adaptor.EclipseStarter.run(EclipseStarter.java:235)
02-Feb-2018 21:16:30         at sun.reflect.NativeMethodAccessorImpl.invoke0(Native Method)
02-Feb-2018 21:16:30         at sun.reflect.NativeMethodAccessorImpl.invoke(NativeMethodAccessorImpl.java:57)
02-Feb-2018 21:16:30         at sun.reflect.DelegatingMethodAccessorImpl.invoke(DelegatingMethodAccessorImpl.java:43)
02-Feb-2018 21:16:30         at java.lang.reflect.Method.invoke(Method.java:606)
02-Feb-2018 21:16:30         at org.eclipse.equinox.launcher.Main.invokeFramework(Main.java:648)
02-Feb-2018 21:16:30         at org.eclipse.equinox.launcher.Main.basicRun(Main.java:603)
02-Feb-2018 21:16:30         at org.eclipse.equinox.launcher.Main.run(Main.java:1465)
02-Feb-2018 21:16:30         at org.eclipse.equinox.launcher.Main.main(Main.java:1438)
02-Feb-2018 21:16:30 Caused by: org.eclipse.swt.SWTException: Widget is disposed
02-Feb-2018 21:16:30         at org.eclipse.swt.SWT.error(SWT.java:4441)
02-Feb-2018 21:16:30         at org.eclipse.swt.SWT.error(SWT.java:4356)
02-Feb-2018 21:16:30         at org.eclipse.swt.SWT.error(SWT.java:4327)
02-Feb-2018 21:16:30         at org.eclipse.swt.widgets.Widget.error(Widget.java:476)
02-Feb-2018 21:16:30         at org.eclipse.swt.widgets.Widget.checkWidget(Widget.java:413)
02-Feb-2018 21:16:30         at org.eclipse.swt.widgets.Shell.getSize(Shell.java:1111)
02-Feb-2018 21:16:30         at org.eclipse.ui.internal.quickaccess.SearchField.storeDialog(SearchField.java:580)
02-Feb-2018 21:16:30         at org.eclipse.ui.internal.quickaccess.SearchField.dispose(SearchField.java:557)
02-Feb-2018 21:16:30         at sun.reflect.NativeMethodAccessorImpl.invoke0(Native Method)
02-Feb-2018 21:16:30         at sun.reflect.NativeMethodAccessorImpl.invoke(NativeMethodAccessorImpl.java:57)
02-Feb-2018 21:16:30         at sun.reflect.DelegatingMethodAccessorImpl.invoke(DelegatingMethodAccessorImpl.java:43)
02-Feb-2018 21:16:30         at java.lang.reflect.Method.invoke(Method.java:606)
02-Feb-2018 21:16:30         at org.eclipse.e4.core.internal.di.MethodRequestor.execute(MethodRequestor.java:55)
02-Feb-2018 21:16:30         ... 45 more
02-Feb-2018 21:16:31 [INFO] All tests passed!
02-Feb-2018 21:16:31 [INFO]
02-Feb-2018 21:16:31 [INFO] --- maven-install-plugin:2.3.1:install (default-install) @ org.codehaus.groovy.alltests ---
02-Feb-2018 21:16:31 [INFO] Installing /opt/bamboo-home/xml-data/build-dir/GRECLIPSE-E44TP-JOB1/ide-test/org.codehaus.groovy.alltests/target/org.codehaus.groovy.alltests-2.9.3-SNAPSHOT.jar to /home/bamboo/.m2/repository/org/codehaus/groovy/eclipse/org.codehaus.groovy.alltests/2.9.3-SNAPSHOT/org.codehaus.groovy.alltests-2.9.3-SNAPSHOT.jar
02-Feb-2018 21:16:31 [INFO] Installing /opt/bamboo-home/xml-data/build-dir/GRECLIPSE-E44TP-JOB1/ide-test/org.codehaus.groovy.alltests/pom.xml to /home/bamboo/.m2/repository/org/codehaus/groovy/eclipse/org.codehaus.groovy.alltests/2.9.3-SNAPSHOT/org.codehaus.groovy.alltests-2.9.3-SNAPSHOT.pom
02-Feb-2018 21:16:31 [INFO] Installing /opt/bamboo-home/xml-data/build-dir/GRECLIPSE-E44TP-JOB1/ide-test/org.codehaus.groovy.alltests/target/org.codehaus.groovy.alltests-2.9.3-SNAPSHOT-sources.jar to /home/bamboo/.m2/repository/org/codehaus/groovy/eclipse/org.codehaus.groovy.alltests/2.9.3-SNAPSHOT/org.codehaus.groovy.alltests-2.9.3-SNAPSHOT-sources.jar
02-Feb-2018 21:16:31 [INFO] Installing /opt/bamboo-home/xml-data/build-dir/GRECLIPSE-E44TP-JOB1/ide-test/org.codehaus.groovy.alltests/target/p2content.xml to /home/bamboo/.m2/repository/org/codehaus/groovy/eclipse/org.codehaus.groovy.alltests/2.9.3-SNAPSHOT/org.codehaus.groovy.alltests-2.9.3-SNAPSHOT-p2metadata.xml
02-Feb-2018 21:16:31 [INFO] Installing /opt/bamboo-home/xml-data/build-dir/GRECLIPSE-E44TP-JOB1/ide-test/org.codehaus.groovy.alltests/target/p2artifacts.xml to /home/bamboo/.m2/repository/org/codehaus/groovy/eclipse/org.codehaus.groovy.alltests/2.9.3-SNAPSHOT/org.codehaus.groovy.alltests-2.9.3-SNAPSHOT-p2artifacts.xml
02-Feb-2018 21:16:31 [INFO]
02-Feb-2018 21:16:31 [INFO] --- tycho-p2-plugin:0.24.0:update-local-index (default-update-local-index) @ org.codehaus.groovy.alltests ---
02-Feb-2018 21:16:31 [INFO]
02-Feb-2018 21:16:31 [INFO] --- maven-deploy-plugin:2.5:deploy (default-deploy) @ org.codehaus.groovy.alltests ---
02-Feb-2018 21:16:31 [INFO] Skipping artifact deployment
02-Feb-2018 21:16:31 [INFO]                                                                         
02-Feb-2018 21:16:31 [INFO] ------------------------------------------------------------------------
02-Feb-2018 21:16:31 [INFO] Building org.codehaus.groovy.alltests.feature 2.9.3-SNAPSHOT
02-Feb-2018 21:16:31 [INFO] ------------------------------------------------------------------------
02-Feb-2018 21:16:31 [INFO]
02-Feb-2018 21:16:31 [INFO] --- maven-clean-plugin:2.5:clean (default-clean) @ org.codehaus.groovy.alltests.feature ---
02-Feb-2018 21:16:31 [INFO] Deleting /opt/bamboo-home/xml-data/build-dir/GRECLIPSE-E44TP-JOB1/ide-test/Feature-org.codehaus.groovy.alltests.feature/target
02-Feb-2018 21:16:31 [INFO]
02-Feb-2018 21:16:31 [INFO] --- tycho-packaging-plugin:0.24.0:build-qualifier-aggregator (default-build-qualifier-aggregator) @ org.codehaus.groovy.alltests.feature ---
02-Feb-2018 21:16:31 [INFO] The project's OSGi version is 2.9.3.xx-201802021952-e44
02-Feb-2018 21:16:31 [INFO]
02-Feb-2018 21:16:31 [INFO] --- tycho-packaging-plugin:0.24.0:validate-id (default-validate-id) @ org.codehaus.groovy.alltests.feature ---
02-Feb-2018 21:16:31 [INFO]
02-Feb-2018 21:16:31 [INFO] --- tycho-packaging-plugin:0.24.0:validate-version (default-validate-version) @ org.codehaus.groovy.alltests.feature ---
02-Feb-2018 21:16:31 [INFO]
02-Feb-2018 21:16:31 [INFO] --- properties-maven-plugin:1.0-alpha-2:read-project-properties (default) @ org.codehaus.groovy.alltests.feature ---
02-Feb-2018 21:16:31 [INFO]
02-Feb-2018 21:16:31 [INFO] --- tycho-source-plugin:0.24.0:plugin-source (plugin-source) @ org.codehaus.groovy.alltests.feature ---
02-Feb-2018 21:16:31 [INFO]
02-Feb-2018 21:16:31 [INFO] --- target-platform-configuration:0.24.0:target-platform (default-target-platform) @ org.codehaus.groovy.alltests.feature ---
02-Feb-2018 21:16:31 [INFO]
02-Feb-2018 21:16:31 [INFO] --- tycho-packaging-plugin:0.24.0:package-feature (default-package-feature) @ org.codehaus.groovy.alltests.feature ---
02-Feb-2018 21:16:31 [INFO] Building jar: /opt/bamboo-home/xml-data/build-dir/GRECLIPSE-E44TP-JOB1/ide-test/Feature-org.codehaus.groovy.alltests.feature/target/org.codehaus.groovy.alltests.feature-2.9.3-SNAPSHOT.jar
02-Feb-2018 21:16:31 [INFO]
02-Feb-2018 21:16:31 [INFO] --- tycho-p2-plugin:0.24.0:p2-metadata-default (default-p2-metadata-default) @ org.codehaus.groovy.alltests.feature ---
02-Feb-2018 21:16:31 [INFO]
02-Feb-2018 21:16:31 [INFO] --- tycho-p2-plugin:0.24.0:feature-p2-metadata (default-feature-p2-metadata) @ org.codehaus.groovy.alltests.feature ---
02-Feb-2018 21:16:31 [INFO]
02-Feb-2018 21:16:31 [INFO] --- maven-jarsigner-plugin:1.2:sign (sign) @ org.codehaus.groovy.alltests.feature ---
02-Feb-2018 21:16:31 [INFO] 1 archive(s) processed
02-Feb-2018 21:16:31 [INFO]
02-Feb-2018 21:16:31 [INFO] --- tycho-source-feature-plugin:0.24.0:source-feature (source-feature) @ org.codehaus.groovy.alltests.feature ---
02-Feb-2018 21:16:31 [INFO] Building jar: /opt/bamboo-home/xml-data/build-dir/GRECLIPSE-E44TP-JOB1/ide-test/Feature-org.codehaus.groovy.alltests.feature/target/org.codehaus.groovy.alltests.feature-2.9.3-SNAPSHOT-sources-feature.jar
02-Feb-2018 21:16:31 [INFO]
02-Feb-2018 21:16:31 [INFO] --- tycho-p2-plugin:0.24.0:p2-metadata (attach-p2-metadata) @ org.codehaus.groovy.alltests.feature ---
02-Feb-2018 21:16:31 [INFO]
02-Feb-2018 21:16:31 [INFO] --- maven-install-plugin:2.3.1:install (default-install) @ org.codehaus.groovy.alltests.feature ---
02-Feb-2018 21:16:31 [INFO] Installing /opt/bamboo-home/xml-data/build-dir/GRECLIPSE-E44TP-JOB1/ide-test/Feature-org.codehaus.groovy.alltests.feature/target/org.codehaus.groovy.alltests.feature-2.9.3-SNAPSHOT.jar to /home/bamboo/.m2/repository/org/codehaus/groovy/eclipse/org.codehaus.groovy.alltests.feature/2.9.3-SNAPSHOT/org.codehaus.groovy.alltests.feature-2.9.3-SNAPSHOT.jar
02-Feb-2018 21:16:31 [INFO] Installing /opt/bamboo-home/xml-data/build-dir/GRECLIPSE-E44TP-JOB1/ide-test/Feature-org.codehaus.groovy.alltests.feature/pom.xml to /home/bamboo/.m2/repository/org/codehaus/groovy/eclipse/org.codehaus.groovy.alltests.feature/2.9.3-SNAPSHOT/org.codehaus.groovy.alltests.feature-2.9.3-SNAPSHOT.pom
02-Feb-2018 21:16:31 [INFO] Installing /opt/bamboo-home/xml-data/build-dir/GRECLIPSE-E44TP-JOB1/ide-test/Feature-org.codehaus.groovy.alltests.feature/target/p2content.xml to /home/bamboo/.m2/repository/org/codehaus/groovy/eclipse/org.codehaus.groovy.alltests.feature/2.9.3-SNAPSHOT/org.codehaus.groovy.alltests.feature-2.9.3-SNAPSHOT-p2metadata.xml
02-Feb-2018 21:16:32 [INFO] Installing /opt/bamboo-home/xml-data/build-dir/GRECLIPSE-E44TP-JOB1/ide-test/Feature-org.codehaus.groovy.alltests.feature/target/p2artifacts.xml to /home/bamboo/.m2/repository/org/codehaus/groovy/eclipse/org.codehaus.groovy.alltests.feature/2.9.3-SNAPSHOT/org.codehaus.groovy.alltests.feature-2.9.3-SNAPSHOT-p2artifacts.xml
02-Feb-2018 21:16:32 [INFO] Installing /opt/bamboo-home/xml-data/build-dir/GRECLIPSE-E44TP-JOB1/ide-test/Feature-org.codehaus.groovy.alltests.feature/target/org.codehaus.groovy.alltests.feature-2.9.3-SNAPSHOT-sources-feature.jar to /home/bamboo/.m2/repository/org/codehaus/groovy/eclipse/org.codehaus.groovy.alltests.feature/2.9.3-SNAPSHOT/org.codehaus.groovy.alltests.feature-2.9.3-SNAPSHOT-sources-feature.jar
02-Feb-2018 21:16:32 [INFO]
02-Feb-2018 21:16:32 [INFO] --- tycho-p2-plugin:0.24.0:update-local-index (default-update-local-index) @ org.codehaus.groovy.alltests.feature ---
02-Feb-2018 21:16:32 [INFO]
02-Feb-2018 21:16:32 [INFO] --- maven-deploy-plugin:2.5:deploy (default-deploy) @ org.codehaus.groovy.alltests.feature ---
02-Feb-2018 21:16:32 [INFO] Skipping artifact deployment
02-Feb-2018 21:16:32 [INFO]                                                                         
02-Feb-2018 21:16:32 [INFO] ------------------------------------------------------------------------
02-Feb-2018 21:16:32 [INFO] Building org.codehaus.groovy.m2eclipse 2.9.3-SNAPSHOT
02-Feb-2018 21:16:32 [INFO] ------------------------------------------------------------------------
02-Feb-2018 21:16:32 [INFO]
02-Feb-2018 21:16:32 [INFO] --- maven-clean-plugin:2.5:clean (default-clean) @ org.codehaus.groovy.m2eclipse ---
02-Feb-2018 21:16:32 [INFO]
02-Feb-2018 21:16:32 [INFO] --- tycho-packaging-plugin:0.24.0:build-qualifier (default-build-qualifier) @ org.codehaus.groovy.m2eclipse ---
02-Feb-2018 21:16:32 [INFO] The project's OSGi version is 2.9.3.xx-201802021952-e44
02-Feb-2018 21:16:32 [INFO]
02-Feb-2018 21:16:32 [INFO] --- tycho-packaging-plugin:0.24.0:validate-id (default-validate-id) @ org.codehaus.groovy.m2eclipse ---
02-Feb-2018 21:16:32 [INFO]
02-Feb-2018 21:16:32 [INFO] --- tycho-packaging-plugin:0.24.0:validate-version (default-validate-version) @ org.codehaus.groovy.m2eclipse ---
02-Feb-2018 21:16:32 [INFO]
02-Feb-2018 21:16:32 [INFO] --- properties-maven-plugin:1.0-alpha-2:read-project-properties (default) @ org.codehaus.groovy.m2eclipse ---
02-Feb-2018 21:16:32 [INFO]
02-Feb-2018 21:16:32 [INFO] --- maven-resources-plugin:2.4.3:resources (default-resources) @ org.codehaus.groovy.m2eclipse ---
02-Feb-2018 21:16:32 [WARNING] Using platform encoding (UTF-8 actually) to copy filtered resources, i.e. build is platform dependent!
02-Feb-2018 21:16:32 [INFO] skip non existing resourceDirectory /opt/bamboo-home/xml-data/build-dir/GRECLIPSE-E44TP-JOB1/extras/org.codehaus.groovy.m2eclipse/src/main/resources
02-Feb-2018 21:16:32 [INFO]
02-Feb-2018 21:16:32 [INFO] --- tycho-compiler-plugin:0.24.0:compile (default-compile) @ org.codehaus.groovy.m2eclipse ---
02-Feb-2018 21:16:32 [INFO] Compiling 2 source files to /opt/bamboo-home/xml-data/build-dir/GRECLIPSE-E44TP-JOB1/extras/org.codehaus.groovy.m2eclipse/target/classes
02-Feb-2018 21:16:32 [INFO]
02-Feb-2018 21:16:32 [INFO] --- maven-resources-plugin:2.4.3:testResources (default-testResources) @ org.codehaus.groovy.m2eclipse ---
02-Feb-2018 21:16:32 [WARNING] Using platform encoding (UTF-8 actually) to copy filtered resources, i.e. build is platform dependent!
02-Feb-2018 21:16:32 [INFO] skip non existing resourceDirectory /opt/bamboo-home/xml-data/build-dir/GRECLIPSE-E44TP-JOB1/extras/org.codehaus.groovy.m2eclipse/src/test/resources
02-Feb-2018 21:16:32 [INFO]
02-Feb-2018 21:16:32 [INFO] --- tycho-source-plugin:0.24.0:plugin-source (plugin-source) @ org.codehaus.groovy.m2eclipse ---
02-Feb-2018 21:16:32 [WARNING] bundle localization file /opt/bamboo-home/xml-data/build-dir/GRECLIPSE-E44TP-JOB1/extras/org.codehaus.groovy.m2eclipse/plugin.properties not found
02-Feb-2018 21:16:32 [INFO] Building jar: /opt/bamboo-home/xml-data/build-dir/GRECLIPSE-E44TP-JOB1/extras/org.codehaus.groovy.m2eclipse/target/org.codehaus.groovy.m2eclipse-2.9.3-SNAPSHOT-sources.jar
02-Feb-2018 21:16:32 [INFO]
02-Feb-2018 21:16:32 [INFO] --- target-platform-configuration:0.24.0:target-platform (default-target-platform) @ org.codehaus.groovy.m2eclipse ---
02-Feb-2018 21:16:32 [INFO]
02-Feb-2018 21:16:32 [INFO] --- tycho-packaging-plugin:0.24.0:package-plugin (default-package-plugin) @ org.codehaus.groovy.m2eclipse ---
02-Feb-2018 21:16:32 [INFO] Building jar: /opt/bamboo-home/xml-data/build-dir/GRECLIPSE-E44TP-JOB1/extras/org.codehaus.groovy.m2eclipse/target/org.codehaus.groovy.m2eclipse-2.9.3-SNAPSHOT.jar
02-Feb-2018 21:16:32 [INFO]
02-Feb-2018 21:16:32 [INFO] --- tycho-p2-plugin:0.24.0:p2-metadata-default (default-p2-metadata-default) @ org.codehaus.groovy.m2eclipse ---
02-Feb-2018 21:16:32 [INFO]
02-Feb-2018 21:16:32 [INFO] --- maven-jarsigner-plugin:1.2:sign (sign) @ org.codehaus.groovy.m2eclipse ---
02-Feb-2018 21:16:33 [INFO] 2 archive(s) processed
02-Feb-2018 21:16:33 [INFO]
02-Feb-2018 21:16:33 [INFO] --- tycho-source-feature-plugin:0.24.0:source-feature (source-feature) @ org.codehaus.groovy.m2eclipse ---
02-Feb-2018 21:16:33 [INFO]
02-Feb-2018 21:16:33 [INFO] --- tycho-p2-plugin:0.24.0:p2-metadata (attach-p2-metadata) @ org.codehaus.groovy.m2eclipse ---
02-Feb-2018 21:16:33 [INFO]
02-Feb-2018 21:16:33 [INFO] --- maven-install-plugin:2.3.1:install (default-install) @ org.codehaus.groovy.m2eclipse ---
02-Feb-2018 21:16:33 [INFO] Installing /opt/bamboo-home/xml-data/build-dir/GRECLIPSE-E44TP-JOB1/extras/org.codehaus.groovy.m2eclipse/target/org.codehaus.groovy.m2eclipse-2.9.3-SNAPSHOT.jar to /home/bamboo/.m2/repository/org/codehaus/groovy/eclipse/org.codehaus.groovy.m2eclipse/2.9.3-SNAPSHOT/org.codehaus.groovy.m2eclipse-2.9.3-SNAPSHOT.jar
02-Feb-2018 21:16:33 [INFO] Installing /opt/bamboo-home/xml-data/build-dir/GRECLIPSE-E44TP-JOB1/extras/org.codehaus.groovy.m2eclipse/pom.xml to /home/bamboo/.m2/repository/org/codehaus/groovy/eclipse/org.codehaus.groovy.m2eclipse/2.9.3-SNAPSHOT/org.codehaus.groovy.m2eclipse-2.9.3-SNAPSHOT.pom
02-Feb-2018 21:16:33 [INFO] Installing /opt/bamboo-home/xml-data/build-dir/GRECLIPSE-E44TP-JOB1/extras/org.codehaus.groovy.m2eclipse/target/org.codehaus.groovy.m2eclipse-2.9.3-SNAPSHOT-sources.jar to /home/bamboo/.m2/repository/org/codehaus/groovy/eclipse/org.codehaus.groovy.m2eclipse/2.9.3-SNAPSHOT/org.codehaus.groovy.m2eclipse-2.9.3-SNAPSHOT-sources.jar
02-Feb-2018 21:16:33 [INFO] Installing /opt/bamboo-home/xml-data/build-dir/GRECLIPSE-E44TP-JOB1/extras/org.codehaus.groovy.m2eclipse/target/p2content.xml to /home/bamboo/.m2/repository/org/codehaus/groovy/eclipse/org.codehaus.groovy.m2eclipse/2.9.3-SNAPSHOT/org.codehaus.groovy.m2eclipse-2.9.3-SNAPSHOT-p2metadata.xml
02-Feb-2018 21:16:33 [INFO] Installing /opt/bamboo-home/xml-data/build-dir/GRECLIPSE-E44TP-JOB1/extras/org.codehaus.groovy.m2eclipse/target/p2artifacts.xml to /home/bamboo/.m2/repository/org/codehaus/groovy/eclipse/org.codehaus.groovy.m2eclipse/2.9.3-SNAPSHOT/org.codehaus.groovy.m2eclipse-2.9.3-SNAPSHOT-p2artifacts.xml
02-Feb-2018 21:16:33 [INFO]
02-Feb-2018 21:16:33 [INFO] --- tycho-p2-plugin:0.24.0:update-local-index (default-update-local-index) @ org.codehaus.groovy.m2eclipse ---
02-Feb-2018 21:16:33 [INFO]
02-Feb-2018 21:16:33 [INFO] --- maven-deploy-plugin:2.5:deploy (default-deploy) @ org.codehaus.groovy.m2eclipse ---
02-Feb-2018 21:16:33 [INFO] Skipping artifact deployment
02-Feb-2018 21:16:33 [INFO]                                                                         
02-Feb-2018 21:16:33 [INFO] ------------------------------------------------------------------------
02-Feb-2018 21:16:33 [INFO] Building org.codehaus.groovy.m2eclipse.feature 2.9.3-SNAPSHOT
02-Feb-2018 21:16:33 [INFO] ------------------------------------------------------------------------
02-Feb-2018 21:16:33 [INFO]
02-Feb-2018 21:16:33 [INFO] --- maven-clean-plugin:2.5:clean (default-clean) @ org.codehaus.groovy.m2eclipse.feature ---
02-Feb-2018 21:16:33 [INFO] Deleting /opt/bamboo-home/xml-data/build-dir/GRECLIPSE-E44TP-JOB1/extras/Feature-org.codehaus.groovy.m2eclipse/target
02-Feb-2018 21:16:33 [INFO]
02-Feb-2018 21:16:33 [INFO] --- tycho-packaging-plugin:0.24.0:build-qualifier-aggregator (default-build-qualifier-aggregator) @ org.codehaus.groovy.m2eclipse.feature ---
02-Feb-2018 21:16:33 [INFO] The project's OSGi version is 2.9.3.xx-201802021952-e44
02-Feb-2018 21:16:33 [INFO]
02-Feb-2018 21:16:33 [INFO] --- tycho-packaging-plugin:0.24.0:validate-id (default-validate-id) @ org.codehaus.groovy.m2eclipse.feature ---
02-Feb-2018 21:16:33 [INFO]
02-Feb-2018 21:16:33 [INFO] --- tycho-packaging-plugin:0.24.0:validate-version (default-validate-version) @ org.codehaus.groovy.m2eclipse.feature ---
02-Feb-2018 21:16:33 [INFO]
02-Feb-2018 21:16:33 [INFO] --- properties-maven-plugin:1.0-alpha-2:read-project-properties (default) @ org.codehaus.groovy.m2eclipse.feature ---
02-Feb-2018 21:16:33 [INFO]
02-Feb-2018 21:16:33 [INFO] --- tycho-source-plugin:0.24.0:plugin-source (plugin-source) @ org.codehaus.groovy.m2eclipse.feature ---
02-Feb-2018 21:16:33 [INFO]
02-Feb-2018 21:16:33 [INFO] --- target-platform-configuration:0.24.0:target-platform (default-target-platform) @ org.codehaus.groovy.m2eclipse.feature ---
02-Feb-2018 21:16:33 [INFO]
02-Feb-2018 21:16:33 [INFO] --- tycho-packaging-plugin:0.24.0:package-feature (default-package-feature) @ org.codehaus.groovy.m2eclipse.feature ---
02-Feb-2018 21:16:33 [INFO] Building jar: /opt/bamboo-home/xml-data/build-dir/GRECLIPSE-E44TP-JOB1/extras/Feature-org.codehaus.groovy.m2eclipse/target/org.codehaus.groovy.m2eclipse.feature-2.9.3-SNAPSHOT.jar
02-Feb-2018 21:16:33 [INFO]
02-Feb-2018 21:16:33 [INFO] --- tycho-p2-plugin:0.24.0:p2-metadata-default (default-p2-metadata-default) @ org.codehaus.groovy.m2eclipse.feature ---
02-Feb-2018 21:16:33 [INFO]
02-Feb-2018 21:16:33 [INFO] --- tycho-p2-plugin:0.24.0:feature-p2-metadata (default-feature-p2-metadata) @ org.codehaus.groovy.m2eclipse.feature ---
02-Feb-2018 21:16:33 [INFO]
02-Feb-2018 21:16:33 [INFO] --- maven-jarsigner-plugin:1.2:sign (sign) @ org.codehaus.groovy.m2eclipse.feature ---
02-Feb-2018 21:16:33 [INFO] 1 archive(s) processed
02-Feb-2018 21:16:33 [INFO]
02-Feb-2018 21:16:33 [INFO] --- tycho-source-feature-plugin:0.24.0:source-feature (source-feature) @ org.codehaus.groovy.m2eclipse.feature ---
02-Feb-2018 21:16:33 [INFO] Building jar: /opt/bamboo-home/xml-data/build-dir/GRECLIPSE-E44TP-JOB1/extras/Feature-org.codehaus.groovy.m2eclipse/target/org.codehaus.groovy.m2eclipse.feature-2.9.3-SNAPSHOT-sources-feature.jar
02-Feb-2018 21:16:33 [INFO]
02-Feb-2018 21:16:33 [INFO] --- tycho-p2-plugin:0.24.0:p2-metadata (attach-p2-metadata) @ org.codehaus.groovy.m2eclipse.feature ---
02-Feb-2018 21:16:33 [INFO]
02-Feb-2018 21:16:33 [INFO] --- maven-install-plugin:2.3.1:install (default-install) @ org.codehaus.groovy.m2eclipse.feature ---
02-Feb-2018 21:16:33 [INFO] Installing /opt/bamboo-home/xml-data/build-dir/GRECLIPSE-E44TP-JOB1/extras/Feature-org.codehaus.groovy.m2eclipse/target/org.codehaus.groovy.m2eclipse.feature-2.9.3-SNAPSHOT.jar to /home/bamboo/.m2/repository/org/codehaus/groovy/eclipse/org.codehaus.groovy.m2eclipse.feature/2.9.3-SNAPSHOT/org.codehaus.groovy.m2eclipse.feature-2.9.3-SNAPSHOT.jar
02-Feb-2018 21:16:33 [INFO] Installing /opt/bamboo-home/xml-data/build-dir/GRECLIPSE-E44TP-JOB1/extras/Feature-org.codehaus.groovy.m2eclipse/pom.xml to /home/bamboo/.m2/repository/org/codehaus/groovy/eclipse/org.codehaus.groovy.m2eclipse.feature/2.9.3-SNAPSHOT/org.codehaus.groovy.m2eclipse.feature-2.9.3-SNAPSHOT.pom
02-Feb-2018 21:16:33 [INFO] Installing /opt/bamboo-home/xml-data/build-dir/GRECLIPSE-E44TP-JOB1/extras/Feature-org.codehaus.groovy.m2eclipse/target/p2content.xml to /home/bamboo/.m2/repository/org/codehaus/groovy/eclipse/org.codehaus.groovy.m2eclipse.feature/2.9.3-SNAPSHOT/org.codehaus.groovy.m2eclipse.feature-2.9.3-SNAPSHOT-p2metadata.xml
02-Feb-2018 21:16:33 [INFO] Installing /opt/bamboo-home/xml-data/build-dir/GRECLIPSE-E44TP-JOB1/extras/Feature-org.codehaus.groovy.m2eclipse/target/p2artifacts.xml to /home/bamboo/.m2/repository/org/codehaus/groovy/eclipse/org.codehaus.groovy.m2eclipse.feature/2.9.3-SNAPSHOT/org.codehaus.groovy.m2eclipse.feature-2.9.3-SNAPSHOT-p2artifacts.xml
02-Feb-2018 21:16:33 [INFO] Installing /opt/bamboo-home/xml-data/build-dir/GRECLIPSE-E44TP-JOB1/extras/Feature-org.codehaus.groovy.m2eclipse/target/org.codehaus.groovy.m2eclipse.feature-2.9.3-SNAPSHOT-sources-feature.jar to /home/bamboo/.m2/repository/org/codehaus/groovy/eclipse/org.codehaus.groovy.m2eclipse.feature/2.9.3-SNAPSHOT/org.codehaus.groovy.m2eclipse.feature-2.9.3-SNAPSHOT-sources-feature.jar
02-Feb-2018 21:16:33 [INFO]
02-Feb-2018 21:16:33 [INFO] --- tycho-p2-plugin:0.24.0:update-local-index (default-update-local-index) @ org.codehaus.groovy.m2eclipse.feature ---
02-Feb-2018 21:16:33 [INFO]
02-Feb-2018 21:16:33 [INFO] --- maven-deploy-plugin:2.5:deploy (default-deploy) @ org.codehaus.groovy.m2eclipse.feature ---
02-Feb-2018 21:16:33 [INFO] Skipping artifact deployment
02-Feb-2018 21:16:33 [INFO]                                                                         
02-Feb-2018 21:16:33 [INFO] ------------------------------------------------------------------------
02-Feb-2018 21:16:33 [INFO] Building org.codehaus.groovy.eclipse.site 2.9.3-SNAPSHOT
02-Feb-2018 21:16:33 [INFO] ------------------------------------------------------------------------
02-Feb-2018 21:16:33 [INFO]
02-Feb-2018 21:16:33 [INFO] --- maven-clean-plugin:2.5:clean (default-clean) @ org.codehaus.groovy.eclipse.site ---
02-Feb-2018 21:16:33 [INFO]
02-Feb-2018 21:16:33 [INFO] --- tycho-packaging-plugin:0.24.0:build-qualifier (default-build-qualifier) @ org.codehaus.groovy.eclipse.site ---
02-Feb-2018 21:16:33 [INFO] The project's OSGi version is 2.9.3.xx-201802021952-e44
02-Feb-2018 21:16:33 [INFO]
02-Feb-2018 21:16:33 [INFO] --- properties-maven-plugin:1.0-alpha-2:read-project-properties (default) @ org.codehaus.groovy.eclipse.site ---
02-Feb-2018 21:16:33 [INFO]
02-Feb-2018 21:16:33 [INFO] --- tycho-source-plugin:0.24.0:plugin-source (plugin-source) @ org.codehaus.groovy.eclipse.site ---
02-Feb-2018 21:16:33 [INFO]
02-Feb-2018 21:16:33 [INFO] --- tycho-packaging-plugin:0.24.0:update-site (default-update-site) @ org.codehaus.groovy.eclipse.site ---
02-Feb-2018 21:16:33 [INFO]
02-Feb-2018 21:16:33 [INFO] --- tycho-p2-plugin:0.24.0:update-site-p2-metadata (default-update-site-p2-metadata) @ org.codehaus.groovy.eclipse.site ---
02-Feb-2018 21:16:33 [INFO] Command line:
02-Feb-2018 21:16:33         [/opt/jdk1.7.0_80/jre/bin/java, -jar, /opt/users/bamboo/.m2/repository/org/eclipse/tycho/tycho-bundles-external/0.24.0/eclipse/plugins/org.eclipse.equinox.launcher_1.3.100.v20150511-1540.jar, -configuration, /tmp/GRECLIPSE-E44TP-JOB1/tycho-p2-runtime5909944217145825598.tmp/configuration, -nosplash, -application, org.eclipse.equinox.p2.publisher.UpdateSitePublisher, -source, /opt/bamboo-home/xml-data/build-dir/GRECLIPSE-E44TP-JOB1/Site-org.codehaus.groovy.eclipse/target/site, -metadataRepository, file:/opt/bamboo-home/xml-data/build-dir/GRECLIPSE-E44TP-JOB1/Site-org.codehaus.groovy.eclipse/target/site/, -metadataRepositoryName, org.codehaus.groovy.eclipse.site, -artifactRepository, file:/opt/bamboo-home/xml-data/build-dir/GRECLIPSE-E44TP-JOB1/Site-org.codehaus.groovy.eclipse/target/site/, -artifactRepositoryName, org.codehaus.groovy.eclipse.site Artifacts, -noDefaultIUs, -compress]
02-Feb-2018 21:16:35 Generating metadata for ..
02-Feb-2018 21:16:36 Generation completed with success [0 seconds].
02-Feb-2018 21:16:36 [INFO]
02-Feb-2018 21:16:36 [INFO] --- tycho-packaging-plugin:0.24.0:update-site-packaging (default-update-site-packaging) @ org.codehaus.groovy.eclipse.site ---
02-Feb-2018 21:16:36 [INFO] Building zip: /opt/bamboo-home/xml-data/build-dir/GRECLIPSE-E44TP-JOB1/Site-org.codehaus.groovy.eclipse/target/site.zip
02-Feb-2018 21:16:36 [INFO]
02-Feb-2018 21:16:36 [INFO] --- maven-jarsigner-plugin:1.2:sign (sign) @ org.codehaus.groovy.eclipse.site ---
02-Feb-2018 21:16:37 [INFO] 1 archive(s) processed
02-Feb-2018 21:16:37 [INFO]
02-Feb-2018 21:16:37 [INFO] --- tycho-source-feature-plugin:0.24.0:source-feature (source-feature) @ org.codehaus.groovy.eclipse.site ---
02-Feb-2018 21:16:37 [INFO]
02-Feb-2018 21:16:37 [INFO] --- tycho-p2-plugin:0.24.0:p2-metadata (attach-p2-metadata) @ org.codehaus.groovy.eclipse.site ---
02-Feb-2018 21:16:37 [INFO]
02-Feb-2018 21:16:37 [INFO] --- maven-install-plugin:2.3.1:install (default-install) @ org.codehaus.groovy.eclipse.site ---
02-Feb-2018 21:16:37 [INFO] Installing /opt/bamboo-home/xml-data/build-dir/GRECLIPSE-E44TP-JOB1/Site-org.codehaus.groovy.eclipse/target/site.zip to /home/bamboo/.m2/repository/org/codehaus/groovy/eclipse/org.codehaus.groovy.eclipse.site/2.9.3-SNAPSHOT/org.codehaus.groovy.eclipse.site-2.9.3-SNAPSHOT.zip
02-Feb-2018 21:16:37 [INFO] Installing /opt/bamboo-home/xml-data/build-dir/GRECLIPSE-E44TP-JOB1/Site-org.codehaus.groovy.eclipse/pom.xml to /home/bamboo/.m2/repository/org/codehaus/groovy/eclipse/org.codehaus.groovy.eclipse.site/2.9.3-SNAPSHOT/org.codehaus.groovy.eclipse.site-2.9.3-SNAPSHOT.pom
02-Feb-2018 21:16:37 [INFO]
02-Feb-2018 21:16:37 [INFO] --- maven-deploy-plugin:2.5:deploy (default-deploy) @ org.codehaus.groovy.eclipse.site ---
02-Feb-2018 21:16:37 [INFO] Skipping artifact deployment
02-Feb-2018 21:16:37 [INFO]
02-Feb-2018 21:16:37 [INFO] --- maven-antrun-plugin:1.6:run (upload-dist) @ org.codehaus.groovy.eclipse.site ---
02-Feb-2018 21:16:37 [INFO] Executing tasks
02-Feb-2018 21:16:37
02-Feb-2018 21:16:37 main:
02-Feb-2018 21:16:37      [echo] Uploading main update site to s3..."
02-Feb-2018 21:16:37      [echo] ==== dist props are set so we can deploy? ===
02-Feb-2018 21:16:37      [echo] bamboo.s3.properties=${bamboo.s3.properties}
02-Feb-2018 21:16:37      [echo] dist_properties=/home/bamboo/tools/s3.properties
02-Feb-2018 21:16:37      [echo] env.bamboo_s3_properties_rel=/home/bamboo/tools/s3.properties
02-Feb-2018 21:16:37      [echo] dist.accessKey=AKIAJKUKWKYLMXOFIFDA
02-Feb-2018 21:16:37      [echo] accessKey=AKIAJKUKWKYLMXOFIFDA
02-Feb-2018 21:16:37      [echo] site.target.dir=/opt/bamboo-home/xml-data/build-dir/GRECLIPSE-E44TP-JOB1/Site-org.codehaus.groovy.eclipse/target
02-Feb-2018 21:16:37      [echo] unqualifiedVersion=2.9.3
02-Feb-2018 21:16:37      [echo] buildQualifier=xx-201802021952-e44
02-Feb-2018 21:16:37      [echo] dist.full.version=2.9.3.xx-201802021952-e44
02-Feb-2018 21:16:37      [echo] dist.file.name=org.codehaus.groovy-2.9.3.xx-201802021952-e44-updatesite.zip
02-Feb-2018 21:16:37       [zip] Building zip: /opt/bamboo-home/xml-data/build-dir/GRECLIPSE-E44TP-JOB1/Site-org.codehaus.groovy.eclipse/target/site/org.codehaus.groovy-2.9.3.xx-201802021952-e44-updatesite.zip
02-Feb-2018 21:16:44      [echo] Preparing for upload... This will happen:
02-Feb-2018 21:16:44      [echo] Will Delete:
02-Feb-2018 21:16:44      [echo] dist.bucket=dist.springsource.org
02-Feb-2018 21:16:44      [echo] dist.path=snapshot/GRECLIPSE/e4.4
02-Feb-2018 21:16:44      [echo] Will Upload:
02-Feb-2018 21:16:44      [echo] dist.bucket=dist.springsource.org
02-Feb-2018 21:16:44      [echo] toDir=snapshot/GRECLIPSE/e4.4
02-Feb-2018 21:16:44      [echo] fromDir=/opt/bamboo-home/xml-data/build-dir/GRECLIPSE-E44TP-JOB1/Site-org.codehaus.groovy.eclipse/target/site
02-Feb-2018 21:16:44      [echo] Will Upload:
02-Feb-2018 21:16:44      [echo] dist.bucket=dist.springsource.org
02-Feb-2018 21:16:44      [echo] toFile=snapshot/GRECLIPSE/e4.4/org.codehaus.groovy-2.9.3.xx-201802021952-e44-updatesite.zip
02-Feb-2018 21:16:44      [echo] fromFile=snapshot/GRECLIPSE/e4.4/org.codehaus.groovy-2.9.3.xx-201802021952-e44-updatesite.zip
02-Feb-2018 21:16:44      [echo] metadata project.name=Groovy Eclipse
02-Feb-2018 21:16:44      [echo] metadata release.type=snapshot
02-Feb-2018 21:16:44      [echo] metadata bundle.version=2.9.3.xx-201802021952-e44
02-Feb-2018 21:16:44      [echo] metadata package.file.name=org.codehaus.groovy-2.9.3.xx-201802021952-e44-updatesite.zip
02-Feb-2018 21:16:46 Deleted s3://dist.springsource.org/snapshot/GRECLIPSE/e4.4/artifacts.jar
02-Feb-2018 21:16:46 Deleted s3://dist.springsource.org/snapshot/GRECLIPSE/e4.4/content.jar
02-Feb-2018 21:16:46 Deleted s3://dist.springsource.org/snapshot/GRECLIPSE/e4.4/features/
02-Feb-2018 21:16:46 Deleted s3://dist.springsource.org/snapshot/GRECLIPSE/e4.4/features/org.codehaus.groovy.compilerless.feature_2.9.3.xx-201801092059-e44.jar
02-Feb-2018 21:16:46 Deleted s3://dist.springsource.org/snapshot/GRECLIPSE/e4.4/features/org.codehaus.groovy.eclipse.feature_2.9.3.xx-201801092059-e44.jar
02-Feb-2018 21:16:46 Deleted s3://dist.springsource.org/snapshot/GRECLIPSE/e4.4/features/org.codehaus.groovy.headless.feature_2.9.3.xx-201801092059-e44.jar
02-Feb-2018 21:16:46 Deleted s3://dist.springsource.org/snapshot/GRECLIPSE/e4.4/features/org.codehaus.groovy.jdt.patch_2.9.3.xx-201801092059-e44.jar
02-Feb-2018 21:16:46 Deleted s3://dist.springsource.org/snapshot/GRECLIPSE/e4.4/features/org.codehaus.groovy.m2eclipse.feature_2.9.3.xx-201801092059-e44.jar
02-Feb-2018 21:16:46 Deleted s3://dist.springsource.org/snapshot/GRECLIPSE/e4.4/features/org.codehaus.groovy18.feature_2.9.3.xx-201801092059-e44.jar
02-Feb-2018 21:16:46 Deleted s3://dist.springsource.org/snapshot/GRECLIPSE/e4.4/features/org.codehaus.groovy20.feature_2.9.3.xx-201801092059-e44.jar
02-Feb-2018 21:16:47 Deleted s3://dist.springsource.org/snapshot/GRECLIPSE/e4.4/features/org.codehaus.groovy21.feature_2.9.3.xx-201801092059-e44.jar
02-Feb-2018 21:16:47 Deleted s3://dist.springsource.org/snapshot/GRECLIPSE/e4.4/features/org.codehaus.groovy22.feature_2.9.3.xx-201801092059-e44.jar
02-Feb-2018 21:16:47 Deleted s3://dist.springsource.org/snapshot/GRECLIPSE/e4.4/features/org.codehaus.groovy23.feature_2.9.3.xx-201801092059-e44.jar
02-Feb-2018 21:16:47 Deleted s3://dist.springsource.org/snapshot/GRECLIPSE/e4.4/features/org.codehaus.groovy24.feature_2.9.3.xx-201801092059-e44.jar
02-Feb-2018 21:16:47 Deleted s3://dist.springsource.org/snapshot/GRECLIPSE/e4.4/features/org.codehaus.groovy25.feature_2.9.3.xx-201801092059-e44.jar
02-Feb-2018 21:16:47 Deleted s3://dist.springsource.org/snapshot/GRECLIPSE/e4.4/plugins/
02-Feb-2018 21:16:47 Deleted s3://dist.springsource.org/snapshot/GRECLIPSE/e4.4/plugins/org.codehaus.groovy.eclipse.ant_2.9.3.xx-201801092059-e44.jar
02-Feb-2018 21:16:47 Deleted s3://dist.springsource.org/snapshot/GRECLIPSE/e4.4/plugins/org.codehaus.groovy.eclipse.astviews_2.9.3.xx-201801092059-e44.jar
02-Feb-2018 21:16:47 Deleted s3://dist.springsource.org/snapshot/GRECLIPSE/e4.4/plugins/org.codehaus.groovy.eclipse.codeassist.completion_2.9.3.xx-201801092059-e44.jar
02-Feb-2018 21:16:47 Deleted s3://dist.springsource.org/snapshot/GRECLIPSE/e4.4/plugins/org.codehaus.groovy.eclipse.codebrowsing_2.9.3.xx-201801092059-e44.jar
02-Feb-2018 21:16:47 Deleted s3://dist.springsource.org/snapshot/GRECLIPSE/e4.4/plugins/org.codehaus.groovy.eclipse.compilerResolver_2.9.3.xx-201801092059-e44.jar
02-Feb-2018 21:16:48 Deleted s3://dist.springsource.org/snapshot/GRECLIPSE/e4.4/plugins/org.codehaus.groovy.eclipse.core_2.9.3.xx-201801092059-e44.jar
02-Feb-2018 21:16:48 Deleted s3://dist.springsource.org/snapshot/GRECLIPSE/e4.4/plugins/org.codehaus.groovy.eclipse.dsl_2.9.3.xx-201801092059-e44.jar
02-Feb-2018 21:16:48 Deleted s3://dist.springsource.org/snapshot/GRECLIPSE/e4.4/plugins/org.codehaus.groovy.eclipse.quickfix_2.9.3.xx-201801092059-e44.jar
02-Feb-2018 21:16:48 Deleted s3://dist.springsource.org/snapshot/GRECLIPSE/e4.4/plugins/org.codehaus.groovy.eclipse.refactoring_2.9.3.xx-201801092059-e44.jar
02-Feb-2018 21:16:48 Deleted s3://dist.springsource.org/snapshot/GRECLIPSE/e4.4/plugins/org.codehaus.groovy.eclipse.ui_2.9.3.xx-201801092059-e44.jar
02-Feb-2018 21:16:48 Deleted s3://dist.springsource.org/snapshot/GRECLIPSE/e4.4/plugins/org.codehaus.groovy.eclipse_2.9.3.xx-201801092059-e44.jar
02-Feb-2018 21:16:48 Deleted s3://dist.springsource.org/snapshot/GRECLIPSE/e4.4/plugins/org.codehaus.groovy.m2eclipse_2.9.3.xx-201801092059-e44.jar
02-Feb-2018 21:16:48 Deleted s3://dist.springsource.org/snapshot/GRECLIPSE/e4.4/plugins/org.codehaus.groovy_1.8.9.xx-201801092059-e44.jar
02-Feb-2018 21:16:48 Deleted s3://dist.springsource.org/snapshot/GRECLIPSE/e4.4/plugins/org.codehaus.groovy_2.0.8.xx-201801092059-e44.jar
02-Feb-2018 21:16:48 Deleted s3://dist.springsource.org/snapshot/GRECLIPSE/e4.4/plugins/org.codehaus.groovy_2.1.9.xx-201801092059-e44.jar
02-Feb-2018 21:16:49 Deleted s3://dist.springsource.org/snapshot/GRECLIPSE/e4.4/plugins/org.codehaus.groovy_2.2.2.xx-201801092059-e44.jar
02-Feb-2018 21:16:49 Deleted s3://dist.springsource.org/snapshot/GRECLIPSE/e4.4/plugins/org.codehaus.groovy_2.3.11.xx-201801092059-e44.jar
02-Feb-2018 21:16:49 Deleted s3://dist.springsource.org/snapshot/GRECLIPSE/e4.4/plugins/org.codehaus.groovy_2.4.13.xx-201801092059-e44.jar
02-Feb-2018 21:16:49 Deleted s3://dist.springsource.org/snapshot/GRECLIPSE/e4.4/plugins/org.codehaus.groovy_2.5.0.xx-201801092059-e44.jar
02-Feb-2018 21:16:49 Deleted s3://dist.springsource.org/snapshot/GRECLIPSE/e4.4/plugins/org.eclipse.jdt.core_3.10.2.xx-201801092059-e44.jar
02-Feb-2018 21:16:49 Deleted s3://dist.springsource.org/snapshot/GRECLIPSE/e4.4/plugins/org.eclipse.jdt.groovy.core_2.9.3.xx-201801092059-e44.jar
02-Feb-2018 21:16:49 Deleted s3://dist.springsource.org/snapshot/GRECLIPSE/e4.4/site.xml
02-Feb-2018 21:16:49 Uploading /opt/bamboo-home/xml-data/build-dir/GRECLIPSE-E44TP-JOB1/Site-org.codehaus.groovy.eclipse/target/site/artifacts.jar (1.9 KB) to s3://dist.springsource.org/snapshot/GRECLIPSE/e4.4/artifacts.jar
02-Feb-2018 21:16:50 Transfer Time: .2 s - Transfer Rate: 11.5 KB/s
02-Feb-2018 21:16:50 Uploading /opt/bamboo-home/xml-data/build-dir/GRECLIPSE-E44TP-JOB1/Site-org.codehaus.groovy.eclipse/target/site/content.jar (14.5 KB) to s3://dist.springsource.org/snapshot/GRECLIPSE/e4.4/content.jar
02-Feb-2018 21:16:50 Transfer Time: .3 s - Transfer Rate: 54.4 KB/s
02-Feb-2018 21:16:50 Uploading /opt/bamboo-home/xml-data/build-dir/GRECLIPSE-E44TP-JOB1/Site-org.codehaus.groovy.eclipse/target/site/features/org.codehaus.groovy.compilerless.feature_2.9.3.xx-201802021952-e44.jar (15.7 KB) to s3://dist.springsource.org/snapshot/GRECLIPSE/e4.4/features/org.codehaus.groovy.compilerless.feature_2.9.3.xx-201802021952-e44.jar
02-Feb-2018 21:16:51 Transfer Time: .3 s - Transfer Rate: 54.2 KB/s
02-Feb-2018 21:16:51 Uploading /opt/bamboo-home/xml-data/build-dir/GRECLIPSE-E44TP-JOB1/Site-org.codehaus.groovy.eclipse/target/site/features/org.codehaus.groovy.eclipse.feature_2.9.3.xx-201802021952-e44.jar (15.2 KB) to s3://dist.springsource.org/snapshot/GRECLIPSE/e4.4/features/org.codehaus.groovy.eclipse.feature_2.9.3.xx-201802021952-e44.jar
02-Feb-2018 21:16:51 Transfer Time: .3 s - Transfer Rate: 58.3 KB/s
02-Feb-2018 21:16:52 Uploading /opt/bamboo-home/xml-data/build-dir/GRECLIPSE-E44TP-JOB1/Site-org.codehaus.groovy.eclipse/target/site/features/org.codehaus.groovy.headless.feature_2.9.3.xx-201802021952-e44.jar (15.5 KB) to s3://dist.springsource.org/snapshot/GRECLIPSE/e4.4/features/org.codehaus.groovy.headless.feature_2.9.3.xx-201802021952-e44.jar
02-Feb-2018 21:16:52 Transfer Time: .2 s - Transfer Rate: 62.7 KB/s
02-Feb-2018 21:16:52 Uploading /opt/bamboo-home/xml-data/build-dir/GRECLIPSE-E44TP-JOB1/Site-org.codehaus.groovy.eclipse/target/site/features/org.codehaus.groovy.jdt.patch_2.9.3.xx-201802021952-e44.jar (9.6 KB) to s3://dist.springsource.org/snapshot/GRECLIPSE/e4.4/features/org.codehaus.groovy.jdt.patch_2.9.3.xx-201802021952-e44.jar
02-Feb-2018 21:16:53 Transfer Time: .2 s - Transfer Rate: 50.8 KB/s
02-Feb-2018 21:16:53 Uploading /opt/bamboo-home/xml-data/build-dir/GRECLIPSE-E44TP-JOB1/Site-org.codehaus.groovy.eclipse/target/site/features/org.codehaus.groovy.m2eclipse.feature_2.9.3.xx-201802021952-e44.jar (15.2 KB) to s3://dist.springsource.org/snapshot/GRECLIPSE/e4.4/features/org.codehaus.groovy.m2eclipse.feature_2.9.3.xx-201802021952-e44.jar
02-Feb-2018 21:16:53 Transfer Time: .2 s - Transfer Rate: 81.6 KB/s
02-Feb-2018 21:16:54 Uploading /opt/bamboo-home/xml-data/build-dir/GRECLIPSE-E44TP-JOB1/Site-org.codehaus.groovy.eclipse/target/site/features/org.codehaus.groovy18.feature_2.9.3.xx-201802021952-e44.jar (15.3 KB) to s3://dist.springsource.org/snapshot/GRECLIPSE/e4.4/features/org.codehaus.groovy18.feature_2.9.3.xx-201802021952-e44.jar
02-Feb-2018 21:16:54 Transfer Time: .2 s - Transfer Rate: 76.2 KB/s
02-Feb-2018 21:16:54 Uploading /opt/bamboo-home/xml-data/build-dir/GRECLIPSE-E44TP-JOB1/Site-org.codehaus.groovy.eclipse/target/site/features/org.codehaus.groovy20.feature_2.9.3.xx-201802021952-e44.jar (15.3 KB) to s3://dist.springsource.org/snapshot/GRECLIPSE/e4.4/features/org.codehaus.groovy20.feature_2.9.3.xx-201802021952-e44.jar
02-Feb-2018 21:16:55 Transfer Time: .5 s - Transfer Rate: 33.1 KB/s
02-Feb-2018 21:16:55 Uploading /opt/bamboo-home/xml-data/build-dir/GRECLIPSE-E44TP-JOB1/Site-org.codehaus.groovy.eclipse/target/site/features/org.codehaus.groovy21.feature_2.9.3.xx-201802021952-e44.jar (15.3 KB) to s3://dist.springsource.org/snapshot/GRECLIPSE/e4.4/features/org.codehaus.groovy21.feature_2.9.3.xx-201802021952-e44.jar
02-Feb-2018 21:16:55 Transfer Time: .2 s - Transfer Rate: 94.0 KB/s
02-Feb-2018 21:16:56 Uploading /opt/bamboo-home/xml-data/build-dir/GRECLIPSE-E44TP-JOB1/Site-org.codehaus.groovy.eclipse/target/site/features/org.codehaus.groovy22.feature_2.9.3.xx-201802021952-e44.jar (15.3 KB) to s3://dist.springsource.org/snapshot/GRECLIPSE/e4.4/features/org.codehaus.groovy22.feature_2.9.3.xx-201802021952-e44.jar
02-Feb-2018 21:16:56 Transfer Time: .2 s - Transfer Rate: 93.4 KB/s
02-Feb-2018 21:16:56 Uploading /opt/bamboo-home/xml-data/build-dir/GRECLIPSE-E44TP-JOB1/Site-org.codehaus.groovy.eclipse/target/site/features/org.codehaus.groovy23.feature_2.9.3.xx-201802021952-e44.jar (15.3 KB) to s3://dist.springsource.org/snapshot/GRECLIPSE/e4.4/features/org.codehaus.groovy23.feature_2.9.3.xx-201802021952-e44.jar
02-Feb-2018 21:16:56 Transfer Time: .2 s - Transfer Rate: 94.0 KB/s
02-Feb-2018 21:16:57 Uploading /opt/bamboo-home/xml-data/build-dir/GRECLIPSE-E44TP-JOB1/Site-org.codehaus.groovy.eclipse/target/site/features/org.codehaus.groovy24.feature_2.9.3.xx-201802021952-e44.jar (15.1 KB) to s3://dist.springsource.org/snapshot/GRECLIPSE/e4.4/features/org.codehaus.groovy24.feature_2.9.3.xx-201802021952-e44.jar
02-Feb-2018 21:16:57 Transfer Time: .2 s - Transfer Rate: 65.8 KB/s
02-Feb-2018 21:16:58 Uploading /opt/bamboo-home/xml-data/build-dir/GRECLIPSE-E44TP-JOB1/Site-org.codehaus.groovy.eclipse/target/site/features/org.codehaus.groovy25.feature_2.9.3.xx-201802021952-e44.jar (15.1 KB) to s3://dist.springsource.org/snapshot/GRECLIPSE/e4.4/features/org.codehaus.groovy25.feature_2.9.3.xx-201802021952-e44.jar
02-Feb-2018 21:16:58 Transfer Time: .2 s - Transfer Rate: 92.9 KB/s
02-Feb-2018 21:16:58 Uploading /opt/bamboo-home/xml-data/build-dir/GRECLIPSE-E44TP-JOB1/Site-org.codehaus.groovy.eclipse/target/site/org.codehaus.groovy-2.9.3.xx-201802021952-e44-updatesite.zip.md5 (.0 KB) to s3://dist.springsource.org/snapshot/GRECLIPSE/e4.4/org.codehaus.groovy-2.9.3.xx-201802021952-e44-updatesite.zip.md5
02-Feb-2018 21:16:58 Transfer Time: .2 s - Transfer Rate: .2 KB/s
02-Feb-2018 21:16:59 Uploading /opt/bamboo-home/xml-data/build-dir/GRECLIPSE-E44TP-JOB1/Site-org.codehaus.groovy.eclipse/target/site/org.codehaus.groovy-2.9.3.xx-201802021952-e44-updatesite.zip.sha1 (.0 KB) to s3://dist.springsource.org/snapshot/GRECLIPSE/e4.4/org.codehaus.groovy-2.9.3.xx-201802021952-e44-updatesite.zip.sha1
02-Feb-2018 21:16:59 Transfer Time: .2 s - Transfer Rate: .3 KB/s
02-Feb-2018 21:16:59 Uploading /opt/bamboo-home/xml-data/build-dir/GRECLIPSE-E44TP-JOB1/Site-org.codehaus.groovy.eclipse/target/site/plugins/org.codehaus.groovy.eclipse.ant_2.9.3.xx-201802021952-e44.jar (11.3 KB) to s3://dist.springsource.org/snapshot/GRECLIPSE/e4.4/plugins/org.codehaus.groovy.eclipse.ant_2.9.3.xx-201802021952-e44.jar
02-Feb-2018 21:16:59 Transfer Time: .2 s - Transfer Rate: 66.3 KB/s
02-Feb-2018 21:17:00 Uploading /opt/bamboo-home/xml-data/build-dir/GRECLIPSE-E44TP-JOB1/Site-org.codehaus.groovy.eclipse/target/site/plugins/org.codehaus.groovy.eclipse.astviews_2.9.3.xx-201802021952-e44.jar (69.1 KB) to s3://dist.springsource.org/snapshot/GRECLIPSE/e4.4/plugins/org.codehaus.groovy.eclipse.astviews_2.9.3.xx-201802021952-e44.jar
02-Feb-2018 21:17:00 Transfer Time: .2 s - Transfer Rate: 284.5 KB/s
02-Feb-2018 21:17:00 Uploading /opt/bamboo-home/xml-data/build-dir/GRECLIPSE-E44TP-JOB1/Site-org.codehaus.groovy.eclipse/target/site/plugins/org.codehaus.groovy.eclipse.codeassist.completion_2.9.3.xx-201802021952-e44.jar (234.6 KB) to s3://dist.springsource.org/snapshot/GRECLIPSE/e4.4/plugins/org.codehaus.groovy.eclipse.codeassist.completion_2.9.3.xx-201802021952-e44.jar
02-Feb-2018 21:17:01 Transfer Time: .3 s - Transfer Rate: 682.0 KB/s
02-Feb-2018 21:17:01 Uploading /opt/bamboo-home/xml-data/build-dir/GRECLIPSE-E44TP-JOB1/Site-org.codehaus.groovy.eclipse/target/site/plugins/org.codehaus.groovy.eclipse.codebrowsing_2.9.3.xx-201802021952-e44.jar (82.4 KB) to s3://dist.springsource.org/snapshot/GRECLIPSE/e4.4/plugins/org.codehaus.groovy.eclipse.codebrowsing_2.9.3.xx-201802021952-e44.jar
02-Feb-2018 21:17:01 Transfer Time: .2 s - Transfer Rate: 496.1 KB/s
02-Feb-2018 21:17:01 Uploading /opt/bamboo-home/xml-data/build-dir/GRECLIPSE-E44TP-JOB1/Site-org.codehaus.groovy.eclipse/target/site/plugins/org.codehaus.groovy.eclipse.compilerResolver_2.9.3.xx-201802021952-e44.jar (18.1 KB) to s3://dist.springsource.org/snapshot/GRECLIPSE/e4.4/plugins/org.codehaus.groovy.eclipse.compilerResolver_2.9.3.xx-201802021952-e44.jar
02-Feb-2018 21:17:02 Transfer Time: 1.0 s - Transfer Rate: 18.5 KB/s
02-Feb-2018 21:17:03 Uploading /opt/bamboo-home/xml-data/build-dir/GRECLIPSE-E44TP-JOB1/Site-org.codehaus.groovy.eclipse/target/site/plugins/org.codehaus.groovy.eclipse.core_2.9.3.xx-201802021952-e44.jar (92.5 KB) to s3://dist.springsource.org/snapshot/GRECLIPSE/e4.4/plugins/org.codehaus.groovy.eclipse.core_2.9.3.xx-201802021952-e44.jar
02-Feb-2018 21:17:03 Transfer Time: .2 s - Transfer Rate: 382.2 KB/s
02-Feb-2018 21:17:03 Uploading /opt/bamboo-home/xml-data/build-dir/GRECLIPSE-E44TP-JOB1/Site-org.codehaus.groovy.eclipse/target/site/plugins/org.codehaus.groovy.eclipse.dsl_2.9.3.xx-201802021952-e44.jar (373.6 KB) to s3://dist.springsource.org/snapshot/GRECLIPSE/e4.4/plugins/org.codehaus.groovy.eclipse.dsl_2.9.3.xx-201802021952-e44.jar
02-Feb-2018 21:17:04 Transfer Time: .3 s - Transfer Rate: 1.1 MB/s
02-Feb-2018 21:17:04 Uploading /opt/bamboo-home/xml-data/build-dir/GRECLIPSE-E44TP-JOB1/Site-org.codehaus.groovy.eclipse/target/site/plugins/org.codehaus.groovy.eclipse.quickfix_2.9.3.xx-201802021952-e44.jar (100.0 KB) to s3://dist.springsource.org/snapshot/GRECLIPSE/e4.4/plugins/org.codehaus.groovy.eclipse.quickfix_2.9.3.xx-201802021952-e44.jar
02-Feb-2018 21:17:04 Transfer Time: .3 s - Transfer Rate: 384.5 KB/s
02-Feb-2018 21:17:05 Uploading /opt/bamboo-home/xml-data/build-dir/GRECLIPSE-E44TP-JOB1/Site-org.codehaus.groovy.eclipse/target/site/plugins/org.codehaus.groovy.eclipse.refactoring_2.9.3.xx-201802021952-e44.jar (251.8 KB) to s3://dist.springsource.org/snapshot/GRECLIPSE/e4.4/plugins/org.codehaus.groovy.eclipse.refactoring_2.9.3.xx-201802021952-e44.jar
02-Feb-2018 21:17:05 Transfer Time: .2 s - Transfer Rate: 1.2 MB/s
02-Feb-2018 21:17:05 Uploading /opt/bamboo-home/xml-data/build-dir/GRECLIPSE-E44TP-JOB1/Site-org.codehaus.groovy.eclipse/target/site/plugins/org.codehaus.groovy.eclipse.ui_2.9.3.xx-201802021952-e44.jar (520.5 KB) to s3://dist.springsource.org/snapshot/GRECLIPSE/e4.4/plugins/org.codehaus.groovy.eclipse.ui_2.9.3.xx-201802021952-e44.jar
02-Feb-2018 21:17:06 Transfer Time: .3 s - Transfer Rate: 1.7 MB/s
02-Feb-2018 21:17:06 Uploading /opt/bamboo-home/xml-data/build-dir/GRECLIPSE-E44TP-JOB1/Site-org.codehaus.groovy.eclipse/target/site/plugins/org.codehaus.groovy.eclipse_2.9.3.xx-201802021952-e44.jar (16.8 KB) to s3://dist.springsource.org/snapshot/GRECLIPSE/e4.4/plugins/org.codehaus.groovy.eclipse_2.9.3.xx-201802021952-e44.jar
02-Feb-2018 21:17:06 Transfer Time: .2 s - Transfer Rate: 103.5 KB/s
02-Feb-2018 21:17:06 Uploading /opt/bamboo-home/xml-data/build-dir/GRECLIPSE-E44TP-JOB1/Site-org.codehaus.groovy.eclipse/target/site/plugins/org.codehaus.groovy.m2eclipse_2.9.3.xx-201802021952-e44.jar (14.3 KB) to s3://dist.springsource.org/snapshot/GRECLIPSE/e4.4/plugins/org.codehaus.groovy.m2eclipse_2.9.3.xx-201802021952-e44.jar
02-Feb-2018 21:17:07 Transfer Time: .2 s - Transfer Rate: 78.0 KB/s
02-Feb-2018 21:17:07 Uploading /opt/bamboo-home/xml-data/build-dir/GRECLIPSE-E44TP-JOB1/Site-org.codehaus.groovy.eclipse/target/site/plugins/org.codehaus.groovy_1.8.9.xx-201802021952-e44.jar (9.7 MB) to s3://dist.springsource.org/snapshot/GRECLIPSE/e4.4/plugins/org.codehaus.groovy_1.8.9.xx-201802021952-e44.jar
02-Feb-2018 21:17:08 Transfer Time: .6 s - Transfer Rate: 15.5 MB/s
02-Feb-2018 21:17:08 Uploading /opt/bamboo-home/xml-data/build-dir/GRECLIPSE-E44TP-JOB1/Site-org.codehaus.groovy.eclipse/target/site/plugins/org.codehaus.groovy_2.0.8.xx-201802021952-e44.jar (10.0 MB) to s3://dist.springsource.org/snapshot/GRECLIPSE/e4.4/plugins/org.codehaus.groovy_2.0.8.xx-201802021952-e44.jar
02-Feb-2018 21:17:08 Transfer Time: .5 s - Transfer Rate: 21.4 MB/s
02-Feb-2018 21:17:09 Uploading /opt/bamboo-home/xml-data/build-dir/GRECLIPSE-E44TP-JOB1/Site-org.codehaus.groovy.eclipse/target/site/plugins/org.codehaus.groovy_2.1.9.xx-201802021952-e44.jar (10.1 MB) to s3://dist.springsource.org/snapshot/GRECLIPSE/e4.4/plugins/org.codehaus.groovy_2.1.9.xx-201802021952-e44.jar
02-Feb-2018 21:17:09 Transfer Time: .5 s - Transfer Rate: 21.3 MB/s
02-Feb-2018 21:17:10 Uploading /opt/bamboo-home/xml-data/build-dir/GRECLIPSE-E44TP-JOB1/Site-org.codehaus.groovy.eclipse/target/site/plugins/org.codehaus.groovy_2.2.2.xx-201802021952-e44.jar (10.7 MB) to s3://dist.springsource.org/snapshot/GRECLIPSE/e4.4/plugins/org.codehaus.groovy_2.2.2.xx-201802021952-e44.jar
02-Feb-2018 21:17:10 Transfer Time: .5 s - Transfer Rate: 21.0 MB/s
02-Feb-2018 21:17:11 Uploading /opt/bamboo-home/xml-data/build-dir/GRECLIPSE-E44TP-JOB1/Site-org.codehaus.groovy.eclipse/target/site/plugins/org.codehaus.groovy_2.3.11.xx-201802021952-e44.jar (11.7 MB) to s3://dist.springsource.org/snapshot/GRECLIPSE/e4.4/plugins/org.codehaus.groovy_2.3.11.xx-201802021952-e44.jar
02-Feb-2018 21:17:12 Transfer Time: 1.6 s - Transfer Rate: 7.1 MB/s
02-Feb-2018 21:17:13 Uploading /opt/bamboo-home/xml-data/build-dir/GRECLIPSE-E44TP-JOB1/Site-org.codehaus.groovy.eclipse/target/site/plugins/org.codehaus.groovy_2.4.13.xx-201802021952-e44.jar (11.7 MB) to s3://dist.springsource.org/snapshot/GRECLIPSE/e4.4/plugins/org.codehaus.groovy_2.4.13.xx-201802021952-e44.jar
02-Feb-2018 21:17:13 Transfer Time: .6 s - Transfer Rate: 20.7 MB/s
02-Feb-2018 21:17:13 Uploading /opt/bamboo-home/xml-data/build-dir/GRECLIPSE-E44TP-JOB1/Site-org.codehaus.groovy.eclipse/target/site/plugins/org.codehaus.groovy_2.5.0.xx-201802021952-e44.jar (19.7 MB) to s3://dist.springsource.org/snapshot/GRECLIPSE/e4.4/plugins/org.codehaus.groovy_2.5.0.xx-201802021952-e44.jar
02-Feb-2018 21:17:14 Transfer Time: .9 s - Transfer Rate: 22.1 MB/s
02-Feb-2018 21:17:15 Uploading /opt/bamboo-home/xml-data/build-dir/GRECLIPSE-E44TP-JOB1/Site-org.codehaus.groovy.eclipse/target/site/plugins/org.eclipse.jdt.core_3.10.2.xx-201802021952-e44.jar (5.4 MB) to s3://dist.springsource.org/snapshot/GRECLIPSE/e4.4/plugins/org.eclipse.jdt.core_3.10.2.xx-201802021952-e44.jar
02-Feb-2018 21:17:15 Transfer Time: .5 s - Transfer Rate: 10.9 MB/s
02-Feb-2018 21:17:16 Uploading /opt/bamboo-home/xml-data/build-dir/GRECLIPSE-E44TP-JOB1/Site-org.codehaus.groovy.eclipse/target/site/plugins/org.eclipse.jdt.groovy.core_2.9.3.xx-201802021952-e44.jar (408.2 KB) to s3://dist.springsource.org/snapshot/GRECLIPSE/e4.4/plugins/org.eclipse.jdt.groovy.core_2.9.3.xx-201802021952-e44.jar
02-Feb-2018 21:17:16 Transfer Time: .2 s - Transfer Rate: 1.8 MB/s
02-Feb-2018 21:17:16 Uploading /opt/bamboo-home/xml-data/build-dir/GRECLIPSE-E44TP-JOB1/Site-org.codehaus.groovy.eclipse/target/site/site.xml (3.8 KB) to s3://dist.springsource.org/snapshot/GRECLIPSE/e4.4/site.xml
02-Feb-2018 21:17:16 Transfer Time: .2 s - Transfer Rate: 23.5 KB/s
02-Feb-2018 21:17:18 Uploading /opt/bamboo-home/xml-data/build-dir/GRECLIPSE-E44TP-JOB1/Site-org.codehaus.groovy.eclipse/target/site/org.codehaus.groovy-2.9.3.xx-201802021952-e44-updatesite.zip (90.8 MB) to s3://dist.springsource.org/snapshot/GRECLIPSE/e4.4/org.codehaus.groovy-2.9.3.xx-201802021952-e44-updatesite.zip
02-Feb-2018 21:17:21 Transfer Time: 3.2 s - Transfer Rate: 28.8 MB/s
02-Feb-2018 21:17:21 [INFO] Executed tasks
02-Feb-2018 21:17:21 [INFO] ------------------------------------------------------------------------
02-Feb-2018 21:17:21 [INFO] Reactor Summary:
02-Feb-2018 21:17:21 [INFO]
02-Feb-2018 21:17:21 [INFO] org.codehaus.groovy.eclipse.parent ................ SUCCESS [0.265s]
02-Feb-2018 21:17:21 [INFO] org.codehaus.groovy ............................... SUCCESS [8.084s]
02-Feb-2018 21:17:21 [INFO] org.codehaus.groovy ............................... SUCCESS [5.278s]
02-Feb-2018 21:17:21 [INFO] org.codehaus.groovy ............................... SUCCESS [4.360s]
02-Feb-2018 21:17:21 [INFO] org.codehaus.groovy ............................... SUCCESS [4.276s]
02-Feb-2018 21:17:21 [INFO] org.codehaus.groovy ............................... SUCCESS [4.954s]
02-Feb-2018 21:17:21 [INFO] org.codehaus.groovy ............................... SUCCESS [4.301s]
02-Feb-2018 21:17:21 [INFO] org.codehaus.groovy ............................... SUCCESS [5.432s]
02-Feb-2018 21:17:21 [INFO] org.codehaus.groovy.eclipse.compilerResolver ...... SUCCESS [1.028s]
02-Feb-2018 21:17:21 [INFO] org.eclipse.jdt.core .............................. SUCCESS [17.136s]
02-Feb-2018 21:17:21 [INFO] org.eclipse.jdt.groovy.core ....................... SUCCESS [2.177s]
02-Feb-2018 21:17:21 [INFO] org.codehaus.groovy.eclipse ....................... SUCCESS [0.505s]
02-Feb-2018 21:17:21 [INFO] org.codehaus.groovy.eclipse.core .................. SUCCESS [1.403s]
02-Feb-2018 21:17:21 [INFO] org.codehaus.groovy.eclipse.ant ................... SUCCESS [1.055s]
02-Feb-2018 21:17:21 [INFO] org.codehaus.groovy.eclipse.codebrowsing .......... SUCCESS [1.392s]
02-Feb-2018 21:17:21 [INFO] org.codehaus.groovy.eclipse.refactoring ........... SUCCESS [2.089s]
02-Feb-2018 21:17:21 [INFO] org.codehaus.groovy.eclipse.ui .................... SUCCESS [2.768s]
02-Feb-2018 21:17:21 [INFO] org.codehaus.groovy.eclipse.astviews .............. SUCCESS [2.742s]
02-Feb-2018 21:17:21 [INFO] org.codehaus.groovy.eclipse.codeassist.completion . SUCCESS [1.913s]
02-Feb-2018 21:17:21 [INFO] org.codehaus.groovy.eclipse.dsl ................... SUCCESS [2.330s]
02-Feb-2018 21:17:21 [INFO] org.codehaus.groovy.eclipse.quickfix .............. SUCCESS [1.678s]
02-Feb-2018 21:17:21 [INFO] org.codehaus.groovy18.feature ..................... SUCCESS [0.679s]
02-Feb-2018 21:17:21 [INFO] org.codehaus.groovy20.feature ..................... SUCCESS [0.581s]
02-Feb-2018 21:17:21 [INFO] org.codehaus.groovy21.feature ..................... SUCCESS [0.618s]
02-Feb-2018 21:17:21 [INFO] org.codehaus.groovy22.feature ..................... SUCCESS [0.579s]
02-Feb-2018 21:17:21 [INFO] org.codehaus.groovy23.feature ..................... SUCCESS [0.598s]
02-Feb-2018 21:17:21 [INFO] org.codehaus.groovy24.feature ..................... SUCCESS [0.589s]
02-Feb-2018 21:17:21 [INFO] org.codehaus.groovy25.feature ..................... SUCCESS [0.558s]
02-Feb-2018 21:17:21 [INFO] org.codehaus.groovy.jdt.patch ..................... SUCCESS [0.541s]
02-Feb-2018 21:17:21 [INFO] org.codehaus.groovy.headless.feature .............. SUCCESS [0.697s]
02-Feb-2018 21:17:21 [INFO] org.codehaus.groovy.compilerless.feature .......... SUCCESS [0.848s]
02-Feb-2018 21:17:21 [INFO] org.codehaus.groovy.eclipse.feature ............... SUCCESS [0.649s]
02-Feb-2018 21:17:21 [INFO] org.eclipse.jdt.core.tests.compiler ............... SUCCESS [7.129s]
02-Feb-2018 21:17:21 [INFO] org.eclipse.jdt.core.tests.builder ................ SUCCESS [1.600s]
02-Feb-2018 21:17:21 [INFO] org.eclipse.jdt.groovy.core.tests.compiler ........ SUCCESS [1.303s]
02-Feb-2018 21:17:21 [INFO] org.eclipse.jdt.groovy.core.tests.builder ......... SUCCESS [1.747s]
02-Feb-2018 21:17:21 [INFO] org.codehaus.groovy.eclipse.tests ................. SUCCESS [5.964s]
02-Feb-2018 21:17:21 [INFO] org.codehaus.groovy.eclipse.codeassist.completion.test  SUCCESS [2.907s]
02-Feb-2018 21:17:21 [INFO] org.codehaus.groovy.eclipse.codebrowsing.test ..... SUCCESS [2.086s]
02-Feb-2018 21:17:21 [INFO] org.codehaus.groovy.eclipse.core.test ............. SUCCESS [1.538s]
02-Feb-2018 21:17:21 [INFO] org.codehaus.groovy.eclipse.dsl.tests ............. SUCCESS [2.164s]
02-Feb-2018 21:17:21 [INFO] org.codehaus.groovy.eclipse.junit.test ............ SUCCESS [1.392s]
02-Feb-2018 21:17:21 [INFO] org.codehaus.groovy.eclipse.refactoring.test ...... SUCCESS [3.170s]
02-Feb-2018 21:17:21 [INFO] org.codehaus.groovy.eclipse.quickfix.test ......... SUCCESS [1.594s]
02-Feb-2018 21:17:21 [INFO] org.codehaus.groovy.alltests ...................... SUCCESS [1:22:20.035s]
02-Feb-2018 21:17:21 [INFO] org.codehaus.groovy.alltests.feature .............. SUCCESS [0.929s]
02-Feb-2018 21:17:21 [INFO] org.codehaus.groovy.m2eclipse ..................... SUCCESS [1.165s]
02-Feb-2018 21:17:21 [INFO] org.codehaus.groovy.m2eclipse.feature ............. SUCCESS [0.590s]
02-Feb-2018 21:17:21 [INFO] org.codehaus.groovy.eclipse.site .................. SUCCESS [47.581s]
02-Feb-2018 21:17:21 [INFO] ------------------------------------------------------------------------
02-Feb-2018 21:17:21 [INFO] BUILD SUCCESS
02-Feb-2018 21:17:21 [INFO] ------------------------------------------------------------------------
02-Feb-2018 21:17:21 [INFO] Total time: 1:27:00.760s
02-Feb-2018 21:17:21 [INFO] Finished at: Fri Feb 02 21:17:21 UTC 2018
02-Feb-2018 21:17:22 [INFO] Final Memory: 253M/817M
02-Feb-2018 21:17:22 [INFO] ------------------------------------------------------------------------
02-Feb-2018 21:17:22 Parsing test results under /opt/bamboo-home/xml-data/build-dir/GRECLIPSE-E44TP-JOB1...
02-Feb-2018 21:17:23 Finished task 'Maven 3.x' with result: Success
02-Feb-2018 21:17:23 Running post build plugin 'Docker Container Cleanup'
02-Feb-2018 21:17:23 Running post build plugin 'NCover Results Collector'
02-Feb-2018 21:17:23 Running post build plugin 'Artifactory Release Management Staging'
02-Feb-2018 21:17:23 Running post build plugin 'Artifactory Build Info Copier'
02-Feb-2018 21:17:23 Running post build plugin 'Artifactory Gradle Properties Info Copier'
02-Feb-2018 21:17:23 Running post build plugin 'Clover Results Collector'
02-Feb-2018 21:17:23 Running post build plugin 'npm Cache Cleanup'
02-Feb-2018 21:17:23 Running post build plugin 'Artifact Copier'
02-Feb-2018 21:17:23 Publishing an artifact: Zipped Update Site
02-Feb-2018 21:17:28 Finished publishing of artifact Job artifact: [Zipped Update Site], pattern: [**/*updatesite.zip] anchored at: [Site-org.codehaus.groovy.eclipse/target/site] in 5.372 s
02-Feb-2018 21:17:28 Publishing an artifact: surefire-reports
02-Feb-2018 21:17:30 Finished publishing of artifact Job artifact: [surefire-reports], pattern: [**/target/TEST-*.xml] in 1.547 s
02-Feb-2018 21:17:31 Successfully removed working directory at '/opt/bamboo-home/xml-data/build-dir/GRECLIPSE-E44TP-JOB1'
02-Feb-2018 21:17:31 Finalising the build...
02-Feb-2018 21:17:31 Stopping timer.
02-Feb-2018 21:17:31 Build GRECLIPSE-E44TP-JOB1-802 completed.
02-Feb-2018 21:17:31 Running on server: post build plugin 'NCover Results Collector'
02-Feb-2018 21:17:31 Running on server: post build plugin 'Build Hanging Detection Configuration'
02-Feb-2018 21:17:31 Running on server: post build plugin 'Clover Delta Calculator'
02-Feb-2018 21:17:31 Running on server: post build plugin 'Maven Dependencies Postprocessor'
02-Feb-2018 21:17:31 All post build plugins have finished
02-Feb-2018 21:17:31 Generating build results summary...
02-Feb-2018 21:17:32 Saving build results to disk...
02-Feb-2018 21:17:32 Logging substituted variables...
02-Feb-2018 21:17:32 Indexing build results...
02-Feb-2018 21:17:32 Finished building GRECLIPSE-E44TP-JOB1-802.