E44 build, test and publish

Build: #803 was successful

Job: Default Job was successful

Stages & jobs

  1. Default Stage

Build log

The build generated 36,374 lines of output.The output is too long and has been truncated to the last 1,000 lines. Download or view full build log

08-Mar-2018 04:23:37 testForLoop4(org.eclipse.jdt.core.groovy.tests.search.GenericInferencingTests)  Time elapsed: 0.084 sec
08-Mar-2018 04:23:37 testForLoop5(org.eclipse.jdt.core.groovy.tests.search.GenericInferencingTests)  Time elapsed: 0.085 sec
08-Mar-2018 04:23:37 testForLoop6(org.eclipse.jdt.core.groovy.tests.search.GenericInferencingTests)  Time elapsed: 0.087 sec
08-Mar-2018 04:23:37 testForLoop7(org.eclipse.jdt.core.groovy.tests.search.GenericInferencingTests)  Time elapsed: 0.09 sec
08-Mar-2018 04:23:37 testForLoop8(org.eclipse.jdt.core.groovy.tests.search.GenericInferencingTests)  Time elapsed: 0.084 sec
08-Mar-2018 04:23:37 testForLoop9(org.eclipse.jdt.core.groovy.tests.search.GenericInferencingTests)  Time elapsed: 0.096 sec
08-Mar-2018 04:23:37 testInferringRange1(org.eclipse.jdt.core.groovy.tests.search.GenericInferencingTests)  Time elapsed: 0.082 sec
08-Mar-2018 04:23:37 testInferringRange2(org.eclipse.jdt.core.groovy.tests.search.GenericInferencingTests)  Time elapsed: 0.085 sec
08-Mar-2018 04:23:37 testMapOfList(org.eclipse.jdt.core.groovy.tests.search.GenericInferencingTests)  Time elapsed: 0.094 sec
08-Mar-2018 04:23:37 testList10(org.eclipse.jdt.core.groovy.tests.search.GenericInferencingTests)  Time elapsed: 0.083 sec
08-Mar-2018 04:23:37 testForLoop11(org.eclipse.jdt.core.groovy.tests.search.GenericInferencingTests)  Time elapsed: 0.102 sec
08-Mar-2018 04:23:37 testForLoop2a(org.eclipse.jdt.core.groovy.tests.search.GenericInferencingTests)  Time elapsed: 0.089 sec
08-Mar-2018 04:23:37 testDGMClosure10(org.eclipse.jdt.core.groovy.tests.search.GenericInferencingTests)  Time elapsed: 0.083 sec
08-Mar-2018 04:23:37 testDGMClosure11(org.eclipse.jdt.core.groovy.tests.search.GenericInferencingTests)  Time elapsed: 0.091 sec
08-Mar-2018 04:23:37 testDGMClosure12(org.eclipse.jdt.core.groovy.tests.search.GenericInferencingTests)  Time elapsed: 0.105 sec
08-Mar-2018 04:23:37 testDGMClosure13(org.eclipse.jdt.core.groovy.tests.search.GenericInferencingTests)  Time elapsed: 0.094 sec
08-Mar-2018 04:23:37 testDGMClosure14(org.eclipse.jdt.core.groovy.tests.search.GenericInferencingTests)  Time elapsed: 0.109 sec
08-Mar-2018 04:23:37 testDGMClosure15(org.eclipse.jdt.core.groovy.tests.search.GenericInferencingTests)  Time elapsed: 0.091 sec
08-Mar-2018 04:23:37 testDGMClosure16(org.eclipse.jdt.core.groovy.tests.search.GenericInferencingTests)  Time elapsed: 0.096 sec
08-Mar-2018 04:23:37 testDGMClosure17(org.eclipse.jdt.core.groovy.tests.search.GenericInferencingTests)  Time elapsed: 0.092 sec
08-Mar-2018 04:23:37 testDGMClosure18(org.eclipse.jdt.core.groovy.tests.search.GenericInferencingTests)  Time elapsed: 0.092 sec
08-Mar-2018 04:23:37 testDGMClosure19(org.eclipse.jdt.core.groovy.tests.search.GenericInferencingTests)  Time elapsed: 0.088 sec
08-Mar-2018 04:23:37 testDGMClosure20(org.eclipse.jdt.core.groovy.tests.search.GenericInferencingTests)  Time elapsed: 0.086 sec
08-Mar-2018 04:23:37 testDGMClosure21(org.eclipse.jdt.core.groovy.tests.search.GenericInferencingTests)  Time elapsed: 0.09 sec
08-Mar-2018 04:23:37 testDGMClosure22(org.eclipse.jdt.core.groovy.tests.search.GenericInferencingTests)  Time elapsed: 0.088 sec
08-Mar-2018 04:23:37 testDGMClosure23(org.eclipse.jdt.core.groovy.tests.search.GenericInferencingTests)  Time elapsed: 0.086 sec
08-Mar-2018 04:23:37 testClosure1(org.eclipse.jdt.core.groovy.tests.search.GenericInferencingTests)  Time elapsed: 0.089 sec
08-Mar-2018 04:23:37 testClosure2(org.eclipse.jdt.core.groovy.tests.search.GenericInferencingTests)  Time elapsed: 0.083 sec
08-Mar-2018 04:23:37 testClosure3(org.eclipse.jdt.core.groovy.tests.search.GenericInferencingTests)  Time elapsed: 0.089 sec
08-Mar-2018 04:23:37 testClosure4(org.eclipse.jdt.core.groovy.tests.search.GenericInferencingTests)  Time elapsed: 0.104 sec
08-Mar-2018 04:23:37 testInferringList1(org.eclipse.jdt.core.groovy.tests.search.GenericInferencingTests)  Time elapsed: 0.086 sec
08-Mar-2018 04:23:37 testInferringList2(org.eclipse.jdt.core.groovy.tests.search.GenericInferencingTests)  Time elapsed: 0.093 sec
08-Mar-2018 04:23:37 testInferringList3(org.eclipse.jdt.core.groovy.tests.search.GenericInferencingTests)  Time elapsed: 0.1 sec
08-Mar-2018 04:23:37 testMapOfList2(org.eclipse.jdt.core.groovy.tests.search.GenericInferencingTests)  Time elapsed: 0.087 sec
08-Mar-2018 04:23:37 testMapOfList3(org.eclipse.jdt.core.groovy.tests.search.GenericInferencingTests)  Time elapsed: 0.087 sec
08-Mar-2018 04:23:37 testMapOfList4(org.eclipse.jdt.core.groovy.tests.search.GenericInferencingTests)  Time elapsed: 0.085 sec
08-Mar-2018 04:23:37 testMapOfList5(org.eclipse.jdt.core.groovy.tests.search.GenericInferencingTests)  Time elapsed: 0.088 sec
08-Mar-2018 04:23:37 testMapOfList6(org.eclipse.jdt.core.groovy.tests.search.GenericInferencingTests)  Time elapsed: 0.091 sec
08-Mar-2018 04:23:37 testMapOfList7(org.eclipse.jdt.core.groovy.tests.search.GenericInferencingTests)  Time elapsed: 0.092 sec
08-Mar-2018 04:23:37 testGenericsMapper(org.eclipse.jdt.core.groovy.tests.search.GenericsMappingTests)  Time elapsed: 0.081 sec
08-Mar-2018 04:23:37 testCompileStatic10(org.eclipse.jdt.core.groovy.tests.search.Groovy20InferencingTests)  Time elapsed: 0.12 sec
08-Mar-2018 04:23:37 testCompileStatic1(org.eclipse.jdt.core.groovy.tests.search.Groovy20InferencingTests)  Time elapsed: 0.096 sec
08-Mar-2018 04:23:37 testCompileStatic2(org.eclipse.jdt.core.groovy.tests.search.Groovy20InferencingTests)  Time elapsed: 0.084 sec
08-Mar-2018 04:23:37 testCompileStatic3(org.eclipse.jdt.core.groovy.tests.search.Groovy20InferencingTests)  Time elapsed: 0.089 sec
08-Mar-2018 04:23:37 testCompileStatic4(org.eclipse.jdt.core.groovy.tests.search.Groovy20InferencingTests)  Time elapsed: 0.093 sec
08-Mar-2018 04:23:37 testCompileStatic5(org.eclipse.jdt.core.groovy.tests.search.Groovy20InferencingTests)  Time elapsed: 0.087 sec
08-Mar-2018 04:23:37 testCompileStatic6(org.eclipse.jdt.core.groovy.tests.search.Groovy20InferencingTests)  Time elapsed: 0.097 sec
08-Mar-2018 04:23:37 testCompileStatic7(org.eclipse.jdt.core.groovy.tests.search.Groovy20InferencingTests)  Time elapsed: 0.096 sec
08-Mar-2018 04:23:37 testCompileStatic8(org.eclipse.jdt.core.groovy.tests.search.Groovy20InferencingTests)  Time elapsed: 0.108 sec
08-Mar-2018 04:23:37 testCompileStatic9(org.eclipse.jdt.core.groovy.tests.search.Groovy20InferencingTests)  Time elapsed: 0.095 sec
08-Mar-2018 04:23:37 testTypeChecked1(org.eclipse.jdt.core.groovy.tests.search.Groovy20InferencingTests)  Time elapsed: 0.091 sec
08-Mar-2018 04:23:37 testTypeChecked2(org.eclipse.jdt.core.groovy.tests.search.Groovy20InferencingTests)  Time elapsed: 0.089 sec
08-Mar-2018 04:23:37 testTypeChecked3(org.eclipse.jdt.core.groovy.tests.search.Groovy20InferencingTests)  Time elapsed: 0.09 sec
08-Mar-2018 04:23:37 testTypeChecked4(org.eclipse.jdt.core.groovy.tests.search.Groovy20InferencingTests)  Time elapsed: 0.089 sec
08-Mar-2018 04:23:37 testTypeChecked5(org.eclipse.jdt.core.groovy.tests.search.Groovy20InferencingTests)  Time elapsed: 0.094 sec
08-Mar-2018 04:23:37 testTypeChecked6(org.eclipse.jdt.core.groovy.tests.search.Groovy20InferencingTests)  Time elapsed: 0.09 sec
08-Mar-2018 04:23:37 testTypeChecked7(org.eclipse.jdt.core.groovy.tests.search.Groovy20InferencingTests)  Time elapsed: 0.095 sec
08-Mar-2018 04:23:37 testTypeChecked8(org.eclipse.jdt.core.groovy.tests.search.Groovy20InferencingTests)  Time elapsed: 0.098 sec
08-Mar-2018 04:23:37 testTypeCheckingExtension(org.eclipse.jdt.core.groovy.tests.search.Groovy21InferencingTests)  Time elapsed: 0.577 sec
08-Mar-2018 04:23:37 testDelegatesToTarget1(org.eclipse.jdt.core.groovy.tests.search.Groovy21InferencingTests)  Time elapsed: 0.14 sec
08-Mar-2018 04:23:37 testDelegatesToTarget2(org.eclipse.jdt.core.groovy.tests.search.Groovy21InferencingTests)  Time elapsed: 0.141 sec
08-Mar-2018 04:23:37 testDelegatesToTarget3(org.eclipse.jdt.core.groovy.tests.search.Groovy21InferencingTests)  Time elapsed: 0.199 sec
08-Mar-2018 04:23:37 testDelegatesToTarget4(org.eclipse.jdt.core.groovy.tests.search.Groovy21InferencingTests)  Time elapsed: 0.141 sec
08-Mar-2018 04:23:37 testDelegatesToTarget5(org.eclipse.jdt.core.groovy.tests.search.Groovy21InferencingTests)  Time elapsed: 0.141 sec
08-Mar-2018 04:23:37 testDelegatesToValue2(org.eclipse.jdt.core.groovy.tests.search.Groovy21InferencingTests)  Time elapsed: 0.096 sec
08-Mar-2018 04:23:37 testDelegatesToValue3(org.eclipse.jdt.core.groovy.tests.search.Groovy21InferencingTests)  Time elapsed: 0.098 sec
08-Mar-2018 04:23:37 testDelegatesToValue4(org.eclipse.jdt.core.groovy.tests.search.Groovy21InferencingTests)  Time elapsed: 0.098 sec
08-Mar-2018 04:23:37 testDelegatesToValue5(org.eclipse.jdt.core.groovy.tests.search.Groovy21InferencingTests)  Time elapsed: 0.097 sec
08-Mar-2018 04:23:37 testDelegatesToValue6(org.eclipse.jdt.core.groovy.tests.search.Groovy21InferencingTests)  Time elapsed: 0.097 sec
08-Mar-2018 04:23:37 testDelegatesToValue(org.eclipse.jdt.core.groovy.tests.search.Groovy21InferencingTests)  Time elapsed: 0.097 sec
08-Mar-2018 04:23:37 testEnumOverrides(org.eclipse.jdt.core.groovy.tests.search.Groovy21InferencingTests)  Time elapsed: 0.102 sec
08-Mar-2018 04:23:37 testEnumOverrides2(org.eclipse.jdt.core.groovy.tests.search.Groovy21InferencingTests)  Time elapsed: 0.13 sec
08-Mar-2018 04:23:37 testFieldAndPropertyWithSameName(org.eclipse.jdt.core.groovy.tests.search.InferencingTests)  Time elapsed: 0.093 sec
08-Mar-2018 04:23:37 testObjectMethodOnInterface(org.eclipse.jdt.core.groovy.tests.search.InferencingTests)  Time elapsed: 0.088 sec
08-Mar-2018 04:23:37 testNothingIsUnknown(org.eclipse.jdt.core.groovy.tests.search.InferencingTests)  Time elapsed: 0.089 sec
08-Mar-2018 04:23:37 testInnerClass1(org.eclipse.jdt.core.groovy.tests.search.InferencingTests)  Time elapsed: 0.092 sec
08-Mar-2018 04:23:37 testInnerClass2(org.eclipse.jdt.core.groovy.tests.search.InferencingTests)  Time elapsed: 0.119 sec
08-Mar-2018 04:23:37 testInnerClass3(org.eclipse.jdt.core.groovy.tests.search.InferencingTests)  Time elapsed: 0.089 sec
08-Mar-2018 04:23:37 testInnerClass4(org.eclipse.jdt.core.groovy.tests.search.InferencingTests)  Time elapsed: 0.093 sec
08-Mar-2018 04:23:37 testInnerClass5(org.eclipse.jdt.core.groovy.tests.search.InferencingTests)  Time elapsed: 0.088 sec
08-Mar-2018 04:23:37 testInnerClass6(org.eclipse.jdt.core.groovy.tests.search.InferencingTests)  Time elapsed: 0.094 sec
08-Mar-2018 04:23:37 testInnerClass7(org.eclipse.jdt.core.groovy.tests.search.InferencingTests)  Time elapsed: 0.147 sec
08-Mar-2018 04:23:37 testInnerClass8(org.eclipse.jdt.core.groovy.tests.search.InferencingTests)  Time elapsed: 0.15 sec
08-Mar-2018 04:23:37 testInnerClass9(org.eclipse.jdt.core.groovy.tests.search.InferencingTests)  Time elapsed: 0.112 sec
08-Mar-2018 04:23:37 testBoolean1(org.eclipse.jdt.core.groovy.tests.search.InferencingTests)  Time elapsed: 0.093 sec
08-Mar-2018 04:23:37 testBoolean2(org.eclipse.jdt.core.groovy.tests.search.InferencingTests)  Time elapsed: 0.086 sec
08-Mar-2018 04:23:37 testBoolean3(org.eclipse.jdt.core.groovy.tests.search.InferencingTests)  Time elapsed: 0.091 sec
08-Mar-2018 04:23:37 testBoolean4(org.eclipse.jdt.core.groovy.tests.search.InferencingTests)  Time elapsed: 0.093 sec
08-Mar-2018 04:23:37 testBoolean5(org.eclipse.jdt.core.groovy.tests.search.InferencingTests)  Time elapsed: 0.09 sec
08-Mar-2018 04:23:37 testBoolean6(org.eclipse.jdt.core.groovy.tests.search.InferencingTests)  Time elapsed: 0.088 sec
08-Mar-2018 04:23:37 testBoolean7(org.eclipse.jdt.core.groovy.tests.search.InferencingTests)  Time elapsed: 0.092 sec
08-Mar-2018 04:23:37 testDeclarationAtBeginningOfMethod(org.eclipse.jdt.core.groovy.tests.search.InferencingTests)  Time elapsed: 0.092 sec
08-Mar-2018 04:23:37 testLocalTypeAndDefaultImportCollision(org.eclipse.jdt.core.groovy.tests.search.InferencingTests)  Time elapsed: 0.111 sec
08-Mar-2018 04:23:37 testSuperClassMethod(org.eclipse.jdt.core.groovy.tests.search.InferencingTests)  Time elapsed: 0.109 sec
08-Mar-2018 04:23:37 testGRECLIPSE731a(org.eclipse.jdt.core.groovy.tests.search.InferencingTests)  Time elapsed: 0.088 sec
08-Mar-2018 04:23:37 testGRECLIPSE731b(org.eclipse.jdt.core.groovy.tests.search.InferencingTests)  Time elapsed: 0.087 sec
08-Mar-2018 04:23:37 testGRECLIPSE731c(org.eclipse.jdt.core.groovy.tests.search.InferencingTests)  Time elapsed: 0.113 sec
08-Mar-2018 04:23:37 testGRECLIPSE731d(org.eclipse.jdt.core.groovy.tests.search.InferencingTests)  Time elapsed: 0.081 sec
08-Mar-2018 04:23:37 testGRECLIPSE731e(org.eclipse.jdt.core.groovy.tests.search.InferencingTests)  Time elapsed: 0.088 sec
08-Mar-2018 04:23:37 testGRECLIPSE731f(org.eclipse.jdt.core.groovy.tests.search.InferencingTests)  Time elapsed: 0.087 sec
08-Mar-2018 04:23:37 testSpecialConstructor1(org.eclipse.jdt.core.groovy.tests.search.InferencingTests)  Time elapsed: 0.094 sec
08-Mar-2018 04:23:37 testSpecialConstructor2(org.eclipse.jdt.core.groovy.tests.search.InferencingTests)  Time elapsed: 0.108 sec
08-Mar-2018 04:23:37 testInnerClass10(org.eclipse.jdt.core.groovy.tests.search.InferencingTests)  Time elapsed: 0.112 sec
08-Mar-2018 04:23:37 testInnerClass11(org.eclipse.jdt.core.groovy.tests.search.InferencingTests)  Time elapsed: 0.11 sec
08-Mar-2018 04:23:37 testMultiDecl10(org.eclipse.jdt.core.groovy.tests.search.InferencingTests)  Time elapsed: 0.122 sec
08-Mar-2018 04:23:37 testMultiDecl11(org.eclipse.jdt.core.groovy.tests.search.InferencingTests)  Time elapsed: 0.099 sec
08-Mar-2018 04:23:37 testMultiDecl12(org.eclipse.jdt.core.groovy.tests.search.InferencingTests)  Time elapsed: 0.108 sec
08-Mar-2018 04:23:37 testMultiDecl13(org.eclipse.jdt.core.groovy.tests.search.InferencingTests)  Time elapsed: 0.102 sec
08-Mar-2018 04:23:37 testAssignementInInnerBlock(org.eclipse.jdt.core.groovy.tests.search.InferencingTests)  Time elapsed: 0.103 sec
08-Mar-2018 04:23:37 testConstantFromSuper(org.eclipse.jdt.core.groovy.tests.search.InferencingTests)  Time elapsed: 0.091 sec
08-Mar-2018 04:23:37 testAsExpression1(org.eclipse.jdt.core.groovy.tests.search.InferencingTests)  Time elapsed: 0.087 sec
08-Mar-2018 04:23:37 testAsExpression2(org.eclipse.jdt.core.groovy.tests.search.InferencingTests)  Time elapsed: 0.106 sec
08-Mar-2018 04:23:37 testSuperClassMethod2(org.eclipse.jdt.core.groovy.tests.search.InferencingTests)  Time elapsed: 0.104 sec
08-Mar-2018 04:23:37 testNumber1a(org.eclipse.jdt.core.groovy.tests.search.InferencingTests)  Time elapsed: 0.078 sec
08-Mar-2018 04:23:37 testDGM1(org.eclipse.jdt.core.groovy.tests.search.InferencingTests)  Time elapsed: 0.09 sec
08-Mar-2018 04:23:37 testDGM2(org.eclipse.jdt.core.groovy.tests.search.InferencingTests)  Time elapsed: 0.086 sec
08-Mar-2018 04:23:37 testDGM3(org.eclipse.jdt.core.groovy.tests.search.InferencingTests)  Time elapsed: 0.086 sec
08-Mar-2018 04:23:37 testRangeExpression1(org.eclipse.jdt.core.groovy.tests.search.InferencingTests)  Time elapsed: 0.088 sec
08-Mar-2018 04:23:37 testRangeExpression2(org.eclipse.jdt.core.groovy.tests.search.InferencingTests)  Time elapsed: 0.091 sec
08-Mar-2018 04:23:37 testRangeExpression3(org.eclipse.jdt.core.groovy.tests.search.InferencingTests)  Time elapsed: 0.087 sec
08-Mar-2018 04:23:37 testRangeExpression4(org.eclipse.jdt.core.groovy.tests.search.InferencingTests)  Time elapsed: 0.087 sec
08-Mar-2018 04:23:37 testRangeExpression5(org.eclipse.jdt.core.groovy.tests.search.InferencingTests)  Time elapsed: 0.086 sec
08-Mar-2018 04:23:37 testRangeExpression6(org.eclipse.jdt.core.groovy.tests.search.InferencingTests)  Time elapsed: 0.089 sec
08-Mar-2018 04:23:37 testSpread10(org.eclipse.jdt.core.groovy.tests.search.InferencingTests)  Time elapsed: 0.088 sec
08-Mar-2018 04:23:37 testSpread11(org.eclipse.jdt.core.groovy.tests.search.InferencingTests)  Time elapsed: 0.099 sec
08-Mar-2018 04:23:37 testSpread12(org.eclipse.jdt.core.groovy.tests.search.InferencingTests)  Time elapsed: 0.092 sec
08-Mar-2018 04:23:37 testSpread13(org.eclipse.jdt.core.groovy.tests.search.InferencingTests)  Time elapsed: 0.116 sec
08-Mar-2018 04:23:37 testStaticThisAndSuper2(org.eclipse.jdt.core.groovy.tests.search.InferencingTests)  Time elapsed: 0.101 sec
08-Mar-2018 04:23:37 testConstructor1(org.eclipse.jdt.core.groovy.tests.search.InferencingTests)  Time elapsed: 0.186 sec
08-Mar-2018 04:23:37 testConstructor2(org.eclipse.jdt.core.groovy.tests.search.InferencingTests)  Time elapsed: 0.166 sec
08-Mar-2018 04:23:37 testConstructor3(org.eclipse.jdt.core.groovy.tests.search.InferencingTests)  Time elapsed: 0.119 sec
08-Mar-2018 04:23:37 testConstructor4(org.eclipse.jdt.core.groovy.tests.search.InferencingTests)  Time elapsed: 0.146 sec
08-Mar-2018 04:23:37 testConstructor5(org.eclipse.jdt.core.groovy.tests.search.InferencingTests)  Time elapsed: 0.132 sec
08-Mar-2018 04:23:37 testConstructor6(org.eclipse.jdt.core.groovy.tests.search.InferencingTests)  Time elapsed: 0.134 sec
08-Mar-2018 04:23:37 testInterfaceMethodsAsProperty(org.eclipse.jdt.core.groovy.tests.search.InferencingTests)  Time elapsed: 0.119 sec
08-Mar-2018 04:23:37 testPostfix(org.eclipse.jdt.core.groovy.tests.search.InferencingTests)  Time elapsed: 0.084 sec
08-Mar-2018 04:23:37 testListSort1(org.eclipse.jdt.core.groovy.tests.search.InferencingTests)  Time elapsed: 0.099 sec
08-Mar-2018 04:23:37 testListSort2(org.eclipse.jdt.core.groovy.tests.search.InferencingTests)  Time elapsed: 0.124 sec
08-Mar-2018 04:23:37 testListSort3(org.eclipse.jdt.core.groovy.tests.search.InferencingTests)  Time elapsed: 0.108 sec
08-Mar-2018 04:23:37 testLocalVar1(org.eclipse.jdt.core.groovy.tests.search.InferencingTests)  Time elapsed: 0.088 sec
08-Mar-2018 04:23:37 testLocalVar2(org.eclipse.jdt.core.groovy.tests.search.InferencingTests)  Time elapsed: 0.095 sec
08-Mar-2018 04:23:37 testLocalVar3(org.eclipse.jdt.core.groovy.tests.search.InferencingTests)  Time elapsed: 0.089 sec
08-Mar-2018 04:23:37 testLocalVar4(org.eclipse.jdt.core.groovy.tests.search.InferencingTests)  Time elapsed: 0.115 sec
08-Mar-2018 04:23:37 testIndirectInterfaceMethod(org.eclipse.jdt.core.groovy.tests.search.InferencingTests)  Time elapsed: 0.156 sec
08-Mar-2018 04:23:37 testMapLiteral(org.eclipse.jdt.core.groovy.tests.search.InferencingTests)  Time elapsed: 0.09 sec
08-Mar-2018 04:23:37 testListRemove(org.eclipse.jdt.core.groovy.tests.search.InferencingTests)  Time elapsed: 0.113 sec
08-Mar-2018 04:23:37 testCategoryMethodAsProperty(org.eclipse.jdt.core.groovy.tests.search.InferencingTests)  Time elapsed: 0.089 sec
08-Mar-2018 04:23:37 testNothingIsUnknownWithCategories(org.eclipse.jdt.core.groovy.tests.search.InferencingTests)  Time elapsed: 0.103 sec
08-Mar-2018 04:23:37 testImplicitVar1(org.eclipse.jdt.core.groovy.tests.search.InferencingTests)  Time elapsed: 0.094 sec
08-Mar-2018 04:23:37 testImplicitVar2(org.eclipse.jdt.core.groovy.tests.search.InferencingTests)  Time elapsed: 0.094 sec
08-Mar-2018 04:23:37 testImplicitVar3(org.eclipse.jdt.core.groovy.tests.search.InferencingTests)  Time elapsed: 0.098 sec
08-Mar-2018 04:23:37 testImplicitVar4(org.eclipse.jdt.core.groovy.tests.search.InferencingTests)  Time elapsed: 0.09 sec
08-Mar-2018 04:23:37 testImplicitVar5(org.eclipse.jdt.core.groovy.tests.search.InferencingTests)  Time elapsed: 0.107 sec
08-Mar-2018 04:23:37 testImplicitVar6(org.eclipse.jdt.core.groovy.tests.search.InferencingTests)  Time elapsed: 0.099 sec
08-Mar-2018 04:23:37 testImplicitVar7(org.eclipse.jdt.core.groovy.tests.search.InferencingTests)  Time elapsed: 0.115 sec
08-Mar-2018 04:23:37 testClassLiteral1(org.eclipse.jdt.core.groovy.tests.search.InferencingTests)  Time elapsed: 0.103 sec
08-Mar-2018 04:23:37 testClassLiteral2(org.eclipse.jdt.core.groovy.tests.search.InferencingTests)  Time elapsed: 0.107 sec
08-Mar-2018 04:23:37 testClassLiteral3(org.eclipse.jdt.core.groovy.tests.search.InferencingTests)  Time elapsed: 0.094 sec
08-Mar-2018 04:23:37 testClassLiteral4(org.eclipse.jdt.core.groovy.tests.search.InferencingTests)  Time elapsed: 0.1 sec
08-Mar-2018 04:23:37 testClassLiteral5(org.eclipse.jdt.core.groovy.tests.search.InferencingTests)  Time elapsed: 0.113 sec
08-Mar-2018 04:23:37 testScriptDeclaringType(org.eclipse.jdt.core.groovy.tests.search.InferencingTests)  Time elapsed: 0.098 sec
08-Mar-2018 04:23:37 testInstanceOf10(org.eclipse.jdt.core.groovy.tests.search.InferencingTests)  Time elapsed: 0.161 sec
08-Mar-2018 04:23:37 testInstanceOf1a(org.eclipse.jdt.core.groovy.tests.search.InferencingTests)  Time elapsed: 0.183 sec
08-Mar-2018 04:23:37 testInstanceOf1b(org.eclipse.jdt.core.groovy.tests.search.InferencingTests)  Time elapsed: 0.19 sec
08-Mar-2018 04:23:37 testStaticImports1(org.eclipse.jdt.core.groovy.tests.search.InferencingTests)  Time elapsed: 0.105 sec
08-Mar-2018 04:23:37 testStaticImports2(org.eclipse.jdt.core.groovy.tests.search.InferencingTests)  Time elapsed: 0.094 sec
08-Mar-2018 04:23:37 testStaticImports3(org.eclipse.jdt.core.groovy.tests.search.InferencingTests)  Time elapsed: 0.095 sec
08-Mar-2018 04:23:37 testStaticImports4(org.eclipse.jdt.core.groovy.tests.search.InferencingTests)  Time elapsed: 0.122 sec
08-Mar-2018 04:23:37 testElvisOperator(org.eclipse.jdt.core.groovy.tests.search.InferencingTests)  Time elapsed: 0.095 sec
08-Mar-2018 04:23:37 testMultiDecl1(org.eclipse.jdt.core.groovy.tests.search.InferencingTests)  Time elapsed: 0.116 sec
08-Mar-2018 04:23:37 testMultiDecl2(org.eclipse.jdt.core.groovy.tests.search.InferencingTests)  Time elapsed: 0.124 sec
08-Mar-2018 04:23:37 testMultiDecl3(org.eclipse.jdt.core.groovy.tests.search.InferencingTests)  Time elapsed: 0.114 sec
08-Mar-2018 04:23:37 testMultiDecl4(org.eclipse.jdt.core.groovy.tests.search.InferencingTests)  Time elapsed: 0.112 sec
08-Mar-2018 04:23:37 testMultiDecl6(org.eclipse.jdt.core.groovy.tests.search.InferencingTests)  Time elapsed: 0.114 sec
08-Mar-2018 04:23:37 testMultiDecl7(org.eclipse.jdt.core.groovy.tests.search.InferencingTests)  Time elapsed: 0.14 sec
08-Mar-2018 04:23:37 testMultiDecl8(org.eclipse.jdt.core.groovy.tests.search.InferencingTests)  Time elapsed: 0.127 sec
08-Mar-2018 04:23:37 testMultiDecl9(org.eclipse.jdt.core.groovy.tests.search.InferencingTests)  Time elapsed: 0.124 sec
08-Mar-2018 04:23:37 testStaticThisAndSuper(org.eclipse.jdt.core.groovy.tests.search.InferencingTests)  Time elapsed: 0.108 sec
08-Mar-2018 04:23:37 testLocalMethod1(org.eclipse.jdt.core.groovy.tests.search.InferencingTests)  Time elapsed: 0.1 sec
08-Mar-2018 04:23:37 testLocalMethod2(org.eclipse.jdt.core.groovy.tests.search.InferencingTests)  Time elapsed: 0.101 sec
08-Mar-2018 04:23:37 testLocalMethod3(org.eclipse.jdt.core.groovy.tests.search.InferencingTests)  Time elapsed: 0.099 sec
08-Mar-2018 04:23:37 testLocalMethod4(org.eclipse.jdt.core.groovy.tests.search.InferencingTests)  Time elapsed: 0.106 sec
08-Mar-2018 04:23:37 testLocalMethod5(org.eclipse.jdt.core.groovy.tests.search.InferencingTests)  Time elapsed: 0.1 sec
08-Mar-2018 04:23:37 testLocalMethod6(org.eclipse.jdt.core.groovy.tests.search.InferencingTests)  Time elapsed: 0.089 sec
08-Mar-2018 04:23:37 testLocalMethod7(org.eclipse.jdt.core.groovy.tests.search.InferencingTests)  Time elapsed: 0.097 sec
08-Mar-2018 04:23:37 testLocalVar2a(org.eclipse.jdt.core.groovy.tests.search.InferencingTests)  Time elapsed: 0.102 sec
08-Mar-2018 04:23:37 testNoGString(org.eclipse.jdt.core.groovy.tests.search.InferencingTests)  Time elapsed: 0.088 sec
08-Mar-2018 04:23:37 testMapEntries1(org.eclipse.jdt.core.groovy.tests.search.InferencingTests)  Time elapsed: 0.122 sec
08-Mar-2018 04:23:37 testObjectMethodOnInterfaceAsProperty(org.eclipse.jdt.core.groovy.tests.search.InferencingTests)  Time elapsed: 0.092 sec
08-Mar-2018 04:23:37 testMatcher1(org.eclipse.jdt.core.groovy.tests.search.InferencingTests)  Time elapsed: 0.087 sec
08-Mar-2018 04:23:37 testMatcher2(org.eclipse.jdt.core.groovy.tests.search.InferencingTests)  Time elapsed: 0.087 sec
08-Mar-2018 04:23:37 testSuperFieldReference(org.eclipse.jdt.core.groovy.tests.search.InferencingTests)  Time elapsed: 0.113 sec
08-Mar-2018 04:23:37 testAssignementInInnerBlock2(org.eclipse.jdt.core.groovy.tests.search.InferencingTests)  Time elapsed: 0.083 sec
08-Mar-2018 04:23:37 testAssignment1(org.eclipse.jdt.core.groovy.tests.search.InferencingTests)  Time elapsed: 0.101 sec
08-Mar-2018 04:23:37 testAssignment2(org.eclipse.jdt.core.groovy.tests.search.InferencingTests)  Time elapsed: 0.091 sec
08-Mar-2018 04:23:37 testAssignment3(org.eclipse.jdt.core.groovy.tests.search.InferencingTests)  Time elapsed: 0.105 sec
08-Mar-2018 04:23:37 testAssignment4(org.eclipse.jdt.core.groovy.tests.search.InferencingTests)  Time elapsed: 0.106 sec
08-Mar-2018 04:23:37 testAssignment5(org.eclipse.jdt.core.groovy.tests.search.InferencingTests)  Time elapsed: 0.095 sec
08-Mar-2018 04:23:37 testStaticMethodCall2(org.eclipse.jdt.core.groovy.tests.search.InferencingTests)  Time elapsed: 0.102 sec
08-Mar-2018 04:23:37 testStaticMethodCall3(org.eclipse.jdt.core.groovy.tests.search.InferencingTests)  Time elapsed: 0.099 sec
08-Mar-2018 04:23:37 testStaticMethodCall4(org.eclipse.jdt.core.groovy.tests.search.InferencingTests)  Time elapsed: 0.101 sec
08-Mar-2018 04:23:37 testStaticMethodCall5(org.eclipse.jdt.core.groovy.tests.search.InferencingTests)  Time elapsed: 0.1 sec
08-Mar-2018 04:23:37 testStaticMethodCall6(org.eclipse.jdt.core.groovy.tests.search.InferencingTests)  Time elapsed: 0.121 sec
08-Mar-2018 04:23:37 testStaticMethodCall7(org.eclipse.jdt.core.groovy.tests.search.InferencingTests)  Time elapsed: 0.116 sec
08-Mar-2018 04:23:37 testStaticMethodCall8(org.eclipse.jdt.core.groovy.tests.search.InferencingTests)  Time elapsed: 0.111 sec
08-Mar-2018 04:23:37 testStaticMethodCall9(org.eclipse.jdt.core.groovy.tests.search.InferencingTests)  Time elapsed: 0.116 sec
08-Mar-2018 04:23:37 testCatchBlock1(org.eclipse.jdt.core.groovy.tests.search.InferencingTests)  Time elapsed: 0.132 sec
08-Mar-2018 04:23:37 testCatchBlock2(org.eclipse.jdt.core.groovy.tests.search.InferencingTests)  Time elapsed: 0.134 sec
08-Mar-2018 04:23:37 testCatchBlock3(org.eclipse.jdt.core.groovy.tests.search.InferencingTests)  Time elapsed: 0.1 sec
08-Mar-2018 04:23:37 testCatchBlock4(org.eclipse.jdt.core.groovy.tests.search.InferencingTests)  Time elapsed: 0.12 sec
08-Mar-2018 04:23:37 testCatchBlock5(org.eclipse.jdt.core.groovy.tests.search.InferencingTests)  Time elapsed: 0.11 sec
08-Mar-2018 04:23:37 testTernaryExpression(org.eclipse.jdt.core.groovy.tests.search.InferencingTests)  Time elapsed: 0.092 sec
08-Mar-2018 04:23:37 testInterfaceMethodAsProperty2(org.eclipse.jdt.core.groovy.tests.search.InferencingTests)  Time elapsed: 0.137 sec
08-Mar-2018 04:23:37 testInterfaceMethodAsProperty3(org.eclipse.jdt.core.groovy.tests.search.InferencingTests)  Time elapsed: 0.147 sec
08-Mar-2018 04:23:37 testGetAt1(org.eclipse.jdt.core.groovy.tests.search.InferencingTests)  Time elapsed: 0.114 sec
08-Mar-2018 04:23:37 testGetAt2(org.eclipse.jdt.core.groovy.tests.search.InferencingTests)  Time elapsed: 0.137 sec
08-Mar-2018 04:23:37 testGetAt3(org.eclipse.jdt.core.groovy.tests.search.InferencingTests)  Time elapsed: 0.133 sec
08-Mar-2018 04:23:37 testGetAt4(org.eclipse.jdt.core.groovy.tests.search.InferencingTests)  Time elapsed: 0.121 sec
08-Mar-2018 04:23:37 testGetAt5(org.eclipse.jdt.core.groovy.tests.search.InferencingTests)  Time elapsed: 0.114 sec
08-Mar-2018 04:23:37 testGetAt6(org.eclipse.jdt.core.groovy.tests.search.InferencingTests)  Time elapsed: 0.124 sec
08-Mar-2018 04:23:37 testGetAt7(org.eclipse.jdt.core.groovy.tests.search.InferencingTests)  Time elapsed: 0.135 sec
08-Mar-2018 04:23:37 testFieldWithInitializer1(org.eclipse.jdt.core.groovy.tests.search.InferencingTests)  Time elapsed: 0.128 sec
08-Mar-2018 04:23:37 testFieldWithInitializer2(org.eclipse.jdt.core.groovy.tests.search.InferencingTests)  Time elapsed: 0.114 sec
08-Mar-2018 04:23:37 testNested1(org.eclipse.jdt.core.groovy.tests.search.InferencingTests)  Time elapsed: 0.114 sec
08-Mar-2018 04:23:37 testNested2(org.eclipse.jdt.core.groovy.tests.search.InferencingTests)  Time elapsed: 0.126 sec
08-Mar-2018 04:23:37 testNested3(org.eclipse.jdt.core.groovy.tests.search.InferencingTests)  Time elapsed: 0.12 sec
08-Mar-2018 04:23:37 testNested4(org.eclipse.jdt.core.groovy.tests.search.InferencingTests)  Time elapsed: 0.158 sec
08-Mar-2018 04:23:37 testIndirectInterfaceConstant(org.eclipse.jdt.core.groovy.tests.search.InferencingTests)  Time elapsed: 0.16 sec
08-Mar-2018 04:23:37 testInstanceOf1(org.eclipse.jdt.core.groovy.tests.search.InferencingTests)  Time elapsed: 0.157 sec
08-Mar-2018 04:23:37 testInstanceOf2(org.eclipse.jdt.core.groovy.tests.search.InferencingTests)  Time elapsed: 0.157 sec
08-Mar-2018 04:23:37 testInstanceOf3(org.eclipse.jdt.core.groovy.tests.search.InferencingTests)  Time elapsed: 0.186 sec
08-Mar-2018 04:23:37 testInstanceOf4(org.eclipse.jdt.core.groovy.tests.search.InferencingTests)  Time elapsed: 0.247 sec
08-Mar-2018 04:23:37 testInstanceOf5(org.eclipse.jdt.core.groovy.tests.search.InferencingTests)  Time elapsed: 0.187 sec
08-Mar-2018 04:23:37 testInstanceOf6(org.eclipse.jdt.core.groovy.tests.search.InferencingTests)  Time elapsed: 0.186 sec
08-Mar-2018 04:23:37 testInstanceOf7(org.eclipse.jdt.core.groovy.tests.search.InferencingTests)  Time elapsed: 0.168 sec
08-Mar-2018 04:23:37 testInstanceOf8(org.eclipse.jdt.core.groovy.tests.search.InferencingTests)  Time elapsed: 0.172 sec
08-Mar-2018 04:23:37 testInstanceOf9(org.eclipse.jdt.core.groovy.tests.search.InferencingTests)  Time elapsed: 0.181 sec
08-Mar-2018 04:23:37 testAnonInner1(org.eclipse.jdt.core.groovy.tests.search.InferencingTests)  Time elapsed: 0.134 sec
08-Mar-2018 04:23:37 testAnonInner2(org.eclipse.jdt.core.groovy.tests.search.InferencingTests)  Time elapsed: 0.114 sec
08-Mar-2018 04:23:37 testAnonInner3(org.eclipse.jdt.core.groovy.tests.search.InferencingTests)  Time elapsed: 0.101 sec
08-Mar-2018 04:23:37 testAnonInner4(org.eclipse.jdt.core.groovy.tests.search.InferencingTests)  Time elapsed: 0.107 sec
08-Mar-2018 04:23:37 testAnonInner5(org.eclipse.jdt.core.groovy.tests.search.InferencingTests)  Time elapsed: 0.108 sec
08-Mar-2018 04:23:37 testAnonInner6(org.eclipse.jdt.core.groovy.tests.search.InferencingTests)  Time elapsed: 0.135 sec
08-Mar-2018 04:23:37 testAnonInner7(org.eclipse.jdt.core.groovy.tests.search.InferencingTests)  Time elapsed: 0.18 sec
08-Mar-2018 04:23:37 testThisInInnerClass1(org.eclipse.jdt.core.groovy.tests.search.InferencingTests)  Time elapsed: 0.152 sec
08-Mar-2018 04:23:37 testNumber1(org.eclipse.jdt.core.groovy.tests.search.InferencingTests)  Time elapsed: 0.088 sec
08-Mar-2018 04:23:37 testNumber2(org.eclipse.jdt.core.groovy.tests.search.InferencingTests)  Time elapsed: 0.111 sec
08-Mar-2018 04:23:37 testNumber3(org.eclipse.jdt.core.groovy.tests.search.InferencingTests)  Time elapsed: 0.108 sec
08-Mar-2018 04:23:37 testNumber4(org.eclipse.jdt.core.groovy.tests.search.InferencingTests)  Time elapsed: 0.097 sec
08-Mar-2018 04:23:37 testNumber5(org.eclipse.jdt.core.groovy.tests.search.InferencingTests)  Time elapsed: 0.091 sec
08-Mar-2018 04:23:37 testNumber6(org.eclipse.jdt.core.groovy.tests.search.InferencingTests)  Time elapsed: 0.091 sec
08-Mar-2018 04:23:37 testSpread1(org.eclipse.jdt.core.groovy.tests.search.InferencingTests)  Time elapsed: 0.098 sec
08-Mar-2018 04:23:37 testSpread2(org.eclipse.jdt.core.groovy.tests.search.InferencingTests)  Time elapsed: 0.087 sec
08-Mar-2018 04:23:37 testSpread3(org.eclipse.jdt.core.groovy.tests.search.InferencingTests)  Time elapsed: 0.103 sec
08-Mar-2018 04:23:37 testSpread4(org.eclipse.jdt.core.groovy.tests.search.InferencingTests)  Time elapsed: 0.095 sec
08-Mar-2018 04:23:37 testSpread5(org.eclipse.jdt.core.groovy.tests.search.InferencingTests)  Time elapsed: 0.091 sec
08-Mar-2018 04:23:37 testSpread6(org.eclipse.jdt.core.groovy.tests.search.InferencingTests)  Time elapsed: 0.088 sec
08-Mar-2018 04:23:37 testSpread7(org.eclipse.jdt.core.groovy.tests.search.InferencingTests)  Time elapsed: 0.098 sec
08-Mar-2018 04:23:37 testSpread8(org.eclipse.jdt.core.groovy.tests.search.InferencingTests)  Time elapsed: 0.08 sec
08-Mar-2018 04:23:37 testSpread9(org.eclipse.jdt.core.groovy.tests.search.InferencingTests)  Time elapsed: 0.09 sec
08-Mar-2018 04:23:37 testPattern1(org.eclipse.jdt.core.groovy.tests.search.InferencingTests)  Time elapsed: 0.086 sec
08-Mar-2018 04:23:37 testPattern2(org.eclipse.jdt.core.groovy.tests.search.InferencingTests)  Time elapsed: 0.087 sec
08-Mar-2018 04:23:37 testString1(org.eclipse.jdt.core.groovy.tests.search.InferencingTests)  Time elapsed: 0.088 sec
08-Mar-2018 04:23:37 testString2(org.eclipse.jdt.core.groovy.tests.search.InferencingTests)  Time elapsed: 0.089 sec
08-Mar-2018 04:23:37 testString3(org.eclipse.jdt.core.groovy.tests.search.InferencingTests)  Time elapsed: 0.091 sec
08-Mar-2018 04:23:37 testString4(org.eclipse.jdt.core.groovy.tests.search.InferencingTests)  Time elapsed: 0.088 sec
08-Mar-2018 04:23:37 testStaticMethodCall(org.eclipse.jdt.core.groovy.tests.search.InferencingTests)  Time elapsed: 0.09 sec
08-Mar-2018 04:23:37 testClassReference1(org.eclipse.jdt.core.groovy.tests.search.InferencingTests)  Time elapsed: 0.086 sec
08-Mar-2018 04:23:37 testClassReference2(org.eclipse.jdt.core.groovy.tests.search.InferencingTests)  Time elapsed: 0.087 sec
08-Mar-2018 04:23:37 testClassReference3(org.eclipse.jdt.core.groovy.tests.search.InferencingTests)  Time elapsed: 0.09 sec
08-Mar-2018 04:23:37 testClassReference4(org.eclipse.jdt.core.groovy.tests.search.InferencingTests)  Time elapsed: 0.089 sec
08-Mar-2018 04:23:37 testPropertyNodeFromJava1(org.eclipse.jdt.core.groovy.tests.search.JDTPropertyNodeInferencingTests)  Time elapsed: 0.112 sec
08-Mar-2018 04:23:37 testPropertyNodeFromJava2(org.eclipse.jdt.core.groovy.tests.search.JDTPropertyNodeInferencingTests)  Time elapsed: 0.092 sec
08-Mar-2018 04:23:37 testPropertyNodeFromJava3(org.eclipse.jdt.core.groovy.tests.search.JDTPropertyNodeInferencingTests)  Time elapsed: 0.091 sec
08-Mar-2018 04:23:37 testPropertyNodeFromJava4(org.eclipse.jdt.core.groovy.tests.search.JDTPropertyNodeInferencingTests)  Time elapsed: 0.092 sec
08-Mar-2018 04:23:37 testNodeFromJava1(org.eclipse.jdt.core.groovy.tests.search.JDTPropertyNodeInferencingTests)  Time elapsed: 0.096 sec
08-Mar-2018 04:23:37 testPropertyNodeReferenceInBinary1(org.eclipse.jdt.core.groovy.tests.search.JDTPropertyNodeInferencingTests)  Time elapsed: 0.124 sec
08-Mar-2018 04:23:37 testvarReferenceInGString1(org.eclipse.jdt.core.groovy.tests.search.LocalVariableReferenceSearchTests)  Time elapsed: 0.083 sec
08-Mar-2018 04:23:37 testvarReferenceInGString2(org.eclipse.jdt.core.groovy.tests.search.LocalVariableReferenceSearchTests)  Time elapsed: 0.095 sec
08-Mar-2018 04:23:37 testvarReferenceInGString3(org.eclipse.jdt.core.groovy.tests.search.LocalVariableReferenceSearchTests)  Time elapsed: 0.099 sec
08-Mar-2018 04:23:37 testvarReferenceInGString4(org.eclipse.jdt.core.groovy.tests.search.LocalVariableReferenceSearchTests)  Time elapsed: 0.087 sec
08-Mar-2018 04:23:37 testvarReferenceInGString5(org.eclipse.jdt.core.groovy.tests.search.LocalVariableReferenceSearchTests)  Time elapsed: 0.094 sec
08-Mar-2018 04:23:37 testvarReference1(org.eclipse.jdt.core.groovy.tests.search.LocalVariableReferenceSearchTests)  Time elapsed: 0.091 sec
08-Mar-2018 04:23:37 testvarReference2(org.eclipse.jdt.core.groovy.tests.search.LocalVariableReferenceSearchTests)  Time elapsed: 0.09 sec
08-Mar-2018 04:23:37 testvarReference3(org.eclipse.jdt.core.groovy.tests.search.LocalVariableReferenceSearchTests)  Time elapsed: 0.094 sec
08-Mar-2018 04:23:37 testvarReference4(org.eclipse.jdt.core.groovy.tests.search.LocalVariableReferenceSearchTests)  Time elapsed: 0.092 sec
08-Mar-2018 04:23:37 testvarReference5(org.eclipse.jdt.core.groovy.tests.search.LocalVariableReferenceSearchTests)  Time elapsed: 0.101 sec
08-Mar-2018 04:23:37 testvarReference6(org.eclipse.jdt.core.groovy.tests.search.LocalVariableReferenceSearchTests)  Time elapsed: 0.093 sec
08-Mar-2018 04:23:37 testvarReference7(org.eclipse.jdt.core.groovy.tests.search.LocalVariableReferenceSearchTests)  Time elapsed: 0.11 sec
08-Mar-2018 04:23:37 testvarReference8(org.eclipse.jdt.core.groovy.tests.search.LocalVariableReferenceSearchTests)  Time elapsed: 0.094 sec
08-Mar-2018 04:23:37 testvarReference9(org.eclipse.jdt.core.groovy.tests.search.LocalVariableReferenceSearchTests)  Time elapsed: 0.091 sec
08-Mar-2018 04:23:37 testvarReference10(org.eclipse.jdt.core.groovy.tests.search.LocalVariableReferenceSearchTests)  Time elapsed: 0.091 sec
08-Mar-2018 04:23:37 testConstructorReferenceSearch(org.eclipse.jdt.core.groovy.tests.search.MethodReferenceSearchTests)  Time elapsed: 0.179 sec
08-Mar-2018 04:23:37 testOverloadedMethodReferences1(org.eclipse.jdt.core.groovy.tests.search.MethodReferenceSearchTests)  Time elapsed: 0.149 sec
08-Mar-2018 04:23:37 testOverloadedMethodReferences2(org.eclipse.jdt.core.groovy.tests.search.MethodReferenceSearchTests)  Time elapsed: 0.171 sec
08-Mar-2018 04:23:37 testOverloadedMethodReferences3(org.eclipse.jdt.core.groovy.tests.search.MethodReferenceSearchTests)  Time elapsed: 0.158 sec
08-Mar-2018 04:23:37 testOverloadedMethodReferences4(org.eclipse.jdt.core.groovy.tests.search.MethodReferenceSearchTests)  Time elapsed: 0.178 sec
08-Mar-2018 04:23:37 testOverloadedMethodReferences5(org.eclipse.jdt.core.groovy.tests.search.MethodReferenceSearchTests)  Time elapsed: 0.237 sec
08-Mar-2018 04:23:37 testOverloadedMethodReferences6(org.eclipse.jdt.core.groovy.tests.search.MethodReferenceSearchTests)  Time elapsed: 0.191 sec
08-Mar-2018 04:23:37 testStaticMethodReferenceSearch(org.eclipse.jdt.core.groovy.tests.search.MethodReferenceSearchTests)  Time elapsed: 0.096 sec
08-Mar-2018 04:23:37 testMethodReferencesInClass1(org.eclipse.jdt.core.groovy.tests.search.MethodReferenceSearchTests)  Time elapsed: 0.178 sec
08-Mar-2018 04:23:37 testMethodReferencesInClass2(org.eclipse.jdt.core.groovy.tests.search.MethodReferenceSearchTests)  Time elapsed: 0.177 sec
08-Mar-2018 04:23:37 testMethodReferencesInClass3(org.eclipse.jdt.core.groovy.tests.search.MethodReferenceSearchTests)  Time elapsed: 0.182 sec
08-Mar-2018 04:23:37 testMethodReferencesInClass4(org.eclipse.jdt.core.groovy.tests.search.MethodReferenceSearchTests)  Time elapsed: 0.189 sec
08-Mar-2018 04:23:37 testGenericsMethodReferenceSearch(org.eclipse.jdt.core.groovy.tests.search.MethodReferenceSearchTests)  Time elapsed: 0.165 sec
08-Mar-2018 04:23:37 testMethodReferencesInScript1GRE_1180(org.eclipse.jdt.core.groovy.tests.search.MethodReferenceSearchTests)  Time elapsed: 0.179 sec
08-Mar-2018 04:23:37 testMethodReferencesInScript1(org.eclipse.jdt.core.groovy.tests.search.MethodReferenceSearchTests)  Time elapsed: 0.178 sec
08-Mar-2018 04:23:37 testMethodReferencesInScript2(org.eclipse.jdt.core.groovy.tests.search.MethodReferenceSearchTests)  Time elapsed: 0.191 sec
08-Mar-2018 04:23:37 testMethodReferencesInScript3(org.eclipse.jdt.core.groovy.tests.search.MethodReferenceSearchTests)  Time elapsed: 0.178 sec
08-Mar-2018 04:23:37 testMethodReferencesInScript4(org.eclipse.jdt.core.groovy.tests.search.MethodReferenceSearchTests)  Time elapsed: 0.284 sec
08-Mar-2018 04:23:37 testMethodReferencesInScript5(org.eclipse.jdt.core.groovy.tests.search.MethodReferenceSearchTests)  Time elapsed: 0.178 sec
08-Mar-2018 04:23:37 testMethodReferencesInScript6(org.eclipse.jdt.core.groovy.tests.search.MethodReferenceSearchTests)  Time elapsed: 0.18 sec
08-Mar-2018 04:23:37 testMethodReferencesInScript7(org.eclipse.jdt.core.groovy.tests.search.MethodReferenceSearchTests)  Time elapsed: 0.198 sec
08-Mar-2018 04:23:37 testMethodReferencesInScript8(org.eclipse.jdt.core.groovy.tests.search.MethodReferenceSearchTests)  Time elapsed: 0.184 sec
08-Mar-2018 04:23:37 testMethodWithDefaultParameters1(org.eclipse.jdt.core.groovy.tests.search.MethodReferenceSearchTests)  Time elapsed: 0.209 sec
08-Mar-2018 04:23:37 testMethodWithDefaultParameters2(org.eclipse.jdt.core.groovy.tests.search.MethodReferenceSearchTests)  Time elapsed: 0.181 sec
08-Mar-2018 04:23:37 testRightShift(org.eclipse.jdt.core.groovy.tests.search.OperatorOverloadingInferencingTests)  Time elapsed: 0.097 sec
08-Mar-2018 04:23:37 testLeftShift(org.eclipse.jdt.core.groovy.tests.search.OperatorOverloadingInferencingTests)  Time elapsed: 0.092 sec
08-Mar-2018 04:23:37 testAnd(org.eclipse.jdt.core.groovy.tests.search.OperatorOverloadingInferencingTests)  Time elapsed: 0.1 sec
08-Mar-2018 04:23:37 testMod(org.eclipse.jdt.core.groovy.tests.search.OperatorOverloadingInferencingTests)  Time elapsed: 0.091 sec
08-Mar-2018 04:23:37 testXor(org.eclipse.jdt.core.groovy.tests.search.OperatorOverloadingInferencingTests)  Time elapsed: 0.098 sec
08-Mar-2018 04:23:37 testPlus1(org.eclipse.jdt.core.groovy.tests.search.OperatorOverloadingInferencingTests)  Time elapsed: 0.095 sec
08-Mar-2018 04:23:37 testPlus2(org.eclipse.jdt.core.groovy.tests.search.OperatorOverloadingInferencingTests)  Time elapsed: 0.097 sec
08-Mar-2018 04:23:37 testPlus3(org.eclipse.jdt.core.groovy.tests.search.OperatorOverloadingInferencingTests)  Time elapsed: 0.091 sec
08-Mar-2018 04:23:37 testOr(org.eclipse.jdt.core.groovy.tests.search.OperatorOverloadingInferencingTests)  Time elapsed: 0.096 sec
08-Mar-2018 04:23:37 testPrefix1(org.eclipse.jdt.core.groovy.tests.search.OperatorOverloadingInferencingTests)  Time elapsed: 0.117 sec
08-Mar-2018 04:23:37 testPrefix2(org.eclipse.jdt.core.groovy.tests.search.OperatorOverloadingInferencingTests)  Time elapsed: 0.096 sec
08-Mar-2018 04:23:37 testPrefix3(org.eclipse.jdt.core.groovy.tests.search.OperatorOverloadingInferencingTests)  Time elapsed: 0.089 sec
08-Mar-2018 04:23:37 testPrefix4(org.eclipse.jdt.core.groovy.tests.search.OperatorOverloadingInferencingTests)  Time elapsed: 0.105 sec
08-Mar-2018 04:23:37 testPrefix5(org.eclipse.jdt.core.groovy.tests.search.OperatorOverloadingInferencingTests)  Time elapsed: 0.095 sec
08-Mar-2018 04:23:37 testPrefix6(org.eclipse.jdt.core.groovy.tests.search.OperatorOverloadingInferencingTests)  Time elapsed: 0.093 sec
08-Mar-2018 04:23:37 testLongExpr1(org.eclipse.jdt.core.groovy.tests.search.OperatorOverloadingInferencingTests)  Time elapsed: 0.096 sec
08-Mar-2018 04:23:37 testLongExpr2(org.eclipse.jdt.core.groovy.tests.search.OperatorOverloadingInferencingTests)  Time elapsed: 0.095 sec
08-Mar-2018 04:23:37 testLongExpr3(org.eclipse.jdt.core.groovy.tests.search.OperatorOverloadingInferencingTests)  Time elapsed: 0.096 sec
08-Mar-2018 04:23:37 testAttributeExpr1(org.eclipse.jdt.core.groovy.tests.search.OperatorOverloadingInferencingTests)  Time elapsed: 0.091 sec
08-Mar-2018 04:23:37 testAttributeExpr2(org.eclipse.jdt.core.groovy.tests.search.OperatorOverloadingInferencingTests)  Time elapsed: 0.094 sec
08-Mar-2018 04:23:37 testDivide(org.eclipse.jdt.core.groovy.tests.search.OperatorOverloadingInferencingTests)  Time elapsed: 0.094 sec
08-Mar-2018 04:23:37 testMultiply(org.eclipse.jdt.core.groovy.tests.search.OperatorOverloadingInferencingTests)  Time elapsed: 0.095 sec
08-Mar-2018 04:23:37 testGetAt1(org.eclipse.jdt.core.groovy.tests.search.OperatorOverloadingInferencingTests)  Time elapsed: 0.098 sec
08-Mar-2018 04:23:37 testGetAt2(org.eclipse.jdt.core.groovy.tests.search.OperatorOverloadingInferencingTests)  Time elapsed: 0.096 sec
08-Mar-2018 04:23:37 testGetAt3(org.eclipse.jdt.core.groovy.tests.search.OperatorOverloadingInferencingTests)  Time elapsed: 0.093 sec
08-Mar-2018 04:23:37 testGetAt4(org.eclipse.jdt.core.groovy.tests.search.OperatorOverloadingInferencingTests)  Time elapsed: 0.095 sec
08-Mar-2018 04:23:37 testGetAt5(org.eclipse.jdt.core.groovy.tests.search.OperatorOverloadingInferencingTests)  Time elapsed: 0.095 sec
08-Mar-2018 04:23:37 testGetAt6(org.eclipse.jdt.core.groovy.tests.search.OperatorOverloadingInferencingTests)  Time elapsed: 0.094 sec
08-Mar-2018 04:23:37 testGetAt7(org.eclipse.jdt.core.groovy.tests.search.OperatorOverloadingInferencingTests)  Time elapsed: 0.096 sec
08-Mar-2018 04:23:37 testGetAt8(org.eclipse.jdt.core.groovy.tests.search.OperatorOverloadingInferencingTests)  Time elapsed: 0.11 sec
08-Mar-2018 04:23:37 testGetAt9(org.eclipse.jdt.core.groovy.tests.search.OperatorOverloadingInferencingTests)  Time elapsed: 0.094 sec
08-Mar-2018 04:23:37 testPostfix1(org.eclipse.jdt.core.groovy.tests.search.OperatorOverloadingInferencingTests)  Time elapsed: 0.091 sec
08-Mar-2018 04:23:37 testPostfix2(org.eclipse.jdt.core.groovy.tests.search.OperatorOverloadingInferencingTests)  Time elapsed: 0.092 sec
08-Mar-2018 04:23:37 testMinus1(org.eclipse.jdt.core.groovy.tests.search.OperatorOverloadingInferencingTests)  Time elapsed: 0.095 sec
08-Mar-2018 04:23:37 testMinus2(org.eclipse.jdt.core.groovy.tests.search.OperatorOverloadingInferencingTests)  Time elapsed: 0.09 sec
08-Mar-2018 04:23:37 testNumberPlusString1(org.eclipse.jdt.core.groovy.tests.search.OperatorOverloadingInferencingTests)  Time elapsed: 0.09 sec
08-Mar-2018 04:23:37 testNumberPlusString2(org.eclipse.jdt.core.groovy.tests.search.OperatorOverloadingInferencingTests)  Time elapsed: 0.09 sec
08-Mar-2018 04:23:37 testCompleteExpr1(org.eclipse.jdt.core.groovy.tests.search.OperatorOverloadingInferencingTests)  Time elapsed: 0.092 sec
08-Mar-2018 04:23:37 testCompleteExpr2(org.eclipse.jdt.core.groovy.tests.search.OperatorOverloadingInferencingTests)  Time elapsed: 0.092 sec
08-Mar-2018 04:23:37 testCompleteExpr3(org.eclipse.jdt.core.groovy.tests.search.OperatorOverloadingInferencingTests)  Time elapsed: 0.092 sec
08-Mar-2018 04:23:37 testCompleteExpr4(org.eclipse.jdt.core.groovy.tests.search.OperatorOverloadingInferencingTests)  Time elapsed: 0.093 sec
08-Mar-2018 04:23:37 testCompleteExpr5(org.eclipse.jdt.core.groovy.tests.search.OperatorOverloadingInferencingTests)  Time elapsed: 0.093 sec
08-Mar-2018 04:23:37 testCompleteExpr6(org.eclipse.jdt.core.groovy.tests.search.OperatorOverloadingInferencingTests)  Time elapsed: 0.096 sec
08-Mar-2018 04:23:37 testCompleteExpr7(org.eclipse.jdt.core.groovy.tests.search.OperatorOverloadingInferencingTests)  Time elapsed: 0.091 sec
08-Mar-2018 04:23:37 testCompleteExpr8(org.eclipse.jdt.core.groovy.tests.search.OperatorOverloadingInferencingTests)  Time elapsed: 0.09 sec
08-Mar-2018 04:23:37 testNonStaticReference1(org.eclipse.jdt.core.groovy.tests.search.StaticInferencingTests)  Time elapsed: 0.091 sec
08-Mar-2018 04:23:37 testNonStaticReference2(org.eclipse.jdt.core.groovy.tests.search.StaticInferencingTests)  Time elapsed: 0.106 sec
08-Mar-2018 04:23:37 testNonStaticReference3(org.eclipse.jdt.core.groovy.tests.search.StaticInferencingTests)  Time elapsed: 0.091 sec
08-Mar-2018 04:23:37 testNonStaticReference4(org.eclipse.jdt.core.groovy.tests.search.StaticInferencingTests)  Time elapsed: 0.092 sec
08-Mar-2018 04:23:37 testNonStaticReference5(org.eclipse.jdt.core.groovy.tests.search.StaticInferencingTests)  Time elapsed: 0.1 sec
08-Mar-2018 04:23:37 testNonStaticReference6(org.eclipse.jdt.core.groovy.tests.search.StaticInferencingTests)  Time elapsed: 0.088 sec
08-Mar-2018 04:23:37 testNonStaticReference7(org.eclipse.jdt.core.groovy.tests.search.StaticInferencingTests)  Time elapsed: 0.092 sec
08-Mar-2018 04:23:37 testNonStaticReference8(org.eclipse.jdt.core.groovy.tests.search.StaticInferencingTests)  Time elapsed: 0.092 sec
08-Mar-2018 04:23:37 testStaticReference1(org.eclipse.jdt.core.groovy.tests.search.StaticInferencingTests)  Time elapsed: 0.095 sec
08-Mar-2018 04:23:37 testStaticImport1(org.eclipse.jdt.core.groovy.tests.search.StaticInferencingTests)  Time elapsed: 0.109 sec
08-Mar-2018 04:23:37 testStaticImport2(org.eclipse.jdt.core.groovy.tests.search.StaticInferencingTests)  Time elapsed: 0.099 sec
08-Mar-2018 04:23:37 testStaticImport3(org.eclipse.jdt.core.groovy.tests.search.StaticInferencingTests)  Time elapsed: 0.098 sec
08-Mar-2018 04:23:37 testStaticImport4(org.eclipse.jdt.core.groovy.tests.search.StaticInferencingTests)  Time elapsed: 0.103 sec
08-Mar-2018 04:23:37 testStaticImport5(org.eclipse.jdt.core.groovy.tests.search.StaticInferencingTests)  Time elapsed: 0.097 sec
08-Mar-2018 04:23:37 testStaticImport6(org.eclipse.jdt.core.groovy.tests.search.StaticInferencingTests)  Time elapsed: 0.119 sec
08-Mar-2018 04:23:37 testStaticImport7(org.eclipse.jdt.core.groovy.tests.search.StaticInferencingTests)  Time elapsed: 0.103 sec
08-Mar-2018 04:23:37 testStaticImport8(org.eclipse.jdt.core.groovy.tests.search.StaticInferencingTests)  Time elapsed: 0.103 sec
08-Mar-2018 04:23:37 testStaticImport9(org.eclipse.jdt.core.groovy.tests.search.StaticInferencingTests)  Time elapsed: 0.106 sec
08-Mar-2018 04:23:37 testSTCAndClassInstance(org.eclipse.jdt.core.groovy.tests.search.StaticInferencingTests)  Time elapsed: 0.115 sec
08-Mar-2018 04:23:37 testClassReference10(org.eclipse.jdt.core.groovy.tests.search.StaticInferencingTests)  Time elapsed: 0.095 sec
08-Mar-2018 04:23:37 testClassReference11(org.eclipse.jdt.core.groovy.tests.search.StaticInferencingTests)  Time elapsed: 0.089 sec
08-Mar-2018 04:23:37 testClassReference12(org.eclipse.jdt.core.groovy.tests.search.StaticInferencingTests)  Time elapsed: 0.092 sec
08-Mar-2018 04:23:37 testClassReference13(org.eclipse.jdt.core.groovy.tests.search.StaticInferencingTests)  Time elapsed: 0.095 sec
08-Mar-2018 04:23:37 testClassReference14(org.eclipse.jdt.core.groovy.tests.search.StaticInferencingTests)  Time elapsed: 0.092 sec
08-Mar-2018 04:23:37 testClassReference15(org.eclipse.jdt.core.groovy.tests.search.StaticInferencingTests)  Time elapsed: 0.103 sec
08-Mar-2018 04:23:37 testClassReference4a(org.eclipse.jdt.core.groovy.tests.search.StaticInferencingTests)  Time elapsed: 0.093 sec
08-Mar-2018 04:23:37 testClassReference1(org.eclipse.jdt.core.groovy.tests.search.StaticInferencingTests)  Time elapsed: 0.091 sec
08-Mar-2018 04:23:37 testClassReference2(org.eclipse.jdt.core.groovy.tests.search.StaticInferencingTests)  Time elapsed: 0.091 sec
08-Mar-2018 04:23:37 testClassReference3(org.eclipse.jdt.core.groovy.tests.search.StaticInferencingTests)  Time elapsed: 0.094 sec
08-Mar-2018 04:23:37 testClassReference4(org.eclipse.jdt.core.groovy.tests.search.StaticInferencingTests)  Time elapsed: 0.091 sec
08-Mar-2018 04:23:37 testClassReference5(org.eclipse.jdt.core.groovy.tests.search.StaticInferencingTests)  Time elapsed: 0.097 sec
08-Mar-2018 04:23:37 testClassReference6(org.eclipse.jdt.core.groovy.tests.search.StaticInferencingTests)  Time elapsed: 0.091 sec
08-Mar-2018 04:23:37 testClassReference7(org.eclipse.jdt.core.groovy.tests.search.StaticInferencingTests)  Time elapsed: 0.092 sec
08-Mar-2018 04:23:37 testClassReference8(org.eclipse.jdt.core.groovy.tests.search.StaticInferencingTests)  Time elapsed: 0.093 sec
08-Mar-2018 04:23:37 testClassReference9(org.eclipse.jdt.core.groovy.tests.search.StaticInferencingTests)  Time elapsed: 0.116 sec
08-Mar-2018 04:23:37 testSyntheticAccessors1(org.eclipse.jdt.core.groovy.tests.search.SyntheticAccessorInferencingTests)  Time elapsed: 0.107 sec
08-Mar-2018 04:23:37 testSyntheticAccessors2(org.eclipse.jdt.core.groovy.tests.search.SyntheticAccessorInferencingTests)  Time elapsed: 0.116 sec
08-Mar-2018 04:23:37 testSyntheticAccessors3(org.eclipse.jdt.core.groovy.tests.search.SyntheticAccessorInferencingTests)  Time elapsed: 0.116 sec
08-Mar-2018 04:23:37 testSyntheticAccessors4(org.eclipse.jdt.core.groovy.tests.search.SyntheticAccessorInferencingTests)  Time elapsed: 1.043 sec
08-Mar-2018 04:23:37 testFindClassDeclarationWithPattern(org.eclipse.jdt.core.groovy.tests.search.TypeReferenceSearchTests)  Time elapsed: 0.607 sec
08-Mar-2018 04:23:37 testInnerTypes1(org.eclipse.jdt.core.groovy.tests.search.TypeReferenceSearchTests)  Time elapsed: 1.021 sec
08-Mar-2018 04:23:37 testInnerTypes2(org.eclipse.jdt.core.groovy.tests.search.TypeReferenceSearchTests)  Time elapsed: 1.026 sec
08-Mar-2018 04:23:37 testInnerTypes3(org.eclipse.jdt.core.groovy.tests.search.TypeReferenceSearchTests)  Time elapsed: 1.023 sec
08-Mar-2018 04:23:37 testSearchForTypesScript1(org.eclipse.jdt.core.groovy.tests.search.TypeReferenceSearchTests)  Time elapsed: 0.101 sec
08-Mar-2018 04:23:37 testSearchForTypesScript2(org.eclipse.jdt.core.groovy.tests.search.TypeReferenceSearchTests)  Time elapsed: 0.103 sec
08-Mar-2018 04:23:37 testSearchForTypesScript3(org.eclipse.jdt.core.groovy.tests.search.TypeReferenceSearchTests)  Time elapsed: 0.104 sec
08-Mar-2018 04:23:37 testSearchForTypesScript4(org.eclipse.jdt.core.groovy.tests.search.TypeReferenceSearchTests)  Time elapsed: 0.106 sec
08-Mar-2018 04:23:37 testSearchForTypesScript5(org.eclipse.jdt.core.groovy.tests.search.TypeReferenceSearchTests)  Time elapsed: 0.105 sec
08-Mar-2018 04:23:37 testSearchForTypesScript6(org.eclipse.jdt.core.groovy.tests.search.TypeReferenceSearchTests)  Time elapsed: 0.104 sec
08-Mar-2018 04:23:37 testShouldntFindClassDeclarationInScript(org.eclipse.jdt.core.groovy.tests.search.TypeReferenceSearchTests)  Time elapsed: 0.094 sec
08-Mar-2018 04:23:37 testSearchForTypesArray1(org.eclipse.jdt.core.groovy.tests.search.TypeReferenceSearchTests)  Time elapsed: 0.108 sec
08-Mar-2018 04:23:37 testSearchForTypesClass1(org.eclipse.jdt.core.groovy.tests.search.TypeReferenceSearchTests)  Time elapsed: 0.11 sec
08-Mar-2018 04:23:37 testSearchForTypesClass2(org.eclipse.jdt.core.groovy.tests.search.TypeReferenceSearchTests)  Time elapsed: 0.11 sec
08-Mar-2018 04:23:37 testSearchForTypesClass3(org.eclipse.jdt.core.groovy.tests.search.TypeReferenceSearchTests)  Time elapsed: 0.106 sec
08-Mar-2018 04:23:37 testSearchForTypesClass4(org.eclipse.jdt.core.groovy.tests.search.TypeReferenceSearchTests)  Time elapsed: 0.102 sec
08-Mar-2018 04:23:37 testSearchForTypesClass5(org.eclipse.jdt.core.groovy.tests.search.TypeReferenceSearchTests)  Time elapsed: 0.115 sec
08-Mar-2018 04:23:37 testSearchForTypesClass6(org.eclipse.jdt.core.groovy.tests.search.TypeReferenceSearchTests)  Time elapsed: 0.113 sec
08-Mar-2018 04:23:37 testSearchForTypesClass7(org.eclipse.jdt.core.groovy.tests.search.TypeReferenceSearchTests)  Time elapsed: 0.114 sec
08-Mar-2018 04:23:37 testSearchForTypesClosure1(org.eclipse.jdt.core.groovy.tests.search.TypeReferenceSearchTests)  Time elapsed: 0.11 sec
08-Mar-2018 04:23:37 testSearchForTypesClosure2(org.eclipse.jdt.core.groovy.tests.search.TypeReferenceSearchTests)  Time elapsed: 0.106 sec
08-Mar-2018 04:23:37 testSearchForTypesClosure3(org.eclipse.jdt.core.groovy.tests.search.TypeReferenceSearchTests)  Time elapsed: 0.11 sec
08-Mar-2018 04:23:37 testFindClassDeclaration(org.eclipse.jdt.core.groovy.tests.search.TypeReferenceSearchTests)  Time elapsed: 0.094 sec
08-Mar-2018 04:23:37 testConstructorWithDefaultArgsInCompileStatic(org.eclipse.jdt.core.groovy.tests.search.TypeReferenceSearchTests)  Time elapsed: 0.515 sec
08-Mar-2018 04:23:37
08-Mar-2018 04:23:37 Results :
08-Mar-2018 04:23:37
08-Mar-2018 04:23:37 Tests run: 5041, Failures: 0, Errors: 0, Skipped: 167
08-Mar-2018 04:23:37
08-Mar-2018 04:23:37
08-Mar-2018 04:23:37 !ENTRY org.eclipse.e4.ui.workbench.swt 4 2 2018-03-08 04:23:37.895
08-Mar-2018 04:23:37 !MESSAGE Problems occurred when invoking code from plug-in: "org.eclipse.e4.ui.workbench.swt".
08-Mar-2018 04:23:37 !STACK 0
08-Mar-2018 04:23:37 org.eclipse.e4.core.di.InjectionException: org.eclipse.swt.SWTException: Widget is disposed
08-Mar-2018 04:23:37         at org.eclipse.e4.core.internal.di.MethodRequestor.execute(MethodRequestor.java:62)
08-Mar-2018 04:23:37         at org.eclipse.e4.core.internal.di.InjectorImpl.processAnnotated(InjectorImpl.java:888)
08-Mar-2018 04:23:37         at org.eclipse.e4.core.internal.di.InjectorImpl.disposed(InjectorImpl.java:390)
08-Mar-2018 04:23:37         at org.eclipse.e4.core.internal.di.Requestor.disposed(Requestor.java:143)
08-Mar-2018 04:23:37         at org.eclipse.e4.core.internal.contexts.ContextObjectSupplier$ContextInjectionListener.update(ContextObjectSupplier.java:76)
08-Mar-2018 04:23:37         at org.eclipse.e4.core.internal.contexts.TrackableComputationExt.update(TrackableComputationExt.java:107)
08-Mar-2018 04:23:37         at org.eclipse.e4.core.internal.contexts.TrackableComputationExt.handleInvalid(TrackableComputationExt.java:70)
08-Mar-2018 04:23:37         at org.eclipse.e4.core.internal.contexts.EclipseContext.dispose(EclipseContext.java:175)
08-Mar-2018 04:23:37         at org.eclipse.e4.ui.internal.workbench.swt.PartRenderingEngine.clearContext(PartRenderingEngine.java:974)
08-Mar-2018 04:23:37         at org.eclipse.e4.ui.internal.workbench.swt.PartRenderingEngine.safeRemoveGui(PartRenderingEngine.java:954)
08-Mar-2018 04:23:37         at org.eclipse.e4.ui.internal.workbench.swt.PartRenderingEngine.access$3(PartRenderingEngine.java:862)
08-Mar-2018 04:23:37         at org.eclipse.e4.ui.internal.workbench.swt.PartRenderingEngine$8.run(PartRenderingEngine.java:857)
08-Mar-2018 04:23:37         at org.eclipse.core.runtime.SafeRunner.run(SafeRunner.java:42)
08-Mar-2018 04:23:37         at org.eclipse.e4.ui.internal.workbench.swt.PartRenderingEngine.removeGui(PartRenderingEngine.java:841)
08-Mar-2018 04:23:37         at org.eclipse.e4.ui.internal.workbench.swt.PartRenderingEngine.stop(PartRenderingEngine.java:1220)
08-Mar-2018 04:23:37         at org.eclipse.e4.ui.internal.workbench.E4Workbench.close(E4Workbench.java:184)
08-Mar-2018 04:23:37         at org.eclipse.e4.ui.internal.workbench.swt.E4Testable$2.run(E4Testable.java:130)
08-Mar-2018 04:23:37         at org.eclipse.swt.widgets.RunnableLock.run(RunnableLock.java:35)
08-Mar-2018 04:23:37         at org.eclipse.swt.widgets.Synchronizer.runAsyncMessages(Synchronizer.java:136)
08-Mar-2018 04:23:37         at org.eclipse.swt.widgets.Display.runAsyncMessages(Display.java:3774)
08-Mar-2018 04:23:37         at org.eclipse.swt.widgets.Display.readAndDispatch(Display.java:3412)
08-Mar-2018 04:23:37         at org.eclipse.e4.ui.internal.workbench.swt.PartRenderingEngine$9.run(PartRenderingEngine.java:1151)
08-Mar-2018 04:23:37         at org.eclipse.core.databinding.observable.Realm.runWithDefault(Realm.java:332)
08-Mar-2018 04:23:37         at org.eclipse.e4.ui.internal.workbench.swt.PartRenderingEngine.run(PartRenderingEngine.java:1032)
08-Mar-2018 04:23:37         at org.eclipse.e4.ui.internal.workbench.E4Workbench.createAndRunUI(E4Workbench.java:148)
08-Mar-2018 04:23:37         at org.eclipse.ui.internal.Workbench$5.run(Workbench.java:636)
08-Mar-2018 04:23:37         at org.eclipse.core.databinding.observable.Realm.runWithDefault(Realm.java:332)
08-Mar-2018 04:23:37         at org.eclipse.ui.internal.Workbench.createAndRunWorkbench(Workbench.java:579)
08-Mar-2018 04:23:37         at org.eclipse.ui.PlatformUI.createAndRunWorkbench(PlatformUI.java:150)
08-Mar-2018 04:23:37         at org.eclipse.ui.internal.ide.application.IDEApplication.start(IDEApplication.java:135)
08-Mar-2018 04:23:37         at org.eclipse.tycho.surefire.osgibooter.UITestApplication.runApplication(UITestApplication.java:31)
08-Mar-2018 04:23:37         at org.eclipse.tycho.surefire.osgibooter.AbstractUITestApplication.run(AbstractUITestApplication.java:120)
08-Mar-2018 04:23:37         at org.eclipse.tycho.surefire.osgibooter.UITestApplication.start(UITestApplication.java:37)
08-Mar-2018 04:23:37         at org.eclipse.equinox.internal.app.EclipseAppHandle.run(EclipseAppHandle.java:196)
08-Mar-2018 04:23:37         at org.eclipse.core.runtime.internal.adaptor.EclipseAppLauncher.runApplication(EclipseAppLauncher.java:134)
08-Mar-2018 04:23:37         at org.eclipse.core.runtime.internal.adaptor.EclipseAppLauncher.start(EclipseAppLauncher.java:104)
08-Mar-2018 04:23:37         at org.eclipse.core.runtime.adaptor.EclipseStarter.run(EclipseStarter.java:380)
08-Mar-2018 04:23:37         at org.eclipse.core.runtime.adaptor.EclipseStarter.run(EclipseStarter.java:235)
08-Mar-2018 04:23:37         at sun.reflect.NativeMethodAccessorImpl.invoke0(Native Method)
08-Mar-2018 04:23:37         at sun.reflect.NativeMethodAccessorImpl.invoke(NativeMethodAccessorImpl.java:57)
08-Mar-2018 04:23:37         at sun.reflect.DelegatingMethodAccessorImpl.invoke(DelegatingMethodAccessorImpl.java:43)
08-Mar-2018 04:23:37         at java.lang.reflect.Method.invoke(Method.java:606)
08-Mar-2018 04:23:37         at org.eclipse.equinox.launcher.Main.invokeFramework(Main.java:648)
08-Mar-2018 04:23:37         at org.eclipse.equinox.launcher.Main.basicRun(Main.java:603)
08-Mar-2018 04:23:37         at org.eclipse.equinox.launcher.Main.run(Main.java:1465)
08-Mar-2018 04:23:37         at org.eclipse.equinox.launcher.Main.main(Main.java:1438)
08-Mar-2018 04:23:37 Caused by: org.eclipse.swt.SWTException: Widget is disposed
08-Mar-2018 04:23:37         at org.eclipse.swt.SWT.error(SWT.java:4441)
08-Mar-2018 04:23:37         at org.eclipse.swt.SWT.error(SWT.java:4356)
08-Mar-2018 04:23:37         at org.eclipse.swt.SWT.error(SWT.java:4327)
08-Mar-2018 04:23:37         at org.eclipse.swt.widgets.Widget.error(Widget.java:476)
08-Mar-2018 04:23:37         at org.eclipse.swt.widgets.Widget.checkWidget(Widget.java:413)
08-Mar-2018 04:23:37         at org.eclipse.swt.widgets.Shell.getSize(Shell.java:1111)
08-Mar-2018 04:23:37         at org.eclipse.ui.internal.quickaccess.SearchField.storeDialog(SearchField.java:580)
08-Mar-2018 04:23:37         at org.eclipse.ui.internal.quickaccess.SearchField.dispose(SearchField.java:557)
08-Mar-2018 04:23:37         at sun.reflect.NativeMethodAccessorImpl.invoke0(Native Method)
08-Mar-2018 04:23:37         at sun.reflect.NativeMethodAccessorImpl.invoke(NativeMethodAccessorImpl.java:57)
08-Mar-2018 04:23:37         at sun.reflect.DelegatingMethodAccessorImpl.invoke(DelegatingMethodAccessorImpl.java:43)
08-Mar-2018 04:23:37         at java.lang.reflect.Method.invoke(Method.java:606)
08-Mar-2018 04:23:37         at org.eclipse.e4.core.internal.di.MethodRequestor.execute(MethodRequestor.java:55)
08-Mar-2018 04:23:37         ... 45 more
08-Mar-2018 04:23:37
08-Mar-2018 04:23:37 !ENTRY org.eclipse.e4.ui.workbench 4 0 2018-03-08 04:23:37.896
08-Mar-2018 04:23:37 !MESSAGE Exception occurred while unrendering: org.eclipse.e4.ui.model.application.ui.basic.impl.TrimmedWindowImpl@4b38d375 (elementId: IDEWindow, tags: [topLevel], contributorURI: platform:/plugin/org.eclipse.ui.workbench) (widget: null, renderer: null, toBeRendered: true, onTop: false, visible: true, containerData: null, accessibilityPhrase: null) (label: %trimmedwindow.label.eclipseSDK, iconURI: null, tooltip: null, context: null, variables: [], x: 0, y: 0, width: 1024, height: 768)
08-Mar-2018 04:23:37 !STACK 0
08-Mar-2018 04:23:37 org.eclipse.e4.core.di.InjectionException: org.eclipse.swt.SWTException: Widget is disposed
08-Mar-2018 04:23:37         at org.eclipse.e4.core.internal.di.MethodRequestor.execute(MethodRequestor.java:62)
08-Mar-2018 04:23:37         at org.eclipse.e4.core.internal.di.InjectorImpl.processAnnotated(InjectorImpl.java:888)
08-Mar-2018 04:23:37         at org.eclipse.e4.core.internal.di.InjectorImpl.disposed(InjectorImpl.java:390)
08-Mar-2018 04:23:37         at org.eclipse.e4.core.internal.di.Requestor.disposed(Requestor.java:143)
08-Mar-2018 04:23:37         at org.eclipse.e4.core.internal.contexts.ContextObjectSupplier$ContextInjectionListener.update(ContextObjectSupplier.java:76)
08-Mar-2018 04:23:37         at org.eclipse.e4.core.internal.contexts.TrackableComputationExt.update(TrackableComputationExt.java:107)
08-Mar-2018 04:23:37         at org.eclipse.e4.core.internal.contexts.TrackableComputationExt.handleInvalid(TrackableComputationExt.java:70)
08-Mar-2018 04:23:37         at org.eclipse.e4.core.internal.contexts.EclipseContext.dispose(EclipseContext.java:175)
08-Mar-2018 04:23:37         at org.eclipse.e4.ui.internal.workbench.swt.PartRenderingEngine.clearContext(PartRenderingEngine.java:974)
08-Mar-2018 04:23:37         at org.eclipse.e4.ui.internal.workbench.swt.PartRenderingEngine.safeRemoveGui(PartRenderingEngine.java:954)
08-Mar-2018 04:23:37         at org.eclipse.e4.ui.internal.workbench.swt.PartRenderingEngine.access$3(PartRenderingEngine.java:862)
08-Mar-2018 04:23:37         at org.eclipse.e4.ui.internal.workbench.swt.PartRenderingEngine$8.run(PartRenderingEngine.java:857)
08-Mar-2018 04:23:37         at org.eclipse.core.runtime.SafeRunner.run(SafeRunner.java:42)
08-Mar-2018 04:23:37         at org.eclipse.e4.ui.internal.workbench.swt.PartRenderingEngine.removeGui(PartRenderingEngine.java:841)
08-Mar-2018 04:23:37         at org.eclipse.e4.ui.internal.workbench.swt.PartRenderingEngine.stop(PartRenderingEngine.java:1220)
08-Mar-2018 04:23:37         at org.eclipse.e4.ui.internal.workbench.E4Workbench.close(E4Workbench.java:184)
08-Mar-2018 04:23:37         at org.eclipse.e4.ui.internal.workbench.swt.E4Testable$2.run(E4Testable.java:130)
08-Mar-2018 04:23:37         at org.eclipse.swt.widgets.RunnableLock.run(RunnableLock.java:35)
08-Mar-2018 04:23:37         at org.eclipse.swt.widgets.Synchronizer.runAsyncMessages(Synchronizer.java:136)
08-Mar-2018 04:23:37         at org.eclipse.swt.widgets.Display.runAsyncMessages(Display.java:3774)
08-Mar-2018 04:23:37         at org.eclipse.swt.widgets.Display.readAndDispatch(Display.java:3412)
08-Mar-2018 04:23:37         at org.eclipse.e4.ui.internal.workbench.swt.PartRenderingEngine$9.run(PartRenderingEngine.java:1151)
08-Mar-2018 04:23:37         at org.eclipse.core.databinding.observable.Realm.runWithDefault(Realm.java:332)
08-Mar-2018 04:23:37         at org.eclipse.e4.ui.internal.workbench.swt.PartRenderingEngine.run(PartRenderingEngine.java:1032)
08-Mar-2018 04:23:37         at org.eclipse.e4.ui.internal.workbench.E4Workbench.createAndRunUI(E4Workbench.java:148)
08-Mar-2018 04:23:37         at org.eclipse.ui.internal.Workbench$5.run(Workbench.java:636)
08-Mar-2018 04:23:37         at org.eclipse.core.databinding.observable.Realm.runWithDefault(Realm.java:332)
08-Mar-2018 04:23:37         at org.eclipse.ui.internal.Workbench.createAndRunWorkbench(Workbench.java:579)
08-Mar-2018 04:23:37         at org.eclipse.ui.PlatformUI.createAndRunWorkbench(PlatformUI.java:150)
08-Mar-2018 04:23:37         at org.eclipse.ui.internal.ide.application.IDEApplication.start(IDEApplication.java:135)
08-Mar-2018 04:23:37         at org.eclipse.tycho.surefire.osgibooter.UITestApplication.runApplication(UITestApplication.java:31)
08-Mar-2018 04:23:37         at org.eclipse.tycho.surefire.osgibooter.AbstractUITestApplication.run(AbstractUITestApplication.java:120)
08-Mar-2018 04:23:37         at org.eclipse.tycho.surefire.osgibooter.UITestApplication.start(UITestApplication.java:37)
08-Mar-2018 04:23:37         at org.eclipse.equinox.internal.app.EclipseAppHandle.run(EclipseAppHandle.java:196)
08-Mar-2018 04:23:37         at org.eclipse.core.runtime.internal.adaptor.EclipseAppLauncher.runApplication(EclipseAppLauncher.java:134)
08-Mar-2018 04:23:37         at org.eclipse.core.runtime.internal.adaptor.EclipseAppLauncher.start(EclipseAppLauncher.java:104)
08-Mar-2018 04:23:37         at org.eclipse.core.runtime.adaptor.EclipseStarter.run(EclipseStarter.java:380)
08-Mar-2018 04:23:37         at org.eclipse.core.runtime.adaptor.EclipseStarter.run(EclipseStarter.java:235)
08-Mar-2018 04:23:37         at sun.reflect.NativeMethodAccessorImpl.invoke0(Native Method)
08-Mar-2018 04:23:37         at sun.reflect.NativeMethodAccessorImpl.invoke(NativeMethodAccessorImpl.java:57)
08-Mar-2018 04:23:37         at sun.reflect.DelegatingMethodAccessorImpl.invoke(DelegatingMethodAccessorImpl.java:43)
08-Mar-2018 04:23:37         at java.lang.reflect.Method.invoke(Method.java:606)
08-Mar-2018 04:23:37         at org.eclipse.equinox.launcher.Main.invokeFramework(Main.java:648)
08-Mar-2018 04:23:37         at org.eclipse.equinox.launcher.Main.basicRun(Main.java:603)
08-Mar-2018 04:23:37         at org.eclipse.equinox.launcher.Main.run(Main.java:1465)
08-Mar-2018 04:23:37         at org.eclipse.equinox.launcher.Main.main(Main.java:1438)
08-Mar-2018 04:23:37 Caused by: org.eclipse.swt.SWTException: Widget is disposed
08-Mar-2018 04:23:37         at org.eclipse.swt.SWT.error(SWT.java:4441)
08-Mar-2018 04:23:37         at org.eclipse.swt.SWT.error(SWT.java:4356)
08-Mar-2018 04:23:37         at org.eclipse.swt.SWT.error(SWT.java:4327)
08-Mar-2018 04:23:37         at org.eclipse.swt.widgets.Widget.error(Widget.java:476)
08-Mar-2018 04:23:37         at org.eclipse.swt.widgets.Widget.checkWidget(Widget.java:413)
08-Mar-2018 04:23:37         at org.eclipse.swt.widgets.Shell.getSize(Shell.java:1111)
08-Mar-2018 04:23:37         at org.eclipse.ui.internal.quickaccess.SearchField.storeDialog(SearchField.java:580)
08-Mar-2018 04:23:37         at org.eclipse.ui.internal.quickaccess.SearchField.dispose(SearchField.java:557)
08-Mar-2018 04:23:37         at sun.reflect.NativeMethodAccessorImpl.invoke0(Native Method)
08-Mar-2018 04:23:37         at sun.reflect.NativeMethodAccessorImpl.invoke(NativeMethodAccessorImpl.java:57)
08-Mar-2018 04:23:37         at sun.reflect.DelegatingMethodAccessorImpl.invoke(DelegatingMethodAccessorImpl.java:43)
08-Mar-2018 04:23:37         at java.lang.reflect.Method.invoke(Method.java:606)
08-Mar-2018 04:23:37         at org.eclipse.e4.core.internal.di.MethodRequestor.execute(MethodRequestor.java:55)
08-Mar-2018 04:23:37         ... 45 more
08-Mar-2018 04:23:39 [INFO] All tests passed!
08-Mar-2018 04:23:39 [INFO]
08-Mar-2018 04:23:39 [INFO] --- maven-install-plugin:2.3.1:install (default-install) @ org.codehaus.groovy.alltests ---
08-Mar-2018 04:23:40 [INFO] Installing /opt/bamboo-home/xml-data/build-dir/GRECLIPSE-E44TP-JOB1/ide-test/org.codehaus.groovy.alltests/target/org.codehaus.groovy.alltests-2.9.3-SNAPSHOT.jar to /home/bamboo/.m2/repository/org/codehaus/groovy/eclipse/org.codehaus.groovy.alltests/2.9.3-SNAPSHOT/org.codehaus.groovy.alltests-2.9.3-SNAPSHOT.jar
08-Mar-2018 04:23:40 [INFO] Installing /opt/bamboo-home/xml-data/build-dir/GRECLIPSE-E44TP-JOB1/ide-test/org.codehaus.groovy.alltests/pom.xml to /home/bamboo/.m2/repository/org/codehaus/groovy/eclipse/org.codehaus.groovy.alltests/2.9.3-SNAPSHOT/org.codehaus.groovy.alltests-2.9.3-SNAPSHOT.pom
08-Mar-2018 04:23:40 [INFO] Installing /opt/bamboo-home/xml-data/build-dir/GRECLIPSE-E44TP-JOB1/ide-test/org.codehaus.groovy.alltests/target/org.codehaus.groovy.alltests-2.9.3-SNAPSHOT-sources.jar to /home/bamboo/.m2/repository/org/codehaus/groovy/eclipse/org.codehaus.groovy.alltests/2.9.3-SNAPSHOT/org.codehaus.groovy.alltests-2.9.3-SNAPSHOT-sources.jar
08-Mar-2018 04:23:40 [INFO] Installing /opt/bamboo-home/xml-data/build-dir/GRECLIPSE-E44TP-JOB1/ide-test/org.codehaus.groovy.alltests/target/p2content.xml to /home/bamboo/.m2/repository/org/codehaus/groovy/eclipse/org.codehaus.groovy.alltests/2.9.3-SNAPSHOT/org.codehaus.groovy.alltests-2.9.3-SNAPSHOT-p2metadata.xml
08-Mar-2018 04:23:40 [INFO] Installing /opt/bamboo-home/xml-data/build-dir/GRECLIPSE-E44TP-JOB1/ide-test/org.codehaus.groovy.alltests/target/p2artifacts.xml to /home/bamboo/.m2/repository/org/codehaus/groovy/eclipse/org.codehaus.groovy.alltests/2.9.3-SNAPSHOT/org.codehaus.groovy.alltests-2.9.3-SNAPSHOT-p2artifacts.xml
08-Mar-2018 04:23:40 [INFO]
08-Mar-2018 04:23:40 [INFO] --- tycho-p2-plugin:0.24.0:update-local-index (default-update-local-index) @ org.codehaus.groovy.alltests ---
08-Mar-2018 04:23:40 [INFO]
08-Mar-2018 04:23:40 [INFO] --- maven-deploy-plugin:2.5:deploy (default-deploy) @ org.codehaus.groovy.alltests ---
08-Mar-2018 04:23:40 [INFO] Skipping artifact deployment
08-Mar-2018 04:23:40 [INFO]                                                                         
08-Mar-2018 04:23:40 [INFO] ------------------------------------------------------------------------
08-Mar-2018 04:23:40 [INFO] Building org.codehaus.groovy.alltests.feature 2.9.3-SNAPSHOT
08-Mar-2018 04:23:40 [INFO] ------------------------------------------------------------------------
08-Mar-2018 04:23:41 [INFO]
08-Mar-2018 04:23:41 [INFO] --- maven-clean-plugin:2.5:clean (default-clean) @ org.codehaus.groovy.alltests.feature ---
08-Mar-2018 04:23:41 [INFO] Deleting /opt/bamboo-home/xml-data/build-dir/GRECLIPSE-E44TP-JOB1/ide-test/Feature-org.codehaus.groovy.alltests.feature/target
08-Mar-2018 04:23:41 [INFO]
08-Mar-2018 04:23:41 [INFO] --- tycho-packaging-plugin:0.24.0:build-qualifier-aggregator (default-build-qualifier-aggregator) @ org.codehaus.groovy.alltests.feature ---
08-Mar-2018 04:23:41 [INFO] The project's OSGi version is 2.9.3.xx-201803080255-e44
08-Mar-2018 04:23:41 [INFO]
08-Mar-2018 04:23:41 [INFO] --- tycho-packaging-plugin:0.24.0:validate-id (default-validate-id) @ org.codehaus.groovy.alltests.feature ---
08-Mar-2018 04:23:41 [INFO]
08-Mar-2018 04:23:41 [INFO] --- tycho-packaging-plugin:0.24.0:validate-version (default-validate-version) @ org.codehaus.groovy.alltests.feature ---
08-Mar-2018 04:23:41 [INFO]
08-Mar-2018 04:23:41 [INFO] --- properties-maven-plugin:1.0-alpha-2:read-project-properties (default) @ org.codehaus.groovy.alltests.feature ---
08-Mar-2018 04:23:42 [INFO]
08-Mar-2018 04:23:42 [INFO] --- tycho-source-plugin:0.24.0:plugin-source (plugin-source) @ org.codehaus.groovy.alltests.feature ---
08-Mar-2018 04:23:42 [INFO]
08-Mar-2018 04:23:42 [INFO] --- target-platform-configuration:0.24.0:target-platform (default-target-platform) @ org.codehaus.groovy.alltests.feature ---
08-Mar-2018 04:23:45 [INFO]
08-Mar-2018 04:23:45 [INFO] --- tycho-packaging-plugin:0.24.0:package-feature (default-package-feature) @ org.codehaus.groovy.alltests.feature ---
08-Mar-2018 04:23:46 [INFO] Building jar: /opt/bamboo-home/xml-data/build-dir/GRECLIPSE-E44TP-JOB1/ide-test/Feature-org.codehaus.groovy.alltests.feature/target/org.codehaus.groovy.alltests.feature-2.9.3-SNAPSHOT.jar
08-Mar-2018 04:23:46 [INFO]
08-Mar-2018 04:23:46 [INFO] --- tycho-p2-plugin:0.24.0:p2-metadata-default (default-p2-metadata-default) @ org.codehaus.groovy.alltests.feature ---
08-Mar-2018 04:23:46 [INFO]
08-Mar-2018 04:23:46 [INFO] --- tycho-p2-plugin:0.24.0:feature-p2-metadata (default-feature-p2-metadata) @ org.codehaus.groovy.alltests.feature ---
08-Mar-2018 04:23:46 [INFO]
08-Mar-2018 04:23:46 [INFO] --- maven-jarsigner-plugin:1.2:sign (sign) @ org.codehaus.groovy.alltests.feature ---
08-Mar-2018 04:23:47 [INFO] 1 archive(s) processed
08-Mar-2018 04:23:47 [INFO]
08-Mar-2018 04:23:47 [INFO] --- tycho-source-feature-plugin:0.24.0:source-feature (source-feature) @ org.codehaus.groovy.alltests.feature ---
08-Mar-2018 04:23:48 [INFO] Building jar: /opt/bamboo-home/xml-data/build-dir/GRECLIPSE-E44TP-JOB1/ide-test/Feature-org.codehaus.groovy.alltests.feature/target/org.codehaus.groovy.alltests.feature-2.9.3-SNAPSHOT-sources-feature.jar
08-Mar-2018 04:23:48 [INFO]
08-Mar-2018 04:23:48 [INFO] --- tycho-p2-plugin:0.24.0:p2-metadata (attach-p2-metadata) @ org.codehaus.groovy.alltests.feature ---
08-Mar-2018 04:23:48 [INFO]
08-Mar-2018 04:23:48 [INFO] --- maven-install-plugin:2.3.1:install (default-install) @ org.codehaus.groovy.alltests.feature ---
08-Mar-2018 04:23:48 [INFO] Installing /opt/bamboo-home/xml-data/build-dir/GRECLIPSE-E44TP-JOB1/ide-test/Feature-org.codehaus.groovy.alltests.feature/target/org.codehaus.groovy.alltests.feature-2.9.3-SNAPSHOT.jar to /home/bamboo/.m2/repository/org/codehaus/groovy/eclipse/org.codehaus.groovy.alltests.feature/2.9.3-SNAPSHOT/org.codehaus.groovy.alltests.feature-2.9.3-SNAPSHOT.jar
08-Mar-2018 04:23:48 [INFO] Installing /opt/bamboo-home/xml-data/build-dir/GRECLIPSE-E44TP-JOB1/ide-test/Feature-org.codehaus.groovy.alltests.feature/pom.xml to /home/bamboo/.m2/repository/org/codehaus/groovy/eclipse/org.codehaus.groovy.alltests.feature/2.9.3-SNAPSHOT/org.codehaus.groovy.alltests.feature-2.9.3-SNAPSHOT.pom
08-Mar-2018 04:23:48 [INFO] Installing /opt/bamboo-home/xml-data/build-dir/GRECLIPSE-E44TP-JOB1/ide-test/Feature-org.codehaus.groovy.alltests.feature/target/p2content.xml to /home/bamboo/.m2/repository/org/codehaus/groovy/eclipse/org.codehaus.groovy.alltests.feature/2.9.3-SNAPSHOT/org.codehaus.groovy.alltests.feature-2.9.3-SNAPSHOT-p2metadata.xml
08-Mar-2018 04:23:48 [INFO] Installing /opt/bamboo-home/xml-data/build-dir/GRECLIPSE-E44TP-JOB1/ide-test/Feature-org.codehaus.groovy.alltests.feature/target/p2artifacts.xml to /home/bamboo/.m2/repository/org/codehaus/groovy/eclipse/org.codehaus.groovy.alltests.feature/2.9.3-SNAPSHOT/org.codehaus.groovy.alltests.feature-2.9.3-SNAPSHOT-p2artifacts.xml
08-Mar-2018 04:23:48 [INFO] Installing /opt/bamboo-home/xml-data/build-dir/GRECLIPSE-E44TP-JOB1/ide-test/Feature-org.codehaus.groovy.alltests.feature/target/org.codehaus.groovy.alltests.feature-2.9.3-SNAPSHOT-sources-feature.jar to /home/bamboo/.m2/repository/org/codehaus/groovy/eclipse/org.codehaus.groovy.alltests.feature/2.9.3-SNAPSHOT/org.codehaus.groovy.alltests.feature-2.9.3-SNAPSHOT-sources-feature.jar
08-Mar-2018 04:23:48 [INFO]
08-Mar-2018 04:23:48 [INFO] --- tycho-p2-plugin:0.24.0:update-local-index (default-update-local-index) @ org.codehaus.groovy.alltests.feature ---
08-Mar-2018 04:23:48 [INFO]
08-Mar-2018 04:23:48 [INFO] --- maven-deploy-plugin:2.5:deploy (default-deploy) @ org.codehaus.groovy.alltests.feature ---
08-Mar-2018 04:23:48 [INFO] Skipping artifact deployment
08-Mar-2018 04:23:48 [INFO]                                                                         
08-Mar-2018 04:23:48 [INFO] ------------------------------------------------------------------------
08-Mar-2018 04:23:48 [INFO] Building org.codehaus.groovy.m2eclipse 2.9.3-SNAPSHOT
08-Mar-2018 04:23:48 [INFO] ------------------------------------------------------------------------
08-Mar-2018 04:23:48 [INFO]
08-Mar-2018 04:23:48 [INFO] --- maven-clean-plugin:2.5:clean (default-clean) @ org.codehaus.groovy.m2eclipse ---
08-Mar-2018 04:23:48 [INFO]
08-Mar-2018 04:23:48 [INFO] --- tycho-packaging-plugin:0.24.0:build-qualifier (default-build-qualifier) @ org.codehaus.groovy.m2eclipse ---
08-Mar-2018 04:23:48 [INFO] The project's OSGi version is 2.9.3.xx-201803080255-e44
08-Mar-2018 04:23:48 [INFO]
08-Mar-2018 04:23:48 [INFO] --- tycho-packaging-plugin:0.24.0:validate-id (default-validate-id) @ org.codehaus.groovy.m2eclipse ---
08-Mar-2018 04:23:48 [INFO]
08-Mar-2018 04:23:48 [INFO] --- tycho-packaging-plugin:0.24.0:validate-version (default-validate-version) @ org.codehaus.groovy.m2eclipse ---
08-Mar-2018 04:23:48 [INFO]
08-Mar-2018 04:23:48 [INFO] --- properties-maven-plugin:1.0-alpha-2:read-project-properties (default) @ org.codehaus.groovy.m2eclipse ---
08-Mar-2018 04:23:48 [INFO]
08-Mar-2018 04:23:48 [INFO] --- maven-resources-plugin:2.4.3:resources (default-resources) @ org.codehaus.groovy.m2eclipse ---
08-Mar-2018 04:23:48 [WARNING] Using platform encoding (UTF-8 actually) to copy filtered resources, i.e. build is platform dependent!
08-Mar-2018 04:23:48 [INFO] skip non existing resourceDirectory /opt/bamboo-home/xml-data/build-dir/GRECLIPSE-E44TP-JOB1/extras/org.codehaus.groovy.m2eclipse/src/main/resources
08-Mar-2018 04:23:48 [INFO]
08-Mar-2018 04:23:48 [INFO] --- tycho-compiler-plugin:0.24.0:compile (default-compile) @ org.codehaus.groovy.m2eclipse ---
08-Mar-2018 04:23:48 [INFO] Compiling 2 source files to /opt/bamboo-home/xml-data/build-dir/GRECLIPSE-E44TP-JOB1/extras/org.codehaus.groovy.m2eclipse/target/classes
08-Mar-2018 04:23:50 [INFO]
08-Mar-2018 04:23:50 [INFO] --- maven-resources-plugin:2.4.3:testResources (default-testResources) @ org.codehaus.groovy.m2eclipse ---
08-Mar-2018 04:23:50 [WARNING] Using platform encoding (UTF-8 actually) to copy filtered resources, i.e. build is platform dependent!
08-Mar-2018 04:23:50 [INFO] skip non existing resourceDirectory /opt/bamboo-home/xml-data/build-dir/GRECLIPSE-E44TP-JOB1/extras/org.codehaus.groovy.m2eclipse/src/test/resources
08-Mar-2018 04:23:50 [INFO]
08-Mar-2018 04:23:50 [INFO] --- tycho-source-plugin:0.24.0:plugin-source (plugin-source) @ org.codehaus.groovy.m2eclipse ---
08-Mar-2018 04:23:50 [WARNING] bundle localization file /opt/bamboo-home/xml-data/build-dir/GRECLIPSE-E44TP-JOB1/extras/org.codehaus.groovy.m2eclipse/plugin.properties not found
08-Mar-2018 04:23:50 [INFO] Building jar: /opt/bamboo-home/xml-data/build-dir/GRECLIPSE-E44TP-JOB1/extras/org.codehaus.groovy.m2eclipse/target/org.codehaus.groovy.m2eclipse-2.9.3-SNAPSHOT-sources.jar
08-Mar-2018 04:23:50 [INFO]
08-Mar-2018 04:23:50 [INFO] --- target-platform-configuration:0.24.0:target-platform (default-target-platform) @ org.codehaus.groovy.m2eclipse ---
08-Mar-2018 04:23:50 [INFO]
08-Mar-2018 04:23:50 [INFO] --- tycho-packaging-plugin:0.24.0:package-plugin (default-package-plugin) @ org.codehaus.groovy.m2eclipse ---
08-Mar-2018 04:23:50 [INFO] Building jar: /opt/bamboo-home/xml-data/build-dir/GRECLIPSE-E44TP-JOB1/extras/org.codehaus.groovy.m2eclipse/target/org.codehaus.groovy.m2eclipse-2.9.3-SNAPSHOT.jar
08-Mar-2018 04:23:50 [INFO]
08-Mar-2018 04:23:50 [INFO] --- tycho-p2-plugin:0.24.0:p2-metadata-default (default-p2-metadata-default) @ org.codehaus.groovy.m2eclipse ---
08-Mar-2018 04:23:50 [INFO]
08-Mar-2018 04:23:50 [INFO] --- maven-jarsigner-plugin:1.2:sign (sign) @ org.codehaus.groovy.m2eclipse ---
08-Mar-2018 04:23:51 [INFO] 2 archive(s) processed
08-Mar-2018 04:23:51 [INFO]
08-Mar-2018 04:23:51 [INFO] --- tycho-source-feature-plugin:0.24.0:source-feature (source-feature) @ org.codehaus.groovy.m2eclipse ---
08-Mar-2018 04:23:51 [INFO]
08-Mar-2018 04:23:51 [INFO] --- tycho-p2-plugin:0.24.0:p2-metadata (attach-p2-metadata) @ org.codehaus.groovy.m2eclipse ---
08-Mar-2018 04:23:51 [INFO]
08-Mar-2018 04:23:51 [INFO] --- maven-install-plugin:2.3.1:install (default-install) @ org.codehaus.groovy.m2eclipse ---
08-Mar-2018 04:23:51 [INFO] Installing /opt/bamboo-home/xml-data/build-dir/GRECLIPSE-E44TP-JOB1/extras/org.codehaus.groovy.m2eclipse/target/org.codehaus.groovy.m2eclipse-2.9.3-SNAPSHOT.jar to /home/bamboo/.m2/repository/org/codehaus/groovy/eclipse/org.codehaus.groovy.m2eclipse/2.9.3-SNAPSHOT/org.codehaus.groovy.m2eclipse-2.9.3-SNAPSHOT.jar
08-Mar-2018 04:23:51 [INFO] Installing /opt/bamboo-home/xml-data/build-dir/GRECLIPSE-E44TP-JOB1/extras/org.codehaus.groovy.m2eclipse/pom.xml to /home/bamboo/.m2/repository/org/codehaus/groovy/eclipse/org.codehaus.groovy.m2eclipse/2.9.3-SNAPSHOT/org.codehaus.groovy.m2eclipse-2.9.3-SNAPSHOT.pom
08-Mar-2018 04:23:51 [INFO] Installing /opt/bamboo-home/xml-data/build-dir/GRECLIPSE-E44TP-JOB1/extras/org.codehaus.groovy.m2eclipse/target/org.codehaus.groovy.m2eclipse-2.9.3-SNAPSHOT-sources.jar to /home/bamboo/.m2/repository/org/codehaus/groovy/eclipse/org.codehaus.groovy.m2eclipse/2.9.3-SNAPSHOT/org.codehaus.groovy.m2eclipse-2.9.3-SNAPSHOT-sources.jar
08-Mar-2018 04:23:51 [INFO] Installing /opt/bamboo-home/xml-data/build-dir/GRECLIPSE-E44TP-JOB1/extras/org.codehaus.groovy.m2eclipse/target/p2content.xml to /home/bamboo/.m2/repository/org/codehaus/groovy/eclipse/org.codehaus.groovy.m2eclipse/2.9.3-SNAPSHOT/org.codehaus.groovy.m2eclipse-2.9.3-SNAPSHOT-p2metadata.xml
08-Mar-2018 04:23:51 [INFO] Installing /opt/bamboo-home/xml-data/build-dir/GRECLIPSE-E44TP-JOB1/extras/org.codehaus.groovy.m2eclipse/target/p2artifacts.xml to /home/bamboo/.m2/repository/org/codehaus/groovy/eclipse/org.codehaus.groovy.m2eclipse/2.9.3-SNAPSHOT/org.codehaus.groovy.m2eclipse-2.9.3-SNAPSHOT-p2artifacts.xml
08-Mar-2018 04:23:51 [INFO]
08-Mar-2018 04:23:51 [INFO] --- tycho-p2-plugin:0.24.0:update-local-index (default-update-local-index) @ org.codehaus.groovy.m2eclipse ---
08-Mar-2018 04:23:51 [INFO]
08-Mar-2018 04:23:51 [INFO] --- maven-deploy-plugin:2.5:deploy (default-deploy) @ org.codehaus.groovy.m2eclipse ---
08-Mar-2018 04:23:51 [INFO] Skipping artifact deployment
08-Mar-2018 04:23:51 [INFO]                                                                         
08-Mar-2018 04:23:51 [INFO] ------------------------------------------------------------------------
08-Mar-2018 04:23:51 [INFO] Building org.codehaus.groovy.m2eclipse.feature 2.9.3-SNAPSHOT
08-Mar-2018 04:23:51 [INFO] ------------------------------------------------------------------------
08-Mar-2018 04:23:51 [INFO]
08-Mar-2018 04:23:51 [INFO] --- maven-clean-plugin:2.5:clean (default-clean) @ org.codehaus.groovy.m2eclipse.feature ---
08-Mar-2018 04:23:51 [INFO] Deleting /opt/bamboo-home/xml-data/build-dir/GRECLIPSE-E44TP-JOB1/extras/Feature-org.codehaus.groovy.m2eclipse/target
08-Mar-2018 04:23:51 [INFO]
08-Mar-2018 04:23:51 [INFO] --- tycho-packaging-plugin:0.24.0:build-qualifier-aggregator (default-build-qualifier-aggregator) @ org.codehaus.groovy.m2eclipse.feature ---
08-Mar-2018 04:23:51 [INFO] The project's OSGi version is 2.9.3.xx-201803080255-e44
08-Mar-2018 04:23:51 [INFO]
08-Mar-2018 04:23:51 [INFO] --- tycho-packaging-plugin:0.24.0:validate-id (default-validate-id) @ org.codehaus.groovy.m2eclipse.feature ---
08-Mar-2018 04:23:51 [INFO]
08-Mar-2018 04:23:51 [INFO] --- tycho-packaging-plugin:0.24.0:validate-version (default-validate-version) @ org.codehaus.groovy.m2eclipse.feature ---
08-Mar-2018 04:23:51 [INFO]
08-Mar-2018 04:23:51 [INFO] --- properties-maven-plugin:1.0-alpha-2:read-project-properties (default) @ org.codehaus.groovy.m2eclipse.feature ---
08-Mar-2018 04:23:51 [INFO]
08-Mar-2018 04:23:51 [INFO] --- tycho-source-plugin:0.24.0:plugin-source (plugin-source) @ org.codehaus.groovy.m2eclipse.feature ---
08-Mar-2018 04:23:52 [INFO]
08-Mar-2018 04:23:52 [INFO] --- target-platform-configuration:0.24.0:target-platform (default-target-platform) @ org.codehaus.groovy.m2eclipse.feature ---
08-Mar-2018 04:23:52 [INFO]
08-Mar-2018 04:23:52 [INFO] --- tycho-packaging-plugin:0.24.0:package-feature (default-package-feature) @ org.codehaus.groovy.m2eclipse.feature ---
08-Mar-2018 04:23:52 [INFO] Building jar: /opt/bamboo-home/xml-data/build-dir/GRECLIPSE-E44TP-JOB1/extras/Feature-org.codehaus.groovy.m2eclipse/target/org.codehaus.groovy.m2eclipse.feature-2.9.3-SNAPSHOT.jar
08-Mar-2018 04:23:52 [INFO]
08-Mar-2018 04:23:52 [INFO] --- tycho-p2-plugin:0.24.0:p2-metadata-default (default-p2-metadata-default) @ org.codehaus.groovy.m2eclipse.feature ---
08-Mar-2018 04:23:52 [INFO]
08-Mar-2018 04:23:52 [INFO] --- tycho-p2-plugin:0.24.0:feature-p2-metadata (default-feature-p2-metadata) @ org.codehaus.groovy.m2eclipse.feature ---
08-Mar-2018 04:23:52 [INFO]
08-Mar-2018 04:23:52 [INFO] --- maven-jarsigner-plugin:1.2:sign (sign) @ org.codehaus.groovy.m2eclipse.feature ---
08-Mar-2018 04:23:52 [INFO] 1 archive(s) processed
08-Mar-2018 04:23:52 [INFO]
08-Mar-2018 04:23:52 [INFO] --- tycho-source-feature-plugin:0.24.0:source-feature (source-feature) @ org.codehaus.groovy.m2eclipse.feature ---
08-Mar-2018 04:23:52 [INFO] Building jar: /opt/bamboo-home/xml-data/build-dir/GRECLIPSE-E44TP-JOB1/extras/Feature-org.codehaus.groovy.m2eclipse/target/org.codehaus.groovy.m2eclipse.feature-2.9.3-SNAPSHOT-sources-feature.jar
08-Mar-2018 04:23:52 [INFO]
08-Mar-2018 04:23:52 [INFO] --- tycho-p2-plugin:0.24.0:p2-metadata (attach-p2-metadata) @ org.codehaus.groovy.m2eclipse.feature ---
08-Mar-2018 04:23:52 [INFO]
08-Mar-2018 04:23:52 [INFO] --- maven-install-plugin:2.3.1:install (default-install) @ org.codehaus.groovy.m2eclipse.feature ---
08-Mar-2018 04:23:52 [INFO] Installing /opt/bamboo-home/xml-data/build-dir/GRECLIPSE-E44TP-JOB1/extras/Feature-org.codehaus.groovy.m2eclipse/target/org.codehaus.groovy.m2eclipse.feature-2.9.3-SNAPSHOT.jar to /home/bamboo/.m2/repository/org/codehaus/groovy/eclipse/org.codehaus.groovy.m2eclipse.feature/2.9.3-SNAPSHOT/org.codehaus.groovy.m2eclipse.feature-2.9.3-SNAPSHOT.jar
08-Mar-2018 04:23:52 [INFO] Installing /opt/bamboo-home/xml-data/build-dir/GRECLIPSE-E44TP-JOB1/extras/Feature-org.codehaus.groovy.m2eclipse/pom.xml to /home/bamboo/.m2/repository/org/codehaus/groovy/eclipse/org.codehaus.groovy.m2eclipse.feature/2.9.3-SNAPSHOT/org.codehaus.groovy.m2eclipse.feature-2.9.3-SNAPSHOT.pom
08-Mar-2018 04:23:53 [INFO] Installing /opt/bamboo-home/xml-data/build-dir/GRECLIPSE-E44TP-JOB1/extras/Feature-org.codehaus.groovy.m2eclipse/target/p2content.xml to /home/bamboo/.m2/repository/org/codehaus/groovy/eclipse/org.codehaus.groovy.m2eclipse.feature/2.9.3-SNAPSHOT/org.codehaus.groovy.m2eclipse.feature-2.9.3-SNAPSHOT-p2metadata.xml
08-Mar-2018 04:23:53 [INFO] Installing /opt/bamboo-home/xml-data/build-dir/GRECLIPSE-E44TP-JOB1/extras/Feature-org.codehaus.groovy.m2eclipse/target/p2artifacts.xml to /home/bamboo/.m2/repository/org/codehaus/groovy/eclipse/org.codehaus.groovy.m2eclipse.feature/2.9.3-SNAPSHOT/org.codehaus.groovy.m2eclipse.feature-2.9.3-SNAPSHOT-p2artifacts.xml
08-Mar-2018 04:23:53 [INFO] Installing /opt/bamboo-home/xml-data/build-dir/GRECLIPSE-E44TP-JOB1/extras/Feature-org.codehaus.groovy.m2eclipse/target/org.codehaus.groovy.m2eclipse.feature-2.9.3-SNAPSHOT-sources-feature.jar to /home/bamboo/.m2/repository/org/codehaus/groovy/eclipse/org.codehaus.groovy.m2eclipse.feature/2.9.3-SNAPSHOT/org.codehaus.groovy.m2eclipse.feature-2.9.3-SNAPSHOT-sources-feature.jar
08-Mar-2018 04:23:53 [INFO]
08-Mar-2018 04:23:53 [INFO] --- tycho-p2-plugin:0.24.0:update-local-index (default-update-local-index) @ org.codehaus.groovy.m2eclipse.feature ---
08-Mar-2018 04:23:53 [INFO]
08-Mar-2018 04:23:53 [INFO] --- maven-deploy-plugin:2.5:deploy (default-deploy) @ org.codehaus.groovy.m2eclipse.feature ---
08-Mar-2018 04:23:53 [INFO] Skipping artifact deployment
08-Mar-2018 04:23:53 [INFO]                                                                         
08-Mar-2018 04:23:53 [INFO] ------------------------------------------------------------------------
08-Mar-2018 04:23:53 [INFO] Building org.codehaus.groovy.eclipse.site 2.9.3-SNAPSHOT
08-Mar-2018 04:23:53 [INFO] ------------------------------------------------------------------------
08-Mar-2018 04:23:53 [INFO]
08-Mar-2018 04:23:53 [INFO] --- maven-clean-plugin:2.5:clean (default-clean) @ org.codehaus.groovy.eclipse.site ---
08-Mar-2018 04:23:53 [INFO]
08-Mar-2018 04:23:53 [INFO] --- tycho-packaging-plugin:0.24.0:build-qualifier (default-build-qualifier) @ org.codehaus.groovy.eclipse.site ---
08-Mar-2018 04:23:53 [INFO] The project's OSGi version is 2.9.3.xx-201803080255-e44
08-Mar-2018 04:23:53 [INFO]
08-Mar-2018 04:23:53 [INFO] --- properties-maven-plugin:1.0-alpha-2:read-project-properties (default) @ org.codehaus.groovy.eclipse.site ---
08-Mar-2018 04:23:53 [INFO]
08-Mar-2018 04:23:53 [INFO] --- tycho-source-plugin:0.24.0:plugin-source (plugin-source) @ org.codehaus.groovy.eclipse.site ---
08-Mar-2018 04:23:53 [INFO]
08-Mar-2018 04:23:53 [INFO] --- tycho-packaging-plugin:0.24.0:update-site (default-update-site) @ org.codehaus.groovy.eclipse.site ---
08-Mar-2018 04:23:54 [INFO]
08-Mar-2018 04:23:54 [INFO] --- tycho-p2-plugin:0.24.0:update-site-p2-metadata (default-update-site-p2-metadata) @ org.codehaus.groovy.eclipse.site ---
08-Mar-2018 04:23:55 [INFO] Command line:
08-Mar-2018 04:23:55         [/opt/jdk1.7.0_80/jre/bin/java, -jar, /opt/users/bamboo/.m2/repository/org/eclipse/tycho/tycho-bundles-external/0.24.0/eclipse/plugins/org.eclipse.equinox.launcher_1.3.100.v20150511-1540.jar, -configuration, /tmp/GRECLIPSE-E44TP-JOB1/tycho-p2-runtime4039112916784971700.tmp/configuration, -nosplash, -application, org.eclipse.equinox.p2.publisher.UpdateSitePublisher, -source, /opt/bamboo-home/xml-data/build-dir/GRECLIPSE-E44TP-JOB1/Site-org.codehaus.groovy.eclipse/target/site, -metadataRepository, file:/opt/bamboo-home/xml-data/build-dir/GRECLIPSE-E44TP-JOB1/Site-org.codehaus.groovy.eclipse/target/site/, -metadataRepositoryName, org.codehaus.groovy.eclipse.site, -artifactRepository, file:/opt/bamboo-home/xml-data/build-dir/GRECLIPSE-E44TP-JOB1/Site-org.codehaus.groovy.eclipse/target/site/, -artifactRepositoryName, org.codehaus.groovy.eclipse.site Artifacts, -noDefaultIUs, -compress]
08-Mar-2018 04:23:57 Generating metadata for ..
08-Mar-2018 04:23:58 Generation completed with success [0 seconds].
08-Mar-2018 04:23:58 [INFO]
08-Mar-2018 04:23:58 [INFO] --- tycho-packaging-plugin:0.24.0:update-site-packaging (default-update-site-packaging) @ org.codehaus.groovy.eclipse.site ---
08-Mar-2018 04:23:58 [INFO] Building zip: /opt/bamboo-home/xml-data/build-dir/GRECLIPSE-E44TP-JOB1/Site-org.codehaus.groovy.eclipse/target/site.zip
08-Mar-2018 04:23:58 [INFO]
08-Mar-2018 04:23:58 [INFO] --- maven-jarsigner-plugin:1.2:sign (sign) @ org.codehaus.groovy.eclipse.site ---
08-Mar-2018 04:23:58 [INFO] 1 archive(s) processed
08-Mar-2018 04:23:58 [INFO]
08-Mar-2018 04:23:58 [INFO] --- tycho-source-feature-plugin:0.24.0:source-feature (source-feature) @ org.codehaus.groovy.eclipse.site ---
08-Mar-2018 04:23:58 [INFO]
08-Mar-2018 04:23:58 [INFO] --- tycho-p2-plugin:0.24.0:p2-metadata (attach-p2-metadata) @ org.codehaus.groovy.eclipse.site ---
08-Mar-2018 04:23:58 [INFO]
08-Mar-2018 04:23:58 [INFO] --- maven-install-plugin:2.3.1:install (default-install) @ org.codehaus.groovy.eclipse.site ---
08-Mar-2018 04:23:58 [INFO] Installing /opt/bamboo-home/xml-data/build-dir/GRECLIPSE-E44TP-JOB1/Site-org.codehaus.groovy.eclipse/target/site.zip to /home/bamboo/.m2/repository/org/codehaus/groovy/eclipse/org.codehaus.groovy.eclipse.site/2.9.3-SNAPSHOT/org.codehaus.groovy.eclipse.site-2.9.3-SNAPSHOT.zip
08-Mar-2018 04:23:58 [INFO] Installing /opt/bamboo-home/xml-data/build-dir/GRECLIPSE-E44TP-JOB1/Site-org.codehaus.groovy.eclipse/pom.xml to /home/bamboo/.m2/repository/org/codehaus/groovy/eclipse/org.codehaus.groovy.eclipse.site/2.9.3-SNAPSHOT/org.codehaus.groovy.eclipse.site-2.9.3-SNAPSHOT.pom
08-Mar-2018 04:23:59 [INFO]
08-Mar-2018 04:23:59 [INFO] --- maven-deploy-plugin:2.5:deploy (default-deploy) @ org.codehaus.groovy.eclipse.site ---
08-Mar-2018 04:23:59 [INFO] Skipping artifact deployment
08-Mar-2018 04:23:59 [INFO]
08-Mar-2018 04:23:59 [INFO] --- maven-antrun-plugin:1.6:run (upload-dist) @ org.codehaus.groovy.eclipse.site ---
08-Mar-2018 04:24:00 [INFO] Executing tasks
08-Mar-2018 04:24:00
08-Mar-2018 04:24:00 main:
08-Mar-2018 04:24:00      [echo] Uploading main update site to s3..."
08-Mar-2018 04:24:00      [echo] ==== dist props are set so we can deploy? ===
08-Mar-2018 04:24:00      [echo] bamboo.s3.properties=${bamboo.s3.properties}
08-Mar-2018 04:24:00      [echo] dist_properties=/home/bamboo/tools/s3.properties
08-Mar-2018 04:24:00      [echo] env.bamboo_s3_properties_rel=/home/bamboo/tools/s3.properties
08-Mar-2018 04:24:00      [echo] dist.accessKey=AKIAJKUKWKYLMXOFIFDA
08-Mar-2018 04:24:00      [echo] accessKey=AKIAIBYM5QE7XBKC6JJQ
08-Mar-2018 04:24:00      [echo] site.target.dir=/opt/bamboo-home/xml-data/build-dir/GRECLIPSE-E44TP-JOB1/Site-org.codehaus.groovy.eclipse/target
08-Mar-2018 04:24:00      [echo] unqualifiedVersion=2.9.3
08-Mar-2018 04:24:00      [echo] buildQualifier=xx-201803080255-e44
08-Mar-2018 04:24:00      [echo] dist.full.version=2.9.3.xx-201803080255-e44
08-Mar-2018 04:24:00      [echo] dist.file.name=org.codehaus.groovy-2.9.3.xx-201803080255-e44-updatesite.zip
08-Mar-2018 04:24:00       [zip] Building zip: /opt/bamboo-home/xml-data/build-dir/GRECLIPSE-E44TP-JOB1/Site-org.codehaus.groovy.eclipse/target/site/org.codehaus.groovy-2.9.3.xx-201803080255-e44-updatesite.zip
08-Mar-2018 04:24:07      [echo] Preparing for upload... This will happen:
08-Mar-2018 04:24:07      [echo] Will Delete:
08-Mar-2018 04:24:07      [echo] dist.bucket=dist.springsource.org
08-Mar-2018 04:24:07      [echo] dist.path=snapshot/GRECLIPSE/e4.4
08-Mar-2018 04:24:07      [echo] Will Upload:
08-Mar-2018 04:24:07      [echo] dist.bucket=dist.springsource.org
08-Mar-2018 04:24:07      [echo] toDir=snapshot/GRECLIPSE/e4.4
08-Mar-2018 04:24:07      [echo] fromDir=/opt/bamboo-home/xml-data/build-dir/GRECLIPSE-E44TP-JOB1/Site-org.codehaus.groovy.eclipse/target/site
08-Mar-2018 04:24:07      [echo] Will Upload:
08-Mar-2018 04:24:07      [echo] dist.bucket=dist.springsource.org
08-Mar-2018 04:24:07      [echo] toFile=snapshot/GRECLIPSE/e4.4/org.codehaus.groovy-2.9.3.xx-201803080255-e44-updatesite.zip
08-Mar-2018 04:24:07      [echo] fromFile=snapshot/GRECLIPSE/e4.4/org.codehaus.groovy-2.9.3.xx-201803080255-e44-updatesite.zip
08-Mar-2018 04:24:07      [echo] metadata project.name=Groovy Eclipse
08-Mar-2018 04:24:07      [echo] metadata release.type=snapshot
08-Mar-2018 04:24:07      [echo] metadata bundle.version=2.9.3.xx-201803080255-e44
08-Mar-2018 04:24:07      [echo] metadata package.file.name=org.codehaus.groovy-2.9.3.xx-201803080255-e44-updatesite.zip
08-Mar-2018 04:24:14 Deleted s3://dist.springsource.org/snapshot/GRECLIPSE/e4.4/artifacts.jar
08-Mar-2018 04:24:14 Deleted s3://dist.springsource.org/snapshot/GRECLIPSE/e4.4/content.jar
08-Mar-2018 04:24:14 Deleted s3://dist.springsource.org/snapshot/GRECLIPSE/e4.4/features/
08-Mar-2018 04:24:15 Deleted s3://dist.springsource.org/snapshot/GRECLIPSE/e4.4/features/org.codehaus.groovy.compilerless.feature_2.9.3.xx-201802021952-e44.jar
08-Mar-2018 04:24:15 Deleted s3://dist.springsource.org/snapshot/GRECLIPSE/e4.4/features/org.codehaus.groovy.eclipse.feature_2.9.3.xx-201802021952-e44.jar
08-Mar-2018 04:24:15 Deleted s3://dist.springsource.org/snapshot/GRECLIPSE/e4.4/features/org.codehaus.groovy.headless.feature_2.9.3.xx-201802021952-e44.jar
08-Mar-2018 04:24:15 Deleted s3://dist.springsource.org/snapshot/GRECLIPSE/e4.4/features/org.codehaus.groovy.jdt.patch_2.9.3.xx-201802021952-e44.jar
08-Mar-2018 04:24:15 Deleted s3://dist.springsource.org/snapshot/GRECLIPSE/e4.4/features/org.codehaus.groovy.m2eclipse.feature_2.9.3.xx-201802021952-e44.jar
08-Mar-2018 04:24:15 Deleted s3://dist.springsource.org/snapshot/GRECLIPSE/e4.4/features/org.codehaus.groovy18.feature_2.9.3.xx-201802021952-e44.jar
08-Mar-2018 04:24:15 Deleted s3://dist.springsource.org/snapshot/GRECLIPSE/e4.4/features/org.codehaus.groovy20.feature_2.9.3.xx-201802021952-e44.jar
08-Mar-2018 04:24:15 Deleted s3://dist.springsource.org/snapshot/GRECLIPSE/e4.4/features/org.codehaus.groovy21.feature_2.9.3.xx-201802021952-e44.jar
08-Mar-2018 04:24:15 Deleted s3://dist.springsource.org/snapshot/GRECLIPSE/e4.4/features/org.codehaus.groovy22.feature_2.9.3.xx-201802021952-e44.jar
08-Mar-2018 04:24:15 Deleted s3://dist.springsource.org/snapshot/GRECLIPSE/e4.4/features/org.codehaus.groovy23.feature_2.9.3.xx-201802021952-e44.jar
08-Mar-2018 04:24:15 Deleted s3://dist.springsource.org/snapshot/GRECLIPSE/e4.4/features/org.codehaus.groovy24.feature_2.9.3.xx-201802021952-e44.jar
08-Mar-2018 04:24:16 Deleted s3://dist.springsource.org/snapshot/GRECLIPSE/e4.4/features/org.codehaus.groovy25.feature_2.9.3.xx-201802021952-e44.jar
08-Mar-2018 04:24:16 Deleted s3://dist.springsource.org/snapshot/GRECLIPSE/e4.4/plugins/
08-Mar-2018 04:24:16 Deleted s3://dist.springsource.org/snapshot/GRECLIPSE/e4.4/plugins/org.codehaus.groovy.eclipse.ant_2.9.3.xx-201802021952-e44.jar
08-Mar-2018 04:24:16 Deleted s3://dist.springsource.org/snapshot/GRECLIPSE/e4.4/plugins/org.codehaus.groovy.eclipse.astviews_2.9.3.xx-201802021952-e44.jar
08-Mar-2018 04:24:16 Deleted s3://dist.springsource.org/snapshot/GRECLIPSE/e4.4/plugins/org.codehaus.groovy.eclipse.codeassist.completion_2.9.3.xx-201802021952-e44.jar
08-Mar-2018 04:24:16 Deleted s3://dist.springsource.org/snapshot/GRECLIPSE/e4.4/plugins/org.codehaus.groovy.eclipse.codebrowsing_2.9.3.xx-201802021952-e44.jar
08-Mar-2018 04:24:16 Deleted s3://dist.springsource.org/snapshot/GRECLIPSE/e4.4/plugins/org.codehaus.groovy.eclipse.compilerResolver_2.9.3.xx-201802021952-e44.jar
08-Mar-2018 04:24:16 Deleted s3://dist.springsource.org/snapshot/GRECLIPSE/e4.4/plugins/org.codehaus.groovy.eclipse.core_2.9.3.xx-201802021952-e44.jar
08-Mar-2018 04:24:16 Deleted s3://dist.springsource.org/snapshot/GRECLIPSE/e4.4/plugins/org.codehaus.groovy.eclipse.dsl_2.9.3.xx-201802021952-e44.jar
08-Mar-2018 04:24:16 Deleted s3://dist.springsource.org/snapshot/GRECLIPSE/e4.4/plugins/org.codehaus.groovy.eclipse.quickfix_2.9.3.xx-201802021952-e44.jar
08-Mar-2018 04:24:16 Deleted s3://dist.springsource.org/snapshot/GRECLIPSE/e4.4/plugins/org.codehaus.groovy.eclipse.refactoring_2.9.3.xx-201802021952-e44.jar
08-Mar-2018 04:24:17 Deleted s3://dist.springsource.org/snapshot/GRECLIPSE/e4.4/plugins/org.codehaus.groovy.eclipse.ui_2.9.3.xx-201802021952-e44.jar
08-Mar-2018 04:24:17 Deleted s3://dist.springsource.org/snapshot/GRECLIPSE/e4.4/plugins/org.codehaus.groovy.eclipse_2.9.3.xx-201802021952-e44.jar
08-Mar-2018 04:24:17 Deleted s3://dist.springsource.org/snapshot/GRECLIPSE/e4.4/plugins/org.codehaus.groovy.m2eclipse_2.9.3.xx-201802021952-e44.jar
08-Mar-2018 04:24:17 Deleted s3://dist.springsource.org/snapshot/GRECLIPSE/e4.4/plugins/org.codehaus.groovy_1.8.9.xx-201802021952-e44.jar
08-Mar-2018 04:24:17 Deleted s3://dist.springsource.org/snapshot/GRECLIPSE/e4.4/plugins/org.codehaus.groovy_2.0.8.xx-201802021952-e44.jar
08-Mar-2018 04:24:17 Deleted s3://dist.springsource.org/snapshot/GRECLIPSE/e4.4/plugins/org.codehaus.groovy_2.1.9.xx-201802021952-e44.jar
08-Mar-2018 04:24:17 Deleted s3://dist.springsource.org/snapshot/GRECLIPSE/e4.4/plugins/org.codehaus.groovy_2.2.2.xx-201802021952-e44.jar
08-Mar-2018 04:24:17 Deleted s3://dist.springsource.org/snapshot/GRECLIPSE/e4.4/plugins/org.codehaus.groovy_2.3.11.xx-201802021952-e44.jar
08-Mar-2018 04:24:17 Deleted s3://dist.springsource.org/snapshot/GRECLIPSE/e4.4/plugins/org.codehaus.groovy_2.4.13.xx-201802021952-e44.jar
08-Mar-2018 04:24:17 Deleted s3://dist.springsource.org/snapshot/GRECLIPSE/e4.4/plugins/org.codehaus.groovy_2.5.0.xx-201802021952-e44.jar
08-Mar-2018 04:24:18 Deleted s3://dist.springsource.org/snapshot/GRECLIPSE/e4.4/plugins/org.eclipse.jdt.core_3.10.2.xx-201802021952-e44.jar
08-Mar-2018 04:24:18 Deleted s3://dist.springsource.org/snapshot/GRECLIPSE/e4.4/plugins/org.eclipse.jdt.groovy.core_2.9.3.xx-201802021952-e44.jar
08-Mar-2018 04:24:18 Deleted s3://dist.springsource.org/snapshot/GRECLIPSE/e4.4/site.xml
08-Mar-2018 04:24:18 Uploading /opt/bamboo-home/xml-data/build-dir/GRECLIPSE-E44TP-JOB1/Site-org.codehaus.groovy.eclipse/target/site/artifacts.jar (1.9 KB) to s3://dist.springsource.org/snapshot/GRECLIPSE/e4.4/artifacts.jar
08-Mar-2018 04:24:18 Transfer Time: .2 s - Transfer Rate: 10.5 KB/s
08-Mar-2018 04:24:18 Uploading /opt/bamboo-home/xml-data/build-dir/GRECLIPSE-E44TP-JOB1/Site-org.codehaus.groovy.eclipse/target/site/content.jar (17.2 KB) to s3://dist.springsource.org/snapshot/GRECLIPSE/e4.4/content.jar
08-Mar-2018 04:24:19 Transfer Time: .2 s - Transfer Rate: 75.1 KB/s
08-Mar-2018 04:24:19 Uploading /opt/bamboo-home/xml-data/build-dir/GRECLIPSE-E44TP-JOB1/Site-org.codehaus.groovy.eclipse/target/site/features/org.codehaus.groovy.compilerless.feature_2.9.3.xx-201803080255-e44.jar (15.7 KB) to s3://dist.springsource.org/snapshot/GRECLIPSE/e4.4/features/org.codehaus.groovy.compilerless.feature_2.9.3.xx-201803080255-e44.jar
08-Mar-2018 04:24:19 Transfer Time: .2 s - Transfer Rate: 76.6 KB/s
08-Mar-2018 04:24:20 Uploading /opt/bamboo-home/xml-data/build-dir/GRECLIPSE-E44TP-JOB1/Site-org.codehaus.groovy.eclipse/target/site/features/org.codehaus.groovy.eclipse.feature_2.9.3.xx-201803080255-e44.jar (15.2 KB) to s3://dist.springsource.org/snapshot/GRECLIPSE/e4.4/features/org.codehaus.groovy.eclipse.feature_2.9.3.xx-201803080255-e44.jar
08-Mar-2018 04:24:20 Transfer Time: .2 s - Transfer Rate: 62.4 KB/s
08-Mar-2018 04:24:20 Uploading /opt/bamboo-home/xml-data/build-dir/GRECLIPSE-E44TP-JOB1/Site-org.codehaus.groovy.eclipse/target/site/features/org.codehaus.groovy.headless.feature_2.9.3.xx-201803080255-e44.jar (15.5 KB) to s3://dist.springsource.org/snapshot/GRECLIPSE/e4.4/features/org.codehaus.groovy.headless.feature_2.9.3.xx-201803080255-e44.jar
08-Mar-2018 04:24:20 Transfer Time: .2 s - Transfer Rate: 88.5 KB/s
08-Mar-2018 04:24:21 Uploading /opt/bamboo-home/xml-data/build-dir/GRECLIPSE-E44TP-JOB1/Site-org.codehaus.groovy.eclipse/target/site/features/org.codehaus.groovy.jdt.patch_2.9.3.xx-201803080255-e44.jar (9.6 KB) to s3://dist.springsource.org/snapshot/GRECLIPSE/e4.4/features/org.codehaus.groovy.jdt.patch_2.9.3.xx-201803080255-e44.jar
08-Mar-2018 04:24:21 Transfer Time: .2 s - Transfer Rate: 50.8 KB/s
08-Mar-2018 04:24:21 Uploading /opt/bamboo-home/xml-data/build-dir/GRECLIPSE-E44TP-JOB1/Site-org.codehaus.groovy.eclipse/target/site/features/org.codehaus.groovy.m2eclipse.feature_2.9.3.xx-201803080255-e44.jar (15.2 KB) to s3://dist.springsource.org/snapshot/GRECLIPSE/e4.4/features/org.codehaus.groovy.m2eclipse.feature_2.9.3.xx-201803080255-e44.jar
08-Mar-2018 04:24:21 Transfer Time: .2 s - Transfer Rate: 84.7 KB/s
08-Mar-2018 04:24:22 Uploading /opt/bamboo-home/xml-data/build-dir/GRECLIPSE-E44TP-JOB1/Site-org.codehaus.groovy.eclipse/target/site/features/org.codehaus.groovy18.feature_2.9.3.xx-201803080255-e44.jar (15.3 KB) to s3://dist.springsource.org/snapshot/GRECLIPSE/e4.4/features/org.codehaus.groovy18.feature_2.9.3.xx-201803080255-e44.jar
08-Mar-2018 04:24:23 Transfer Time: .3 s - Transfer Rate: 60.8 KB/s
08-Mar-2018 04:24:23 Uploading /opt/bamboo-home/xml-data/build-dir/GRECLIPSE-E44TP-JOB1/Site-org.codehaus.groovy.eclipse/target/site/features/org.codehaus.groovy20.feature_2.9.3.xx-201803080255-e44.jar (15.3 KB) to s3://dist.springsource.org/snapshot/GRECLIPSE/e4.4/features/org.codehaus.groovy20.feature_2.9.3.xx-201803080255-e44.jar
08-Mar-2018 04:24:23 Transfer Time: .2 s - Transfer Rate: 95.7 KB/s
08-Mar-2018 04:24:23 Uploading /opt/bamboo-home/xml-data/build-dir/GRECLIPSE-E44TP-JOB1/Site-org.codehaus.groovy.eclipse/target/site/features/org.codehaus.groovy21.feature_2.9.3.xx-201803080255-e44.jar (15.3 KB) to s3://dist.springsource.org/snapshot/GRECLIPSE/e4.4/features/org.codehaus.groovy21.feature_2.9.3.xx-201803080255-e44.jar
08-Mar-2018 04:24:24 Transfer Time: .2 s - Transfer Rate: 84.1 KB/s
08-Mar-2018 04:24:24 Uploading /opt/bamboo-home/xml-data/build-dir/GRECLIPSE-E44TP-JOB1/Site-org.codehaus.groovy.eclipse/target/site/features/org.codehaus.groovy22.feature_2.9.3.xx-201803080255-e44.jar (15.3 KB) to s3://dist.springsource.org/snapshot/GRECLIPSE/e4.4/features/org.codehaus.groovy22.feature_2.9.3.xx-201803080255-e44.jar
08-Mar-2018 04:24:24 Transfer Time: .2 s - Transfer Rate: 80.2 KB/s
08-Mar-2018 04:24:25 Uploading /opt/bamboo-home/xml-data/build-dir/GRECLIPSE-E44TP-JOB1/Site-org.codehaus.groovy.eclipse/target/site/features/org.codehaus.groovy23.feature_2.9.3.xx-201803080255-e44.jar (15.3 KB) to s3://dist.springsource.org/snapshot/GRECLIPSE/e4.4/features/org.codehaus.groovy23.feature_2.9.3.xx-201803080255-e44.jar
08-Mar-2018 04:24:25 Transfer Time: .2 s - Transfer Rate: 92.8 KB/s
08-Mar-2018 04:24:25 Uploading /opt/bamboo-home/xml-data/build-dir/GRECLIPSE-E44TP-JOB1/Site-org.codehaus.groovy.eclipse/target/site/features/org.codehaus.groovy24.feature_2.9.3.xx-201803080255-e44.jar (15.1 KB) to s3://dist.springsource.org/snapshot/GRECLIPSE/e4.4/features/org.codehaus.groovy24.feature_2.9.3.xx-201803080255-e44.jar
08-Mar-2018 04:24:26 Transfer Time: .2 s - Transfer Rate: 63.6 KB/s
08-Mar-2018 04:24:26 Uploading /opt/bamboo-home/xml-data/build-dir/GRECLIPSE-E44TP-JOB1/Site-org.codehaus.groovy.eclipse/target/site/features/org.codehaus.groovy25.feature_2.9.3.xx-201803080255-e44.jar (15.1 KB) to s3://dist.springsource.org/snapshot/GRECLIPSE/e4.4/features/org.codehaus.groovy25.feature_2.9.3.xx-201803080255-e44.jar
08-Mar-2018 04:24:26 Transfer Time: .2 s - Transfer Rate: 82.8 KB/s
08-Mar-2018 04:24:26 Uploading /opt/bamboo-home/xml-data/build-dir/GRECLIPSE-E44TP-JOB1/Site-org.codehaus.groovy.eclipse/target/site/org.codehaus.groovy-2.9.3.xx-201803080255-e44-updatesite.zip.md5 (.0 KB) to s3://dist.springsource.org/snapshot/GRECLIPSE/e4.4/org.codehaus.groovy-2.9.3.xx-201803080255-e44-updatesite.zip.md5
08-Mar-2018 04:24:27 Transfer Time: .3 s - Transfer Rate: .1 KB/s
08-Mar-2018 04:24:27 Uploading /opt/bamboo-home/xml-data/build-dir/GRECLIPSE-E44TP-JOB1/Site-org.codehaus.groovy.eclipse/target/site/org.codehaus.groovy-2.9.3.xx-201803080255-e44-updatesite.zip.sha1 (.0 KB) to s3://dist.springsource.org/snapshot/GRECLIPSE/e4.4/org.codehaus.groovy-2.9.3.xx-201803080255-e44-updatesite.zip.sha1
08-Mar-2018 04:24:27 Transfer Time: .2 s - Transfer Rate: .3 KB/s
08-Mar-2018 04:24:28 Uploading /opt/bamboo-home/xml-data/build-dir/GRECLIPSE-E44TP-JOB1/Site-org.codehaus.groovy.eclipse/target/site/plugins/org.codehaus.groovy.eclipse.ant_2.9.3.xx-201803080255-e44.jar (11.4 KB) to s3://dist.springsource.org/snapshot/GRECLIPSE/e4.4/plugins/org.codehaus.groovy.eclipse.ant_2.9.3.xx-201803080255-e44.jar
08-Mar-2018 04:24:28 Transfer Time: .2 s - Transfer Rate: 58.8 KB/s
08-Mar-2018 04:24:28 Uploading /opt/bamboo-home/xml-data/build-dir/GRECLIPSE-E44TP-JOB1/Site-org.codehaus.groovy.eclipse/target/site/plugins/org.codehaus.groovy.eclipse.astviews_2.9.3.xx-201803080255-e44.jar (69.1 KB) to s3://dist.springsource.org/snapshot/GRECLIPSE/e4.4/plugins/org.codehaus.groovy.eclipse.astviews_2.9.3.xx-201803080255-e44.jar
08-Mar-2018 04:24:28 Transfer Time: .3 s - Transfer Rate: 267.9 KB/s
08-Mar-2018 04:24:29 Uploading /opt/bamboo-home/xml-data/build-dir/GRECLIPSE-E44TP-JOB1/Site-org.codehaus.groovy.eclipse/target/site/plugins/org.codehaus.groovy.eclipse.codeassist.completion_2.9.3.xx-201803080255-e44.jar (234.6 KB) to s3://dist.springsource.org/snapshot/GRECLIPSE/e4.4/plugins/org.codehaus.groovy.eclipse.codeassist.completion_2.9.3.xx-201803080255-e44.jar
08-Mar-2018 04:24:29 Transfer Time: .3 s - Transfer Rate: 684.0 KB/s
08-Mar-2018 04:24:30 Uploading /opt/bamboo-home/xml-data/build-dir/GRECLIPSE-E44TP-JOB1/Site-org.codehaus.groovy.eclipse/target/site/plugins/org.codehaus.groovy.eclipse.codebrowsing_2.9.3.xx-201803080255-e44.jar (82.4 KB) to s3://dist.springsource.org/snapshot/GRECLIPSE/e4.4/plugins/org.codehaus.groovy.eclipse.codebrowsing_2.9.3.xx-201803080255-e44.jar
08-Mar-2018 04:24:30 Transfer Time: .2 s - Transfer Rate: 476.0 KB/s
08-Mar-2018 04:24:30 Uploading /opt/bamboo-home/xml-data/build-dir/GRECLIPSE-E44TP-JOB1/Site-org.codehaus.groovy.eclipse/target/site/plugins/org.codehaus.groovy.eclipse.compilerResolver_2.9.3.xx-201803080255-e44.jar (18.1 KB) to s3://dist.springsource.org/snapshot/GRECLIPSE/e4.4/plugins/org.codehaus.groovy.eclipse.compilerResolver_2.9.3.xx-201803080255-e44.jar
08-Mar-2018 04:24:30 Transfer Time: .2 s - Transfer Rate: 110.4 KB/s
08-Mar-2018 04:24:31 Uploading /opt/bamboo-home/xml-data/build-dir/GRECLIPSE-E44TP-JOB1/Site-org.codehaus.groovy.eclipse/target/site/plugins/org.codehaus.groovy.eclipse.core_2.9.3.xx-201803080255-e44.jar (92.5 KB) to s3://dist.springsource.org/snapshot/GRECLIPSE/e4.4/plugins/org.codehaus.groovy.eclipse.core_2.9.3.xx-201803080255-e44.jar
08-Mar-2018 04:24:31 Transfer Time: .2 s - Transfer Rate: 544.1 KB/s
08-Mar-2018 04:24:31 Uploading /opt/bamboo-home/xml-data/build-dir/GRECLIPSE-E44TP-JOB1/Site-org.codehaus.groovy.eclipse/target/site/plugins/org.codehaus.groovy.eclipse.dsl_2.9.3.xx-201803080255-e44.jar (373.6 KB) to s3://dist.springsource.org/snapshot/GRECLIPSE/e4.4/plugins/org.codehaus.groovy.eclipse.dsl_2.9.3.xx-201803080255-e44.jar
08-Mar-2018 04:24:31 Transfer Time: .3 s - Transfer Rate: 1.3 MB/s
08-Mar-2018 04:24:32 Uploading /opt/bamboo-home/xml-data/build-dir/GRECLIPSE-E44TP-JOB1/Site-org.codehaus.groovy.eclipse/target/site/plugins/org.codehaus.groovy.eclipse.quickfix_2.9.3.xx-201803080255-e44.jar (100.0 KB) to s3://dist.springsource.org/snapshot/GRECLIPSE/e4.4/plugins/org.codehaus.groovy.eclipse.quickfix_2.9.3.xx-201803080255-e44.jar
08-Mar-2018 04:24:32 Transfer Time: .3 s - Transfer Rate: 373.0 KB/s
08-Mar-2018 04:24:32 Uploading /opt/bamboo-home/xml-data/build-dir/GRECLIPSE-E44TP-JOB1/Site-org.codehaus.groovy.eclipse/target/site/plugins/org.codehaus.groovy.eclipse.refactoring_2.9.3.xx-201803080255-e44.jar (251.8 KB) to s3://dist.springsource.org/snapshot/GRECLIPSE/e4.4/plugins/org.codehaus.groovy.eclipse.refactoring_2.9.3.xx-201803080255-e44.jar
08-Mar-2018 04:24:33 Transfer Time: .2 s - Transfer Rate: 1.2 MB/s
08-Mar-2018 04:24:33 Uploading /opt/bamboo-home/xml-data/build-dir/GRECLIPSE-E44TP-JOB1/Site-org.codehaus.groovy.eclipse/target/site/plugins/org.codehaus.groovy.eclipse.ui_2.9.3.xx-201803080255-e44.jar (520.5 KB) to s3://dist.springsource.org/snapshot/GRECLIPSE/e4.4/plugins/org.codehaus.groovy.eclipse.ui_2.9.3.xx-201803080255-e44.jar
08-Mar-2018 04:24:33 Transfer Time: .3 s - Transfer Rate: 1.9 MB/s
08-Mar-2018 04:24:34 Uploading /opt/bamboo-home/xml-data/build-dir/GRECLIPSE-E44TP-JOB1/Site-org.codehaus.groovy.eclipse/target/site/plugins/org.codehaus.groovy.eclipse_2.9.3.xx-201803080255-e44.jar (16.8 KB) to s3://dist.springsource.org/snapshot/GRECLIPSE/e4.4/plugins/org.codehaus.groovy.eclipse_2.9.3.xx-201803080255-e44.jar
08-Mar-2018 04:24:34 Transfer Time: .2 s - Transfer Rate: 92.6 KB/s
08-Mar-2018 04:24:34 Uploading /opt/bamboo-home/xml-data/build-dir/GRECLIPSE-E44TP-JOB1/Site-org.codehaus.groovy.eclipse/target/site/plugins/org.codehaus.groovy.m2eclipse_2.9.3.xx-201803080255-e44.jar (14.3 KB) to s3://dist.springsource.org/snapshot/GRECLIPSE/e4.4/plugins/org.codehaus.groovy.m2eclipse_2.9.3.xx-201803080255-e44.jar
08-Mar-2018 04:24:34 Transfer Time: .2 s - Transfer Rate: 80.1 KB/s
08-Mar-2018 04:24:35 Uploading /opt/bamboo-home/xml-data/build-dir/GRECLIPSE-E44TP-JOB1/Site-org.codehaus.groovy.eclipse/target/site/plugins/org.codehaus.groovy_1.8.9.xx-201803080255-e44.jar (9.7 MB) to s3://dist.springsource.org/snapshot/GRECLIPSE/e4.4/plugins/org.codehaus.groovy_1.8.9.xx-201803080255-e44.jar
08-Mar-2018 04:24:35 Transfer Time: .7 s - Transfer Rate: 13.1 MB/s
08-Mar-2018 04:24:36 Uploading /opt/bamboo-home/xml-data/build-dir/GRECLIPSE-E44TP-JOB1/Site-org.codehaus.groovy.eclipse/target/site/plugins/org.codehaus.groovy_2.0.8.xx-201803080255-e44.jar (10.0 MB) to s3://dist.springsource.org/snapshot/GRECLIPSE/e4.4/plugins/org.codehaus.groovy_2.0.8.xx-201803080255-e44.jar
08-Mar-2018 04:24:36 Transfer Time: .7 s - Transfer Rate: 13.5 MB/s
08-Mar-2018 04:24:37 Uploading /opt/bamboo-home/xml-data/build-dir/GRECLIPSE-E44TP-JOB1/Site-org.codehaus.groovy.eclipse/target/site/plugins/org.codehaus.groovy_2.1.9.xx-201803080255-e44.jar (10.1 MB) to s3://dist.springsource.org/snapshot/GRECLIPSE/e4.4/plugins/org.codehaus.groovy_2.1.9.xx-201803080255-e44.jar
08-Mar-2018 04:24:37 Transfer Time: .7 s - Transfer Rate: 15.3 MB/s
08-Mar-2018 04:24:38 Uploading /opt/bamboo-home/xml-data/build-dir/GRECLIPSE-E44TP-JOB1/Site-org.codehaus.groovy.eclipse/target/site/plugins/org.codehaus.groovy_2.2.2.xx-201803080255-e44.jar (10.7 MB) to s3://dist.springsource.org/snapshot/GRECLIPSE/e4.4/plugins/org.codehaus.groovy_2.2.2.xx-201803080255-e44.jar
08-Mar-2018 04:24:38 Transfer Time: .6 s - Transfer Rate: 16.9 MB/s
08-Mar-2018 04:24:39 Uploading /opt/bamboo-home/xml-data/build-dir/GRECLIPSE-E44TP-JOB1/Site-org.codehaus.groovy.eclipse/target/site/plugins/org.codehaus.groovy_2.3.11.xx-201803080255-e44.jar (11.7 MB) to s3://dist.springsource.org/snapshot/GRECLIPSE/e4.4/plugins/org.codehaus.groovy_2.3.11.xx-201803080255-e44.jar
08-Mar-2018 04:24:40 Transfer Time: 1.6 s - Transfer Rate: 7.4 MB/s
08-Mar-2018 04:24:41 Uploading /opt/bamboo-home/xml-data/build-dir/GRECLIPSE-E44TP-JOB1/Site-org.codehaus.groovy.eclipse/target/site/plugins/org.codehaus.groovy_2.4.13.xx-201803080255-e44.jar (11.7 MB) to s3://dist.springsource.org/snapshot/GRECLIPSE/e4.4/plugins/org.codehaus.groovy_2.4.13.xx-201803080255-e44.jar
08-Mar-2018 04:24:42 Transfer Time: .8 s - Transfer Rate: 14.0 MB/s
08-Mar-2018 04:24:42 Uploading /opt/bamboo-home/xml-data/build-dir/GRECLIPSE-E44TP-JOB1/Site-org.codehaus.groovy.eclipse/target/site/plugins/org.codehaus.groovy_2.5.0.xx-201803080255-e44.jar (19.7 MB) to s3://dist.springsource.org/snapshot/GRECLIPSE/e4.4/plugins/org.codehaus.groovy_2.5.0.xx-201803080255-e44.jar
08-Mar-2018 04:24:43 Transfer Time: 1.2 s - Transfer Rate: 16.9 MB/s
08-Mar-2018 04:24:44 Uploading /opt/bamboo-home/xml-data/build-dir/GRECLIPSE-E44TP-JOB1/Site-org.codehaus.groovy.eclipse/target/site/plugins/org.eclipse.jdt.core_3.10.2.xx-201803080255-e44.jar (5.4 MB) to s3://dist.springsource.org/snapshot/GRECLIPSE/e4.4/plugins/org.eclipse.jdt.core_3.10.2.xx-201803080255-e44.jar
08-Mar-2018 04:24:44 Transfer Time: .4 s - Transfer Rate: 12.3 MB/s
08-Mar-2018 04:24:44 Uploading /opt/bamboo-home/xml-data/build-dir/GRECLIPSE-E44TP-JOB1/Site-org.codehaus.groovy.eclipse/target/site/plugins/org.eclipse.jdt.groovy.core_2.9.3.xx-201803080255-e44.jar (408.2 KB) to s3://dist.springsource.org/snapshot/GRECLIPSE/e4.4/plugins/org.eclipse.jdt.groovy.core_2.9.3.xx-201803080255-e44.jar
08-Mar-2018 04:24:45 Transfer Time: .2 s - Transfer Rate: 1.6 MB/s
08-Mar-2018 04:24:45 Uploading /opt/bamboo-home/xml-data/build-dir/GRECLIPSE-E44TP-JOB1/Site-org.codehaus.groovy.eclipse/target/site/site.xml (3.8 KB) to s3://dist.springsource.org/snapshot/GRECLIPSE/e4.4/site.xml
08-Mar-2018 04:24:45 Transfer Time: .2 s - Transfer Rate: 23.2 KB/s
08-Mar-2018 04:24:45 Uploading /opt/bamboo-home/xml-data/build-dir/GRECLIPSE-E44TP-JOB1/Site-org.codehaus.groovy.eclipse/target/site/org.codehaus.groovy-2.9.3.xx-201803080255-e44-updatesite.zip (90.8 MB) to s3://dist.springsource.org/snapshot/GRECLIPSE/e4.4/org.codehaus.groovy-2.9.3.xx-201803080255-e44-updatesite.zip
08-Mar-2018 04:24:49 Transfer Time: 4.2 s - Transfer Rate: 21.8 MB/s
08-Mar-2018 04:24:49 [INFO] Executed tasks
08-Mar-2018 04:24:49 [INFO] ------------------------------------------------------------------------
08-Mar-2018 04:24:49 [INFO] Reactor Summary:
08-Mar-2018 04:24:49 [INFO]
08-Mar-2018 04:24:49 [INFO] org.codehaus.groovy.eclipse.parent ................ SUCCESS [0.203s]
08-Mar-2018 04:24:49 [INFO] org.codehaus.groovy ............................... SUCCESS [8.296s]
08-Mar-2018 04:24:49 [INFO] org.codehaus.groovy ............................... SUCCESS [5.417s]
08-Mar-2018 04:24:49 [INFO] org.codehaus.groovy ............................... SUCCESS [4.239s]
08-Mar-2018 04:24:49 [INFO] org.codehaus.groovy ............................... SUCCESS [4.403s]
08-Mar-2018 04:24:49 [INFO] org.codehaus.groovy ............................... SUCCESS [4.925s]
08-Mar-2018 04:24:49 [INFO] org.codehaus.groovy ............................... SUCCESS [4.681s]
08-Mar-2018 04:24:49 [INFO] org.codehaus.groovy ............................... SUCCESS [5.782s]
08-Mar-2018 04:24:49 [INFO] org.codehaus.groovy.eclipse.compilerResolver ...... SUCCESS [1.040s]
08-Mar-2018 04:24:49 [INFO] org.eclipse.jdt.core .............................. SUCCESS [16.798s]
08-Mar-2018 04:24:49 [INFO] org.eclipse.jdt.groovy.core ....................... SUCCESS [2.336s]
08-Mar-2018 04:24:49 [INFO] org.codehaus.groovy.eclipse ....................... SUCCESS [0.491s]
08-Mar-2018 04:24:49 [INFO] org.codehaus.groovy.eclipse.core .................. SUCCESS [1.368s]
08-Mar-2018 04:24:49 [INFO] org.codehaus.groovy.eclipse.ant ................... SUCCESS [1.028s]
08-Mar-2018 04:24:49 [INFO] org.codehaus.groovy.eclipse.codebrowsing .......... SUCCESS [1.296s]
08-Mar-2018 04:24:49 [INFO] org.codehaus.groovy.eclipse.refactoring ........... SUCCESS [2.033s]
08-Mar-2018 04:24:49 [INFO] org.codehaus.groovy.eclipse.ui .................... SUCCESS [2.572s]
08-Mar-2018 04:24:49 [INFO] org.codehaus.groovy.eclipse.astviews .............. SUCCESS [2.729s]
08-Mar-2018 04:24:49 [INFO] org.codehaus.groovy.eclipse.codeassist.completion . SUCCESS [1.956s]
08-Mar-2018 04:24:49 [INFO] org.codehaus.groovy.eclipse.dsl ................... SUCCESS [2.338s]
08-Mar-2018 04:24:49 [INFO] org.codehaus.groovy.eclipse.quickfix .............. SUCCESS [1.538s]
08-Mar-2018 04:24:49 [INFO] org.codehaus.groovy18.feature ..................... SUCCESS [0.673s]
08-Mar-2018 04:24:49 [INFO] org.codehaus.groovy20.feature ..................... SUCCESS [0.578s]
08-Mar-2018 04:24:49 [INFO] org.codehaus.groovy21.feature ..................... SUCCESS [0.563s]
08-Mar-2018 04:24:49 [INFO] org.codehaus.groovy22.feature ..................... SUCCESS [0.577s]
08-Mar-2018 04:24:49 [INFO] org.codehaus.groovy23.feature ..................... SUCCESS [0.556s]
08-Mar-2018 04:24:49 [INFO] org.codehaus.groovy24.feature ..................... SUCCESS [0.615s]
08-Mar-2018 04:24:49 [INFO] org.codehaus.groovy25.feature ..................... SUCCESS [0.571s]
08-Mar-2018 04:24:49 [INFO] org.codehaus.groovy.jdt.patch ..................... SUCCESS [0.538s]
08-Mar-2018 04:24:49 [INFO] org.codehaus.groovy.headless.feature .............. SUCCESS [0.674s]
08-Mar-2018 04:24:49 [INFO] org.codehaus.groovy.compilerless.feature .......... SUCCESS [0.799s]
08-Mar-2018 04:24:49 [INFO] org.codehaus.groovy.eclipse.feature ............... SUCCESS [0.619s]
08-Mar-2018 04:24:49 [INFO] org.eclipse.jdt.core.tests.compiler ............... SUCCESS [6.658s]
08-Mar-2018 04:24:49 [INFO] org.eclipse.jdt.core.tests.builder ................ SUCCESS [1.547s]
08-Mar-2018 04:24:49 [INFO] org.eclipse.jdt.groovy.core.tests.compiler ........ SUCCESS [1.202s]
08-Mar-2018 04:24:49 [INFO] org.eclipse.jdt.groovy.core.tests.builder ......... SUCCESS [1.810s]
08-Mar-2018 04:24:49 [INFO] org.codehaus.groovy.eclipse.tests ................. SUCCESS [6.251s]
08-Mar-2018 04:24:49 [INFO] org.codehaus.groovy.eclipse.codeassist.completion.test  SUCCESS [3.635s]
08-Mar-2018 04:24:49 [INFO] org.codehaus.groovy.eclipse.codebrowsing.test ..... SUCCESS [2.070s]
08-Mar-2018 04:24:49 [INFO] org.codehaus.groovy.eclipse.core.test ............. SUCCESS [1.418s]
08-Mar-2018 04:24:49 [INFO] org.codehaus.groovy.eclipse.dsl.tests ............. SUCCESS [2.081s]
08-Mar-2018 04:24:49 [INFO] org.codehaus.groovy.eclipse.junit.test ............ SUCCESS [1.352s]
08-Mar-2018 04:24:49 [INFO] org.codehaus.groovy.eclipse.refactoring.test ...... SUCCESS [3.117s]
08-Mar-2018 04:24:49 [INFO] org.codehaus.groovy.eclipse.quickfix.test ......... SUCCESS [1.546s]
08-Mar-2018 04:24:49 [INFO] org.codehaus.groovy.alltests ...................... SUCCESS [1:25:51.909s]
08-Mar-2018 04:24:49 [INFO] org.codehaus.groovy.alltests.feature .............. SUCCESS [7.548s]
08-Mar-2018 04:24:49 [INFO] org.codehaus.groovy.m2eclipse ..................... SUCCESS [3.171s]
08-Mar-2018 04:24:49 [INFO] org.codehaus.groovy.m2eclipse.feature ............. SUCCESS [1.492s]
08-Mar-2018 04:24:49 [INFO] org.codehaus.groovy.eclipse.site .................. SUCCESS [56.887s]
08-Mar-2018 04:24:49 [INFO] ------------------------------------------------------------------------
08-Mar-2018 04:24:49 [INFO] BUILD SUCCESS
08-Mar-2018 04:24:49 [INFO] ------------------------------------------------------------------------
08-Mar-2018 04:24:49 [INFO] Total time: 1:32:27.849s
08-Mar-2018 04:24:49 [INFO] Finished at: Thu Mar 08 04:24:49 UTC 2018
08-Mar-2018 04:24:56 [INFO] Final Memory: 282M/1030M
08-Mar-2018 04:24:56 [INFO] ------------------------------------------------------------------------
08-Mar-2018 04:24:57 Parsing test results under /opt/bamboo-home/xml-data/build-dir/GRECLIPSE-E44TP-JOB1...
08-Mar-2018 04:25:01 Finished task 'Maven 3.x' with result: Success
08-Mar-2018 04:25:01 Running post build plugin 'Docker Container Cleanup'
08-Mar-2018 04:25:01 Running post build plugin 'NCover Results Collector'
08-Mar-2018 04:25:01 Running post build plugin 'Artifactory Release Management Staging'
08-Mar-2018 04:25:01 Running post build plugin 'Artifactory Build Info Copier'
08-Mar-2018 04:25:01 Running post build plugin 'Artifactory Gradle Properties Info Copier'
08-Mar-2018 04:25:01 Running post build plugin 'Clover Results Collector'
08-Mar-2018 04:25:01 Running post build plugin 'npm Cache Cleanup'
08-Mar-2018 04:25:01 Running post build plugin 'Artifact Copier'
08-Mar-2018 04:25:01 Publishing an artifact: Zipped Update Site
08-Mar-2018 04:25:07 Finished publishing of artifact Job artifact: [Zipped Update Site], pattern: [**/*updatesite.zip] anchored at: [Site-org.codehaus.groovy.eclipse/target/site] in 5.368 s
08-Mar-2018 04:25:07 Publishing an artifact: surefire-reports
08-Mar-2018 04:25:08 Finished publishing of artifact Job artifact: [surefire-reports], pattern: [**/target/TEST-*.xml] in 1.569 s
08-Mar-2018 04:25:09 Successfully removed working directory at '/opt/bamboo-home/xml-data/build-dir/GRECLIPSE-E44TP-JOB1'
08-Mar-2018 04:25:09 Finalising the build...
08-Mar-2018 04:25:09 Stopping timer.
08-Mar-2018 04:25:09 Build GRECLIPSE-E44TP-JOB1-803 completed.
08-Mar-2018 04:25:10 Running on server: post build plugin 'NCover Results Collector'
08-Mar-2018 04:25:10 Running on server: post build plugin 'Build Hanging Detection Configuration'
08-Mar-2018 04:25:10 Running on server: post build plugin 'Clover Delta Calculator'
08-Mar-2018 04:25:10 Running on server: post build plugin 'Maven Dependencies Postprocessor'
08-Mar-2018 04:25:10 All post build plugins have finished
08-Mar-2018 04:25:10 Generating build results summary...
08-Mar-2018 04:25:11 Saving build results to disk...
08-Mar-2018 04:25:11 Logging substituted variables...
08-Mar-2018 04:25:11 Indexing build results...
08-Mar-2018 04:25:11 Finished building GRECLIPSE-E44TP-JOB1-803.