E44 build, test and publish

Build: #804 was successful

Job: Default Job was successful

Stages & jobs

  1. Default Stage

Build log

The build generated 36,219 lines of output.The output is too long and has been truncated to the last 1,000 lines. Download or view full build log

14-May-2018 18:55:57 testForLoop4(org.eclipse.jdt.core.groovy.tests.search.GenericInferencingTests)  Time elapsed: 0.092 sec
14-May-2018 18:55:57 testForLoop5(org.eclipse.jdt.core.groovy.tests.search.GenericInferencingTests)  Time elapsed: 0.092 sec
14-May-2018 18:55:57 testForLoop6(org.eclipse.jdt.core.groovy.tests.search.GenericInferencingTests)  Time elapsed: 0.09 sec
14-May-2018 18:55:57 testForLoop7(org.eclipse.jdt.core.groovy.tests.search.GenericInferencingTests)  Time elapsed: 0.091 sec
14-May-2018 18:55:57 testForLoop8(org.eclipse.jdt.core.groovy.tests.search.GenericInferencingTests)  Time elapsed: 0.1 sec
14-May-2018 18:55:57 testForLoop9(org.eclipse.jdt.core.groovy.tests.search.GenericInferencingTests)  Time elapsed: 0.098 sec
14-May-2018 18:55:57 testInferringRange1(org.eclipse.jdt.core.groovy.tests.search.GenericInferencingTests)  Time elapsed: 0.105 sec
14-May-2018 18:55:57 testInferringRange2(org.eclipse.jdt.core.groovy.tests.search.GenericInferencingTests)  Time elapsed: 0.096 sec
14-May-2018 18:55:57 testMapOfList(org.eclipse.jdt.core.groovy.tests.search.GenericInferencingTests)  Time elapsed: 0.101 sec
14-May-2018 18:55:57 testList10(org.eclipse.jdt.core.groovy.tests.search.GenericInferencingTests)  Time elapsed: 0.094 sec
14-May-2018 18:55:57 testForLoop11(org.eclipse.jdt.core.groovy.tests.search.GenericInferencingTests)  Time elapsed: 0.098 sec
14-May-2018 18:55:57 testForLoop2a(org.eclipse.jdt.core.groovy.tests.search.GenericInferencingTests)  Time elapsed: 0.086 sec
14-May-2018 18:55:57 testDGMClosure10(org.eclipse.jdt.core.groovy.tests.search.GenericInferencingTests)  Time elapsed: 0.101 sec
14-May-2018 18:55:57 testDGMClosure11(org.eclipse.jdt.core.groovy.tests.search.GenericInferencingTests)  Time elapsed: 0.097 sec
14-May-2018 18:55:57 testDGMClosure12(org.eclipse.jdt.core.groovy.tests.search.GenericInferencingTests)  Time elapsed: 0.105 sec
14-May-2018 18:55:57 testDGMClosure13(org.eclipse.jdt.core.groovy.tests.search.GenericInferencingTests)  Time elapsed: 0.096 sec
14-May-2018 18:55:57 testDGMClosure14(org.eclipse.jdt.core.groovy.tests.search.GenericInferencingTests)  Time elapsed: 0.097 sec
14-May-2018 18:55:57 testDGMClosure15(org.eclipse.jdt.core.groovy.tests.search.GenericInferencingTests)  Time elapsed: 0.097 sec
14-May-2018 18:55:57 testDGMClosure16(org.eclipse.jdt.core.groovy.tests.search.GenericInferencingTests)  Time elapsed: 0.109 sec
14-May-2018 18:55:57 testDGMClosure17(org.eclipse.jdt.core.groovy.tests.search.GenericInferencingTests)  Time elapsed: 0.097 sec
14-May-2018 18:55:57 testDGMClosure18(org.eclipse.jdt.core.groovy.tests.search.GenericInferencingTests)  Time elapsed: 0.089 sec
14-May-2018 18:55:57 testDGMClosure19(org.eclipse.jdt.core.groovy.tests.search.GenericInferencingTests)  Time elapsed: 0.092 sec
14-May-2018 18:55:57 testDGMClosure20(org.eclipse.jdt.core.groovy.tests.search.GenericInferencingTests)  Time elapsed: 0.093 sec
14-May-2018 18:55:57 testDGMClosure21(org.eclipse.jdt.core.groovy.tests.search.GenericInferencingTests)  Time elapsed: 0.098 sec
14-May-2018 18:55:57 testDGMClosure22(org.eclipse.jdt.core.groovy.tests.search.GenericInferencingTests)  Time elapsed: 0.107 sec
14-May-2018 18:55:57 testDGMClosure23(org.eclipse.jdt.core.groovy.tests.search.GenericInferencingTests)  Time elapsed: 0.087 sec
14-May-2018 18:55:57 testClosure1(org.eclipse.jdt.core.groovy.tests.search.GenericInferencingTests)  Time elapsed: 0.095 sec
14-May-2018 18:55:57 testClosure2(org.eclipse.jdt.core.groovy.tests.search.GenericInferencingTests)  Time elapsed: 0.092 sec
14-May-2018 18:55:57 testClosure3(org.eclipse.jdt.core.groovy.tests.search.GenericInferencingTests)  Time elapsed: 0.097 sec
14-May-2018 18:55:57 testClosure4(org.eclipse.jdt.core.groovy.tests.search.GenericInferencingTests)  Time elapsed: 0.095 sec
14-May-2018 18:55:57 testInferringList1(org.eclipse.jdt.core.groovy.tests.search.GenericInferencingTests)  Time elapsed: 0.095 sec
14-May-2018 18:55:57 testInferringList2(org.eclipse.jdt.core.groovy.tests.search.GenericInferencingTests)  Time elapsed: 0.102 sec
14-May-2018 18:55:57 testInferringList3(org.eclipse.jdt.core.groovy.tests.search.GenericInferencingTests)  Time elapsed: 0.09 sec
14-May-2018 18:55:57 testMapOfList2(org.eclipse.jdt.core.groovy.tests.search.GenericInferencingTests)  Time elapsed: 0.096 sec
14-May-2018 18:55:57 testMapOfList3(org.eclipse.jdt.core.groovy.tests.search.GenericInferencingTests)  Time elapsed: 0.093 sec
14-May-2018 18:55:57 testMapOfList4(org.eclipse.jdt.core.groovy.tests.search.GenericInferencingTests)  Time elapsed: 0.095 sec
14-May-2018 18:55:57 testMapOfList5(org.eclipse.jdt.core.groovy.tests.search.GenericInferencingTests)  Time elapsed: 0.085 sec
14-May-2018 18:55:57 testMapOfList6(org.eclipse.jdt.core.groovy.tests.search.GenericInferencingTests)  Time elapsed: 0.112 sec
14-May-2018 18:55:57 testMapOfList7(org.eclipse.jdt.core.groovy.tests.search.GenericInferencingTests)  Time elapsed: 0.097 sec
14-May-2018 18:55:57 testGenericsMapper(org.eclipse.jdt.core.groovy.tests.search.GenericsMappingTests)  Time elapsed: 0.086 sec
14-May-2018 18:55:57 testCompileStatic10(org.eclipse.jdt.core.groovy.tests.search.Groovy20InferencingTests)  Time elapsed: 0.129 sec
14-May-2018 18:55:57 testCompileStatic1(org.eclipse.jdt.core.groovy.tests.search.Groovy20InferencingTests)  Time elapsed: 0.097 sec
14-May-2018 18:55:57 testCompileStatic2(org.eclipse.jdt.core.groovy.tests.search.Groovy20InferencingTests)  Time elapsed: 0.093 sec
14-May-2018 18:55:57 testCompileStatic3(org.eclipse.jdt.core.groovy.tests.search.Groovy20InferencingTests)  Time elapsed: 0.095 sec
14-May-2018 18:55:57 testCompileStatic4(org.eclipse.jdt.core.groovy.tests.search.Groovy20InferencingTests)  Time elapsed: 0.096 sec
14-May-2018 18:55:57 testCompileStatic5(org.eclipse.jdt.core.groovy.tests.search.Groovy20InferencingTests)  Time elapsed: 0.098 sec
14-May-2018 18:55:57 testCompileStatic6(org.eclipse.jdt.core.groovy.tests.search.Groovy20InferencingTests)  Time elapsed: 0.1 sec
14-May-2018 18:55:57 testCompileStatic7(org.eclipse.jdt.core.groovy.tests.search.Groovy20InferencingTests)  Time elapsed: 0.105 sec
14-May-2018 18:55:57 testCompileStatic8(org.eclipse.jdt.core.groovy.tests.search.Groovy20InferencingTests)  Time elapsed: 0.095 sec
14-May-2018 18:55:57 testCompileStatic9(org.eclipse.jdt.core.groovy.tests.search.Groovy20InferencingTests)  Time elapsed: 0.095 sec
14-May-2018 18:55:57 testTypeChecked1(org.eclipse.jdt.core.groovy.tests.search.Groovy20InferencingTests)  Time elapsed: 0.095 sec
14-May-2018 18:55:57 testTypeChecked2(org.eclipse.jdt.core.groovy.tests.search.Groovy20InferencingTests)  Time elapsed: 0.099 sec
14-May-2018 18:55:57 testTypeChecked3(org.eclipse.jdt.core.groovy.tests.search.Groovy20InferencingTests)  Time elapsed: 0.096 sec
14-May-2018 18:55:57 testTypeChecked4(org.eclipse.jdt.core.groovy.tests.search.Groovy20InferencingTests)  Time elapsed: 0.098 sec
14-May-2018 18:55:57 testTypeChecked5(org.eclipse.jdt.core.groovy.tests.search.Groovy20InferencingTests)  Time elapsed: 0.105 sec
14-May-2018 18:55:57 testTypeChecked6(org.eclipse.jdt.core.groovy.tests.search.Groovy20InferencingTests)  Time elapsed: 0.113 sec
14-May-2018 18:55:57 testTypeChecked7(org.eclipse.jdt.core.groovy.tests.search.Groovy20InferencingTests)  Time elapsed: 0.094 sec
14-May-2018 18:55:57 testTypeChecked8(org.eclipse.jdt.core.groovy.tests.search.Groovy20InferencingTests)  Time elapsed: 0.098 sec
14-May-2018 18:55:57 testTypeCheckingExtension(org.eclipse.jdt.core.groovy.tests.search.Groovy21InferencingTests)  Time elapsed: 0.626 sec
14-May-2018 18:55:57 testDelegatesToTarget1(org.eclipse.jdt.core.groovy.tests.search.Groovy21InferencingTests)  Time elapsed: 0.143 sec
14-May-2018 18:55:57 testDelegatesToTarget2(org.eclipse.jdt.core.groovy.tests.search.Groovy21InferencingTests)  Time elapsed: 0.154 sec
14-May-2018 18:55:57 testDelegatesToTarget3(org.eclipse.jdt.core.groovy.tests.search.Groovy21InferencingTests)  Time elapsed: 0.189 sec
14-May-2018 18:55:57 testDelegatesToTarget4(org.eclipse.jdt.core.groovy.tests.search.Groovy21InferencingTests)  Time elapsed: 0.15 sec
14-May-2018 18:55:57 testDelegatesToTarget5(org.eclipse.jdt.core.groovy.tests.search.Groovy21InferencingTests)  Time elapsed: 0.154 sec
14-May-2018 18:55:57 testDelegatesToValue2(org.eclipse.jdt.core.groovy.tests.search.Groovy21InferencingTests)  Time elapsed: 0.1 sec
14-May-2018 18:55:57 testDelegatesToValue3(org.eclipse.jdt.core.groovy.tests.search.Groovy21InferencingTests)  Time elapsed: 0.104 sec
14-May-2018 18:55:57 testDelegatesToValue4(org.eclipse.jdt.core.groovy.tests.search.Groovy21InferencingTests)  Time elapsed: 0.116 sec
14-May-2018 18:55:57 testDelegatesToValue5(org.eclipse.jdt.core.groovy.tests.search.Groovy21InferencingTests)  Time elapsed: 0.107 sec
14-May-2018 18:55:57 testDelegatesToValue6(org.eclipse.jdt.core.groovy.tests.search.Groovy21InferencingTests)  Time elapsed: 0.102 sec
14-May-2018 18:55:57 testDelegatesToValue(org.eclipse.jdt.core.groovy.tests.search.Groovy21InferencingTests)  Time elapsed: 0.111 sec
14-May-2018 18:55:57 testEnumOverrides(org.eclipse.jdt.core.groovy.tests.search.Groovy21InferencingTests)  Time elapsed: 0.118 sec
14-May-2018 18:55:57 testEnumOverrides2(org.eclipse.jdt.core.groovy.tests.search.Groovy21InferencingTests)  Time elapsed: 0.149 sec
14-May-2018 18:55:57 testFieldAndPropertyWithSameName(org.eclipse.jdt.core.groovy.tests.search.InferencingTests)  Time elapsed: 0.096 sec
14-May-2018 18:55:57 testObjectMethodOnInterface(org.eclipse.jdt.core.groovy.tests.search.InferencingTests)  Time elapsed: 0.095 sec
14-May-2018 18:55:57 testNothingIsUnknown(org.eclipse.jdt.core.groovy.tests.search.InferencingTests)  Time elapsed: 0.103 sec
14-May-2018 18:55:57 testInnerClass1(org.eclipse.jdt.core.groovy.tests.search.InferencingTests)  Time elapsed: 0.096 sec
14-May-2018 18:55:57 testInnerClass2(org.eclipse.jdt.core.groovy.tests.search.InferencingTests)  Time elapsed: 0.103 sec
14-May-2018 18:55:57 testInnerClass3(org.eclipse.jdt.core.groovy.tests.search.InferencingTests)  Time elapsed: 0.096 sec
14-May-2018 18:55:57 testInnerClass4(org.eclipse.jdt.core.groovy.tests.search.InferencingTests)  Time elapsed: 0.103 sec
14-May-2018 18:55:57 testInnerClass5(org.eclipse.jdt.core.groovy.tests.search.InferencingTests)  Time elapsed: 0.097 sec
14-May-2018 18:55:57 testInnerClass6(org.eclipse.jdt.core.groovy.tests.search.InferencingTests)  Time elapsed: 0.096 sec
14-May-2018 18:55:57 testInnerClass7(org.eclipse.jdt.core.groovy.tests.search.InferencingTests)  Time elapsed: 0.167 sec
14-May-2018 18:55:57 testInnerClass8(org.eclipse.jdt.core.groovy.tests.search.InferencingTests)  Time elapsed: 0.171 sec
14-May-2018 18:55:57 testInnerClass9(org.eclipse.jdt.core.groovy.tests.search.InferencingTests)  Time elapsed: 0.135 sec
14-May-2018 18:55:57 testBoolean1(org.eclipse.jdt.core.groovy.tests.search.InferencingTests)  Time elapsed: 0.093 sec
14-May-2018 18:55:57 testBoolean2(org.eclipse.jdt.core.groovy.tests.search.InferencingTests)  Time elapsed: 0.101 sec
14-May-2018 18:55:57 testBoolean3(org.eclipse.jdt.core.groovy.tests.search.InferencingTests)  Time elapsed: 0.1 sec
14-May-2018 18:55:57 testBoolean4(org.eclipse.jdt.core.groovy.tests.search.InferencingTests)  Time elapsed: 0.111 sec
14-May-2018 18:55:57 testBoolean5(org.eclipse.jdt.core.groovy.tests.search.InferencingTests)  Time elapsed: 0.093 sec
14-May-2018 18:55:57 testBoolean6(org.eclipse.jdt.core.groovy.tests.search.InferencingTests)  Time elapsed: 0.099 sec
14-May-2018 18:55:57 testBoolean7(org.eclipse.jdt.core.groovy.tests.search.InferencingTests)  Time elapsed: 0.098 sec
14-May-2018 18:55:57 testDeclarationAtBeginningOfMethod(org.eclipse.jdt.core.groovy.tests.search.InferencingTests)  Time elapsed: 0.1 sec
14-May-2018 18:55:57 testLocalTypeAndDefaultImportCollision(org.eclipse.jdt.core.groovy.tests.search.InferencingTests)  Time elapsed: 0.114 sec
14-May-2018 18:55:57 testSuperClassMethod(org.eclipse.jdt.core.groovy.tests.search.InferencingTests)  Time elapsed: 0.101 sec
14-May-2018 18:55:57 testGRECLIPSE731a(org.eclipse.jdt.core.groovy.tests.search.InferencingTests)  Time elapsed: 0.095 sec
14-May-2018 18:55:57 testGRECLIPSE731b(org.eclipse.jdt.core.groovy.tests.search.InferencingTests)  Time elapsed: 0.104 sec
14-May-2018 18:55:57 testGRECLIPSE731c(org.eclipse.jdt.core.groovy.tests.search.InferencingTests)  Time elapsed: 0.101 sec
14-May-2018 18:55:57 testGRECLIPSE731d(org.eclipse.jdt.core.groovy.tests.search.InferencingTests)  Time elapsed: 0.095 sec
14-May-2018 18:55:57 testGRECLIPSE731e(org.eclipse.jdt.core.groovy.tests.search.InferencingTests)  Time elapsed: 0.093 sec
14-May-2018 18:55:57 testGRECLIPSE731f(org.eclipse.jdt.core.groovy.tests.search.InferencingTests)  Time elapsed: 0.092 sec
14-May-2018 18:55:57 testSpecialConstructor1(org.eclipse.jdt.core.groovy.tests.search.InferencingTests)  Time elapsed: 0.1 sec
14-May-2018 18:55:57 testSpecialConstructor2(org.eclipse.jdt.core.groovy.tests.search.InferencingTests)  Time elapsed: 0.132 sec
14-May-2018 18:55:57 testInnerClass10(org.eclipse.jdt.core.groovy.tests.search.InferencingTests)  Time elapsed: 0.118 sec
14-May-2018 18:55:57 testInnerClass11(org.eclipse.jdt.core.groovy.tests.search.InferencingTests)  Time elapsed: 0.118 sec
14-May-2018 18:55:57 testMultiDecl10(org.eclipse.jdt.core.groovy.tests.search.InferencingTests)  Time elapsed: 0.112 sec
14-May-2018 18:55:57 testMultiDecl11(org.eclipse.jdt.core.groovy.tests.search.InferencingTests)  Time elapsed: 0.116 sec
14-May-2018 18:55:57 testMultiDecl12(org.eclipse.jdt.core.groovy.tests.search.InferencingTests)  Time elapsed: 0.108 sec
14-May-2018 18:55:57 testMultiDecl13(org.eclipse.jdt.core.groovy.tests.search.InferencingTests)  Time elapsed: 0.114 sec
14-May-2018 18:55:57 testAssignementInInnerBlock(org.eclipse.jdt.core.groovy.tests.search.InferencingTests)  Time elapsed: 0.092 sec
14-May-2018 18:55:57 testConstantFromSuper(org.eclipse.jdt.core.groovy.tests.search.InferencingTests)  Time elapsed: 0.101 sec
14-May-2018 18:55:57 testAsExpression1(org.eclipse.jdt.core.groovy.tests.search.InferencingTests)  Time elapsed: 0.092 sec
14-May-2018 18:55:57 testAsExpression2(org.eclipse.jdt.core.groovy.tests.search.InferencingTests)  Time elapsed: 0.104 sec
14-May-2018 18:55:57 testSuperClassMethod2(org.eclipse.jdt.core.groovy.tests.search.InferencingTests)  Time elapsed: 0.098 sec
14-May-2018 18:55:57 testNumber1a(org.eclipse.jdt.core.groovy.tests.search.InferencingTests)  Time elapsed: 0.096 sec
14-May-2018 18:55:57 testDGM1(org.eclipse.jdt.core.groovy.tests.search.InferencingTests)  Time elapsed: 0.094 sec
14-May-2018 18:55:57 testDGM2(org.eclipse.jdt.core.groovy.tests.search.InferencingTests)  Time elapsed: 0.099 sec
14-May-2018 18:55:57 testDGM3(org.eclipse.jdt.core.groovy.tests.search.InferencingTests)  Time elapsed: 0.089 sec
14-May-2018 18:55:57 testRangeExpression1(org.eclipse.jdt.core.groovy.tests.search.InferencingTests)  Time elapsed: 0.09 sec
14-May-2018 18:55:57 testRangeExpression2(org.eclipse.jdt.core.groovy.tests.search.InferencingTests)  Time elapsed: 0.092 sec
14-May-2018 18:55:57 testRangeExpression3(org.eclipse.jdt.core.groovy.tests.search.InferencingTests)  Time elapsed: 0.117 sec
14-May-2018 18:55:57 testRangeExpression4(org.eclipse.jdt.core.groovy.tests.search.InferencingTests)  Time elapsed: 0.092 sec
14-May-2018 18:55:57 testRangeExpression5(org.eclipse.jdt.core.groovy.tests.search.InferencingTests)  Time elapsed: 0.094 sec
14-May-2018 18:55:57 testRangeExpression6(org.eclipse.jdt.core.groovy.tests.search.InferencingTests)  Time elapsed: 0.098 sec
14-May-2018 18:55:57 testSpread10(org.eclipse.jdt.core.groovy.tests.search.InferencingTests)  Time elapsed: 0.097 sec
14-May-2018 18:55:57 testSpread11(org.eclipse.jdt.core.groovy.tests.search.InferencingTests)  Time elapsed: 0.101 sec
14-May-2018 18:55:57 testSpread12(org.eclipse.jdt.core.groovy.tests.search.InferencingTests)  Time elapsed: 0.097 sec
14-May-2018 18:55:57 testSpread13(org.eclipse.jdt.core.groovy.tests.search.InferencingTests)  Time elapsed: 0.122 sec
14-May-2018 18:55:57 testStaticThisAndSuper2(org.eclipse.jdt.core.groovy.tests.search.InferencingTests)  Time elapsed: 0.11 sec
14-May-2018 18:55:57 testConstructor1(org.eclipse.jdt.core.groovy.tests.search.InferencingTests)  Time elapsed: 0.19 sec
14-May-2018 18:55:57 testConstructor2(org.eclipse.jdt.core.groovy.tests.search.InferencingTests)  Time elapsed: 0.179 sec
14-May-2018 18:55:57 testConstructor3(org.eclipse.jdt.core.groovy.tests.search.InferencingTests)  Time elapsed: 0.133 sec
14-May-2018 18:55:57 testConstructor4(org.eclipse.jdt.core.groovy.tests.search.InferencingTests)  Time elapsed: 0.143 sec
14-May-2018 18:55:57 testConstructor5(org.eclipse.jdt.core.groovy.tests.search.InferencingTests)  Time elapsed: 0.145 sec
14-May-2018 18:55:57 testConstructor6(org.eclipse.jdt.core.groovy.tests.search.InferencingTests)  Time elapsed: 0.168 sec
14-May-2018 18:55:57 testInterfaceMethodsAsProperty(org.eclipse.jdt.core.groovy.tests.search.InferencingTests)  Time elapsed: 0.138 sec
14-May-2018 18:55:57 testPostfix(org.eclipse.jdt.core.groovy.tests.search.InferencingTests)  Time elapsed: 0.104 sec
14-May-2018 18:55:57 testListSort1(org.eclipse.jdt.core.groovy.tests.search.InferencingTests)  Time elapsed: 0.108 sec
14-May-2018 18:55:57 testListSort2(org.eclipse.jdt.core.groovy.tests.search.InferencingTests)  Time elapsed: 0.132 sec
14-May-2018 18:55:57 testListSort3(org.eclipse.jdt.core.groovy.tests.search.InferencingTests)  Time elapsed: 0.116 sec
14-May-2018 18:55:57 testLocalVar1(org.eclipse.jdt.core.groovy.tests.search.InferencingTests)  Time elapsed: 0.092 sec
14-May-2018 18:55:57 testLocalVar2(org.eclipse.jdt.core.groovy.tests.search.InferencingTests)  Time elapsed: 0.2 sec
14-May-2018 18:55:57 testLocalVar3(org.eclipse.jdt.core.groovy.tests.search.InferencingTests)  Time elapsed: 0.114 sec
14-May-2018 18:55:57 testLocalVar4(org.eclipse.jdt.core.groovy.tests.search.InferencingTests)  Time elapsed: 0.091 sec
14-May-2018 18:55:57 testIndirectInterfaceMethod(org.eclipse.jdt.core.groovy.tests.search.InferencingTests)  Time elapsed: 0.151 sec
14-May-2018 18:55:57 testMapLiteral(org.eclipse.jdt.core.groovy.tests.search.InferencingTests)  Time elapsed: 0.093 sec
14-May-2018 18:55:57 testListRemove(org.eclipse.jdt.core.groovy.tests.search.InferencingTests)  Time elapsed: 0.137 sec
14-May-2018 18:55:57 testCategoryMethodAsProperty(org.eclipse.jdt.core.groovy.tests.search.InferencingTests)  Time elapsed: 0.097 sec
14-May-2018 18:55:57 testNothingIsUnknownWithCategories(org.eclipse.jdt.core.groovy.tests.search.InferencingTests)  Time elapsed: 0.12 sec
14-May-2018 18:55:57 testImplicitVar1(org.eclipse.jdt.core.groovy.tests.search.InferencingTests)  Time elapsed: 0.089 sec
14-May-2018 18:55:57 testImplicitVar2(org.eclipse.jdt.core.groovy.tests.search.InferencingTests)  Time elapsed: 0.1 sec
14-May-2018 18:55:57 testImplicitVar3(org.eclipse.jdt.core.groovy.tests.search.InferencingTests)  Time elapsed: 0.109 sec
14-May-2018 18:55:57 testImplicitVar4(org.eclipse.jdt.core.groovy.tests.search.InferencingTests)  Time elapsed: 0.095 sec
14-May-2018 18:55:57 testImplicitVar5(org.eclipse.jdt.core.groovy.tests.search.InferencingTests)  Time elapsed: 0.114 sec
14-May-2018 18:55:57 testImplicitVar6(org.eclipse.jdt.core.groovy.tests.search.InferencingTests)  Time elapsed: 0.104 sec
14-May-2018 18:55:57 testImplicitVar7(org.eclipse.jdt.core.groovy.tests.search.InferencingTests)  Time elapsed: 0.091 sec
14-May-2018 18:55:57 testClassLiteral1(org.eclipse.jdt.core.groovy.tests.search.InferencingTests)  Time elapsed: 0.092 sec
14-May-2018 18:55:57 testClassLiteral2(org.eclipse.jdt.core.groovy.tests.search.InferencingTests)  Time elapsed: 0.093 sec
14-May-2018 18:55:57 testClassLiteral3(org.eclipse.jdt.core.groovy.tests.search.InferencingTests)  Time elapsed: 0.107 sec
14-May-2018 18:55:57 testClassLiteral4(org.eclipse.jdt.core.groovy.tests.search.InferencingTests)  Time elapsed: 0.097 sec
14-May-2018 18:55:57 testClassLiteral5(org.eclipse.jdt.core.groovy.tests.search.InferencingTests)  Time elapsed: 0.092 sec
14-May-2018 18:55:57 testScriptDeclaringType(org.eclipse.jdt.core.groovy.tests.search.InferencingTests)  Time elapsed: 0.097 sec
14-May-2018 18:55:57 testInstanceOf10(org.eclipse.jdt.core.groovy.tests.search.InferencingTests)  Time elapsed: 0.151 sec
14-May-2018 18:55:57 testInstanceOf1a(org.eclipse.jdt.core.groovy.tests.search.InferencingTests)  Time elapsed: 0.163 sec
14-May-2018 18:55:57 testInstanceOf1b(org.eclipse.jdt.core.groovy.tests.search.InferencingTests)  Time elapsed: 0.162 sec
14-May-2018 18:55:57 testStaticImports1(org.eclipse.jdt.core.groovy.tests.search.InferencingTests)  Time elapsed: 0.11 sec
14-May-2018 18:55:57 testStaticImports2(org.eclipse.jdt.core.groovy.tests.search.InferencingTests)  Time elapsed: 0.103 sec
14-May-2018 18:55:57 testStaticImports3(org.eclipse.jdt.core.groovy.tests.search.InferencingTests)  Time elapsed: 0.114 sec
14-May-2018 18:55:57 testStaticImports4(org.eclipse.jdt.core.groovy.tests.search.InferencingTests)  Time elapsed: 0.095 sec
14-May-2018 18:55:57 testElvisOperator(org.eclipse.jdt.core.groovy.tests.search.InferencingTests)  Time elapsed: 0.091 sec
14-May-2018 18:55:57 testMultiDecl1(org.eclipse.jdt.core.groovy.tests.search.InferencingTests)  Time elapsed: 0.116 sec
14-May-2018 18:55:57 testMultiDecl2(org.eclipse.jdt.core.groovy.tests.search.InferencingTests)  Time elapsed: 0.105 sec
14-May-2018 18:55:57 testMultiDecl3(org.eclipse.jdt.core.groovy.tests.search.InferencingTests)  Time elapsed: 0.111 sec
14-May-2018 18:55:57 testMultiDecl4(org.eclipse.jdt.core.groovy.tests.search.InferencingTests)  Time elapsed: 0.11 sec
14-May-2018 18:55:57 testMultiDecl6(org.eclipse.jdt.core.groovy.tests.search.InferencingTests)  Time elapsed: 0.113 sec
14-May-2018 18:55:57 testMultiDecl7(org.eclipse.jdt.core.groovy.tests.search.InferencingTests)  Time elapsed: 0.114 sec
14-May-2018 18:55:57 testMultiDecl8(org.eclipse.jdt.core.groovy.tests.search.InferencingTests)  Time elapsed: 0.113 sec
14-May-2018 18:55:57 testMultiDecl9(org.eclipse.jdt.core.groovy.tests.search.InferencingTests)  Time elapsed: 0.111 sec
14-May-2018 18:55:57 testStaticThisAndSuper(org.eclipse.jdt.core.groovy.tests.search.InferencingTests)  Time elapsed: 0.103 sec
14-May-2018 18:55:57 testLocalMethod1(org.eclipse.jdt.core.groovy.tests.search.InferencingTests)  Time elapsed: 0.095 sec
14-May-2018 18:55:57 testLocalMethod2(org.eclipse.jdt.core.groovy.tests.search.InferencingTests)  Time elapsed: 0.095 sec
14-May-2018 18:55:57 testLocalMethod3(org.eclipse.jdt.core.groovy.tests.search.InferencingTests)  Time elapsed: 0.099 sec
14-May-2018 18:55:57 testLocalMethod4(org.eclipse.jdt.core.groovy.tests.search.InferencingTests)  Time elapsed: 0.099 sec
14-May-2018 18:55:57 testLocalMethod5(org.eclipse.jdt.core.groovy.tests.search.InferencingTests)  Time elapsed: 0.097 sec
14-May-2018 18:55:57 testLocalMethod6(org.eclipse.jdt.core.groovy.tests.search.InferencingTests)  Time elapsed: 0.11 sec
14-May-2018 18:55:57 testLocalMethod7(org.eclipse.jdt.core.groovy.tests.search.InferencingTests)  Time elapsed: 0.1 sec
14-May-2018 18:55:57 testLocalVar2a(org.eclipse.jdt.core.groovy.tests.search.InferencingTests)  Time elapsed: 0.108 sec
14-May-2018 18:55:57 testNoGString(org.eclipse.jdt.core.groovy.tests.search.InferencingTests)  Time elapsed: 0.094 sec
14-May-2018 18:55:57 testMapEntries1(org.eclipse.jdt.core.groovy.tests.search.InferencingTests)  Time elapsed: 0.126 sec
14-May-2018 18:55:57 testObjectMethodOnInterfaceAsProperty(org.eclipse.jdt.core.groovy.tests.search.InferencingTests)  Time elapsed: 0.096 sec
14-May-2018 18:55:57 testMatcher1(org.eclipse.jdt.core.groovy.tests.search.InferencingTests)  Time elapsed: 0.092 sec
14-May-2018 18:55:57 testMatcher2(org.eclipse.jdt.core.groovy.tests.search.InferencingTests)  Time elapsed: 0.103 sec
14-May-2018 18:55:57 testSuperFieldReference(org.eclipse.jdt.core.groovy.tests.search.InferencingTests)  Time elapsed: 0.099 sec
14-May-2018 18:55:57 testAssignementInInnerBlock2(org.eclipse.jdt.core.groovy.tests.search.InferencingTests)  Time elapsed: 0.101 sec
14-May-2018 18:55:57 testAssignment1(org.eclipse.jdt.core.groovy.tests.search.InferencingTests)  Time elapsed: 0.098 sec
14-May-2018 18:55:57 testAssignment2(org.eclipse.jdt.core.groovy.tests.search.InferencingTests)  Time elapsed: 0.095 sec
14-May-2018 18:55:57 testAssignment3(org.eclipse.jdt.core.groovy.tests.search.InferencingTests)  Time elapsed: 0.127 sec
14-May-2018 18:55:57 testAssignment4(org.eclipse.jdt.core.groovy.tests.search.InferencingTests)  Time elapsed: 0.098 sec
14-May-2018 18:55:57 testAssignment5(org.eclipse.jdt.core.groovy.tests.search.InferencingTests)  Time elapsed: 0.093 sec
14-May-2018 18:55:57 testStaticMethodCall2(org.eclipse.jdt.core.groovy.tests.search.InferencingTests)  Time elapsed: 0.098 sec
14-May-2018 18:55:57 testStaticMethodCall3(org.eclipse.jdt.core.groovy.tests.search.InferencingTests)  Time elapsed: 0.095 sec
14-May-2018 18:55:57 testStaticMethodCall4(org.eclipse.jdt.core.groovy.tests.search.InferencingTests)  Time elapsed: 0.093 sec
14-May-2018 18:55:57 testStaticMethodCall5(org.eclipse.jdt.core.groovy.tests.search.InferencingTests)  Time elapsed: 0.128 sec
14-May-2018 18:55:57 testStaticMethodCall6(org.eclipse.jdt.core.groovy.tests.search.InferencingTests)  Time elapsed: 0.103 sec
14-May-2018 18:55:57 testStaticMethodCall7(org.eclipse.jdt.core.groovy.tests.search.InferencingTests)  Time elapsed: 0.107 sec
14-May-2018 18:55:57 testStaticMethodCall8(org.eclipse.jdt.core.groovy.tests.search.InferencingTests)  Time elapsed: 0.106 sec
14-May-2018 18:55:57 testStaticMethodCall9(org.eclipse.jdt.core.groovy.tests.search.InferencingTests)  Time elapsed: 0.11 sec
14-May-2018 18:55:57 testCatchBlock1(org.eclipse.jdt.core.groovy.tests.search.InferencingTests)  Time elapsed: 0.097 sec
14-May-2018 18:55:57 testCatchBlock2(org.eclipse.jdt.core.groovy.tests.search.InferencingTests)  Time elapsed: 0.095 sec
14-May-2018 18:55:57 testCatchBlock3(org.eclipse.jdt.core.groovy.tests.search.InferencingTests)  Time elapsed: 0.108 sec
14-May-2018 18:55:57 testCatchBlock4(org.eclipse.jdt.core.groovy.tests.search.InferencingTests)  Time elapsed: 0.106 sec
14-May-2018 18:55:57 testCatchBlock5(org.eclipse.jdt.core.groovy.tests.search.InferencingTests)  Time elapsed: 0.105 sec
14-May-2018 18:55:57 testTernaryExpression(org.eclipse.jdt.core.groovy.tests.search.InferencingTests)  Time elapsed: 0.106 sec
14-May-2018 18:55:57 testInterfaceMethodAsProperty2(org.eclipse.jdt.core.groovy.tests.search.InferencingTests)  Time elapsed: 0.13 sec
14-May-2018 18:55:57 testInterfaceMethodAsProperty3(org.eclipse.jdt.core.groovy.tests.search.InferencingTests)  Time elapsed: 0.135 sec
14-May-2018 18:55:57 testGetAt1(org.eclipse.jdt.core.groovy.tests.search.InferencingTests)  Time elapsed: 0.105 sec
14-May-2018 18:55:57 testGetAt2(org.eclipse.jdt.core.groovy.tests.search.InferencingTests)  Time elapsed: 0.097 sec
14-May-2018 18:55:57 testGetAt3(org.eclipse.jdt.core.groovy.tests.search.InferencingTests)  Time elapsed: 0.114 sec
14-May-2018 18:55:57 testGetAt4(org.eclipse.jdt.core.groovy.tests.search.InferencingTests)  Time elapsed: 0.101 sec
14-May-2018 18:55:57 testGetAt5(org.eclipse.jdt.core.groovy.tests.search.InferencingTests)  Time elapsed: 0.123 sec
14-May-2018 18:55:57 testGetAt6(org.eclipse.jdt.core.groovy.tests.search.InferencingTests)  Time elapsed: 0.113 sec
14-May-2018 18:55:57 testGetAt7(org.eclipse.jdt.core.groovy.tests.search.InferencingTests)  Time elapsed: 0.123 sec
14-May-2018 18:55:57 testFieldWithInitializer1(org.eclipse.jdt.core.groovy.tests.search.InferencingTests)  Time elapsed: 0.098 sec
14-May-2018 18:55:57 testFieldWithInitializer2(org.eclipse.jdt.core.groovy.tests.search.InferencingTests)  Time elapsed: 0.106 sec
14-May-2018 18:55:57 testNested1(org.eclipse.jdt.core.groovy.tests.search.InferencingTests)  Time elapsed: 0.096 sec
14-May-2018 18:55:57 testNested2(org.eclipse.jdt.core.groovy.tests.search.InferencingTests)  Time elapsed: 0.093 sec
14-May-2018 18:55:57 testNested3(org.eclipse.jdt.core.groovy.tests.search.InferencingTests)  Time elapsed: 0.094 sec
14-May-2018 18:55:57 testNested4(org.eclipse.jdt.core.groovy.tests.search.InferencingTests)  Time elapsed: 0.105 sec
14-May-2018 18:55:57 testIndirectInterfaceConstant(org.eclipse.jdt.core.groovy.tests.search.InferencingTests)  Time elapsed: 0.145 sec
14-May-2018 18:55:57 testInstanceOf1(org.eclipse.jdt.core.groovy.tests.search.InferencingTests)  Time elapsed: 0.152 sec
14-May-2018 18:55:57 testInstanceOf2(org.eclipse.jdt.core.groovy.tests.search.InferencingTests)  Time elapsed: 0.145 sec
14-May-2018 18:55:57 testInstanceOf3(org.eclipse.jdt.core.groovy.tests.search.InferencingTests)  Time elapsed: 0.168 sec
14-May-2018 18:55:57 testInstanceOf4(org.eclipse.jdt.core.groovy.tests.search.InferencingTests)  Time elapsed: 0.235 sec
14-May-2018 18:55:57 testInstanceOf5(org.eclipse.jdt.core.groovy.tests.search.InferencingTests)  Time elapsed: 0.192 sec
14-May-2018 18:55:57 testInstanceOf6(org.eclipse.jdt.core.groovy.tests.search.InferencingTests)  Time elapsed: 0.158 sec
14-May-2018 18:55:57 testInstanceOf7(org.eclipse.jdt.core.groovy.tests.search.InferencingTests)  Time elapsed: 0.158 sec
14-May-2018 18:55:57 testInstanceOf8(org.eclipse.jdt.core.groovy.tests.search.InferencingTests)  Time elapsed: 0.161 sec
14-May-2018 18:55:57 testInstanceOf9(org.eclipse.jdt.core.groovy.tests.search.InferencingTests)  Time elapsed: 0.153 sec
14-May-2018 18:55:57 testAnonInner1(org.eclipse.jdt.core.groovy.tests.search.InferencingTests)  Time elapsed: 0.102 sec
14-May-2018 18:55:57 testAnonInner2(org.eclipse.jdt.core.groovy.tests.search.InferencingTests)  Time elapsed: 0.104 sec
14-May-2018 18:55:57 testAnonInner3(org.eclipse.jdt.core.groovy.tests.search.InferencingTests)  Time elapsed: 0.1 sec
14-May-2018 18:55:57 testAnonInner4(org.eclipse.jdt.core.groovy.tests.search.InferencingTests)  Time elapsed: 0.099 sec
14-May-2018 18:55:57 testAnonInner5(org.eclipse.jdt.core.groovy.tests.search.InferencingTests)  Time elapsed: 0.106 sec
14-May-2018 18:55:57 testAnonInner6(org.eclipse.jdt.core.groovy.tests.search.InferencingTests)  Time elapsed: 0.127 sec
14-May-2018 18:55:57 testAnonInner7(org.eclipse.jdt.core.groovy.tests.search.InferencingTests)  Time elapsed: 0.172 sec
14-May-2018 18:55:57 testThisInInnerClass1(org.eclipse.jdt.core.groovy.tests.search.InferencingTests)  Time elapsed: 0.129 sec
14-May-2018 18:55:57 testNumber1(org.eclipse.jdt.core.groovy.tests.search.InferencingTests)  Time elapsed: 0.119 sec
14-May-2018 18:55:57 testNumber2(org.eclipse.jdt.core.groovy.tests.search.InferencingTests)  Time elapsed: 0.096 sec
14-May-2018 18:55:57 testNumber3(org.eclipse.jdt.core.groovy.tests.search.InferencingTests)  Time elapsed: 0.103 sec
14-May-2018 18:55:57 testNumber4(org.eclipse.jdt.core.groovy.tests.search.InferencingTests)  Time elapsed: 0.102 sec
14-May-2018 18:55:57 testNumber5(org.eclipse.jdt.core.groovy.tests.search.InferencingTests)  Time elapsed: 0.098 sec
14-May-2018 18:55:57 testNumber6(org.eclipse.jdt.core.groovy.tests.search.InferencingTests)  Time elapsed: 0.094 sec
14-May-2018 18:55:57 testSpread1(org.eclipse.jdt.core.groovy.tests.search.InferencingTests)  Time elapsed: 0.097 sec
14-May-2018 18:55:57 testSpread2(org.eclipse.jdt.core.groovy.tests.search.InferencingTests)  Time elapsed: 0.096 sec
14-May-2018 18:55:57 testSpread3(org.eclipse.jdt.core.groovy.tests.search.InferencingTests)  Time elapsed: 0.094 sec
14-May-2018 18:55:57 testSpread4(org.eclipse.jdt.core.groovy.tests.search.InferencingTests)  Time elapsed: 0.096 sec
14-May-2018 18:55:57 testSpread5(org.eclipse.jdt.core.groovy.tests.search.InferencingTests)  Time elapsed: 0.095 sec
14-May-2018 18:55:57 testSpread6(org.eclipse.jdt.core.groovy.tests.search.InferencingTests)  Time elapsed: 0.093 sec
14-May-2018 18:55:57 testSpread7(org.eclipse.jdt.core.groovy.tests.search.InferencingTests)  Time elapsed: 0.095 sec
14-May-2018 18:55:57 testSpread8(org.eclipse.jdt.core.groovy.tests.search.InferencingTests)  Time elapsed: 0.096 sec
14-May-2018 18:55:57 testSpread9(org.eclipse.jdt.core.groovy.tests.search.InferencingTests)  Time elapsed: 0.096 sec
14-May-2018 18:55:57 testPattern1(org.eclipse.jdt.core.groovy.tests.search.InferencingTests)  Time elapsed: 0.096 sec
14-May-2018 18:55:57 testPattern2(org.eclipse.jdt.core.groovy.tests.search.InferencingTests)  Time elapsed: 0.093 sec
14-May-2018 18:55:57 testString1(org.eclipse.jdt.core.groovy.tests.search.InferencingTests)  Time elapsed: 0.092 sec
14-May-2018 18:55:57 testString2(org.eclipse.jdt.core.groovy.tests.search.InferencingTests)  Time elapsed: 0.121 sec
14-May-2018 18:55:57 testString3(org.eclipse.jdt.core.groovy.tests.search.InferencingTests)  Time elapsed: 0.094 sec
14-May-2018 18:55:57 testString4(org.eclipse.jdt.core.groovy.tests.search.InferencingTests)  Time elapsed: 0.094 sec
14-May-2018 18:55:57 testStaticMethodCall(org.eclipse.jdt.core.groovy.tests.search.InferencingTests)  Time elapsed: 0.099 sec
14-May-2018 18:55:57 testClassReference1(org.eclipse.jdt.core.groovy.tests.search.InferencingTests)  Time elapsed: 0.116 sec
14-May-2018 18:55:57 testClassReference2(org.eclipse.jdt.core.groovy.tests.search.InferencingTests)  Time elapsed: 0.094 sec
14-May-2018 18:55:57 testClassReference3(org.eclipse.jdt.core.groovy.tests.search.InferencingTests)  Time elapsed: 0.092 sec
14-May-2018 18:55:57 testClassReference4(org.eclipse.jdt.core.groovy.tests.search.InferencingTests)  Time elapsed: 0.095 sec
14-May-2018 18:55:57 testPropertyNodeFromJava1(org.eclipse.jdt.core.groovy.tests.search.JDTPropertyNodeInferencingTests)  Time elapsed: 0.102 sec
14-May-2018 18:55:57 testPropertyNodeFromJava2(org.eclipse.jdt.core.groovy.tests.search.JDTPropertyNodeInferencingTests)  Time elapsed: 0.098 sec
14-May-2018 18:55:57 testPropertyNodeFromJava3(org.eclipse.jdt.core.groovy.tests.search.JDTPropertyNodeInferencingTests)  Time elapsed: 0.101 sec
14-May-2018 18:55:57 testPropertyNodeFromJava4(org.eclipse.jdt.core.groovy.tests.search.JDTPropertyNodeInferencingTests)  Time elapsed: 0.101 sec
14-May-2018 18:55:57 testNodeFromJava1(org.eclipse.jdt.core.groovy.tests.search.JDTPropertyNodeInferencingTests)  Time elapsed: 0.098 sec
14-May-2018 18:55:57 testPropertyNodeReferenceInBinary1(org.eclipse.jdt.core.groovy.tests.search.JDTPropertyNodeInferencingTests)  Time elapsed: 0.105 sec
14-May-2018 18:55:57 testvarReferenceInGString1(org.eclipse.jdt.core.groovy.tests.search.LocalVariableReferenceSearchTests)  Time elapsed: 0.106 sec
14-May-2018 18:55:57 testvarReferenceInGString2(org.eclipse.jdt.core.groovy.tests.search.LocalVariableReferenceSearchTests)  Time elapsed: 0.1 sec
14-May-2018 18:55:57 testvarReferenceInGString3(org.eclipse.jdt.core.groovy.tests.search.LocalVariableReferenceSearchTests)  Time elapsed: 0.097 sec
14-May-2018 18:55:57 testvarReferenceInGString4(org.eclipse.jdt.core.groovy.tests.search.LocalVariableReferenceSearchTests)  Time elapsed: 0.096 sec
14-May-2018 18:55:57 testvarReferenceInGString5(org.eclipse.jdt.core.groovy.tests.search.LocalVariableReferenceSearchTests)  Time elapsed: 0.116 sec
14-May-2018 18:55:57 testvarReference1(org.eclipse.jdt.core.groovy.tests.search.LocalVariableReferenceSearchTests)  Time elapsed: 0.106 sec
14-May-2018 18:55:57 testvarReference2(org.eclipse.jdt.core.groovy.tests.search.LocalVariableReferenceSearchTests)  Time elapsed: 0.1 sec
14-May-2018 18:55:57 testvarReference3(org.eclipse.jdt.core.groovy.tests.search.LocalVariableReferenceSearchTests)  Time elapsed: 0.102 sec
14-May-2018 18:55:57 testvarReference4(org.eclipse.jdt.core.groovy.tests.search.LocalVariableReferenceSearchTests)  Time elapsed: 0.094 sec
14-May-2018 18:55:57 testvarReference5(org.eclipse.jdt.core.groovy.tests.search.LocalVariableReferenceSearchTests)  Time elapsed: 0.098 sec
14-May-2018 18:55:57 testvarReference6(org.eclipse.jdt.core.groovy.tests.search.LocalVariableReferenceSearchTests)  Time elapsed: 0.102 sec
14-May-2018 18:55:57 testvarReference7(org.eclipse.jdt.core.groovy.tests.search.LocalVariableReferenceSearchTests)  Time elapsed: 0.099 sec
14-May-2018 18:55:57 testvarReference8(org.eclipse.jdt.core.groovy.tests.search.LocalVariableReferenceSearchTests)  Time elapsed: 0.096 sec
14-May-2018 18:55:57 testvarReference9(org.eclipse.jdt.core.groovy.tests.search.LocalVariableReferenceSearchTests)  Time elapsed: 0.099 sec
14-May-2018 18:55:57 testvarReference10(org.eclipse.jdt.core.groovy.tests.search.LocalVariableReferenceSearchTests)  Time elapsed: 0.095 sec
14-May-2018 18:55:57 testConstructorReferenceSearch(org.eclipse.jdt.core.groovy.tests.search.MethodReferenceSearchTests)  Time elapsed: 0.169 sec
14-May-2018 18:55:57 testOverloadedMethodReferences1(org.eclipse.jdt.core.groovy.tests.search.MethodReferenceSearchTests)  Time elapsed: 0.173 sec
14-May-2018 18:55:57 testOverloadedMethodReferences2(org.eclipse.jdt.core.groovy.tests.search.MethodReferenceSearchTests)  Time elapsed: 0.169 sec
14-May-2018 18:55:57 testOverloadedMethodReferences3(org.eclipse.jdt.core.groovy.tests.search.MethodReferenceSearchTests)  Time elapsed: 0.189 sec
14-May-2018 18:55:57 testOverloadedMethodReferences4(org.eclipse.jdt.core.groovy.tests.search.MethodReferenceSearchTests)  Time elapsed: 0.208 sec
14-May-2018 18:55:57 testOverloadedMethodReferences5(org.eclipse.jdt.core.groovy.tests.search.MethodReferenceSearchTests)  Time elapsed: 0.272 sec
14-May-2018 18:55:57 testOverloadedMethodReferences6(org.eclipse.jdt.core.groovy.tests.search.MethodReferenceSearchTests)  Time elapsed: 0.202 sec
14-May-2018 18:55:57 testStaticMethodReferenceSearch(org.eclipse.jdt.core.groovy.tests.search.MethodReferenceSearchTests)  Time elapsed: 0.098 sec
14-May-2018 18:55:57 testMethodReferencesInClass1(org.eclipse.jdt.core.groovy.tests.search.MethodReferenceSearchTests)  Time elapsed: 0.185 sec
14-May-2018 18:55:57 testMethodReferencesInClass2(org.eclipse.jdt.core.groovy.tests.search.MethodReferenceSearchTests)  Time elapsed: 0.187 sec
14-May-2018 18:55:57 testMethodReferencesInClass3(org.eclipse.jdt.core.groovy.tests.search.MethodReferenceSearchTests)  Time elapsed: 0.201 sec
14-May-2018 18:55:57 testMethodReferencesInClass4(org.eclipse.jdt.core.groovy.tests.search.MethodReferenceSearchTests)  Time elapsed: 0.211 sec
14-May-2018 18:55:57 testGenericsMethodReferenceSearch(org.eclipse.jdt.core.groovy.tests.search.MethodReferenceSearchTests)  Time elapsed: 0.184 sec
14-May-2018 18:55:57 testMethodReferencesInScript1GRE_1180(org.eclipse.jdt.core.groovy.tests.search.MethodReferenceSearchTests)  Time elapsed: 0.196 sec
14-May-2018 18:55:57 testMethodReferencesInScript1(org.eclipse.jdt.core.groovy.tests.search.MethodReferenceSearchTests)  Time elapsed: 0.186 sec
14-May-2018 18:55:57 testMethodReferencesInScript2(org.eclipse.jdt.core.groovy.tests.search.MethodReferenceSearchTests)  Time elapsed: 0.193 sec
14-May-2018 18:55:57 testMethodReferencesInScript3(org.eclipse.jdt.core.groovy.tests.search.MethodReferenceSearchTests)  Time elapsed: 0.2 sec
14-May-2018 18:55:57 testMethodReferencesInScript4(org.eclipse.jdt.core.groovy.tests.search.MethodReferenceSearchTests)  Time elapsed: 0.186 sec
14-May-2018 18:55:57 testMethodReferencesInScript5(org.eclipse.jdt.core.groovy.tests.search.MethodReferenceSearchTests)  Time elapsed: 0.194 sec
14-May-2018 18:55:57 testMethodReferencesInScript6(org.eclipse.jdt.core.groovy.tests.search.MethodReferenceSearchTests)  Time elapsed: 0.212 sec
14-May-2018 18:55:57 testMethodReferencesInScript7(org.eclipse.jdt.core.groovy.tests.search.MethodReferenceSearchTests)  Time elapsed: 0.201 sec
14-May-2018 18:55:57 testMethodReferencesInScript8(org.eclipse.jdt.core.groovy.tests.search.MethodReferenceSearchTests)  Time elapsed: 0.196 sec
14-May-2018 18:55:57 testMethodWithDefaultParameters1(org.eclipse.jdt.core.groovy.tests.search.MethodReferenceSearchTests)  Time elapsed: 0.196 sec
14-May-2018 18:55:57 testMethodWithDefaultParameters2(org.eclipse.jdt.core.groovy.tests.search.MethodReferenceSearchTests)  Time elapsed: 0.19 sec
14-May-2018 18:55:57 testRightShift(org.eclipse.jdt.core.groovy.tests.search.OperatorOverloadingInferencingTests)  Time elapsed: 0.1 sec
14-May-2018 18:55:57 testLeftShift(org.eclipse.jdt.core.groovy.tests.search.OperatorOverloadingInferencingTests)  Time elapsed: 0.119 sec
14-May-2018 18:55:57 testAnd(org.eclipse.jdt.core.groovy.tests.search.OperatorOverloadingInferencingTests)  Time elapsed: 0.101 sec
14-May-2018 18:55:57 testMod(org.eclipse.jdt.core.groovy.tests.search.OperatorOverloadingInferencingTests)  Time elapsed: 0.105 sec
14-May-2018 18:55:57 testXor(org.eclipse.jdt.core.groovy.tests.search.OperatorOverloadingInferencingTests)  Time elapsed: 0.093 sec
14-May-2018 18:55:57 testPlus1(org.eclipse.jdt.core.groovy.tests.search.OperatorOverloadingInferencingTests)  Time elapsed: 0.11 sec
14-May-2018 18:55:57 testPlus2(org.eclipse.jdt.core.groovy.tests.search.OperatorOverloadingInferencingTests)  Time elapsed: 0.117 sec
14-May-2018 18:55:57 testPlus3(org.eclipse.jdt.core.groovy.tests.search.OperatorOverloadingInferencingTests)  Time elapsed: 0.106 sec
14-May-2018 18:55:57 testOr(org.eclipse.jdt.core.groovy.tests.search.OperatorOverloadingInferencingTests)  Time elapsed: 0.112 sec
14-May-2018 18:55:57 testPrefix1(org.eclipse.jdt.core.groovy.tests.search.OperatorOverloadingInferencingTests)  Time elapsed: 0.115 sec
14-May-2018 18:55:57 testPrefix2(org.eclipse.jdt.core.groovy.tests.search.OperatorOverloadingInferencingTests)  Time elapsed: 0.156 sec
14-May-2018 18:55:57 testPrefix3(org.eclipse.jdt.core.groovy.tests.search.OperatorOverloadingInferencingTests)  Time elapsed: 0.125 sec
14-May-2018 18:55:57 testPrefix4(org.eclipse.jdt.core.groovy.tests.search.OperatorOverloadingInferencingTests)  Time elapsed: 0.111 sec
14-May-2018 18:55:57 testPrefix5(org.eclipse.jdt.core.groovy.tests.search.OperatorOverloadingInferencingTests)  Time elapsed: 0.15 sec
14-May-2018 18:55:57 testPrefix6(org.eclipse.jdt.core.groovy.tests.search.OperatorOverloadingInferencingTests)  Time elapsed: 0.116 sec
14-May-2018 18:55:57 testLongExpr1(org.eclipse.jdt.core.groovy.tests.search.OperatorOverloadingInferencingTests)  Time elapsed: 0.118 sec
14-May-2018 18:55:57 testLongExpr2(org.eclipse.jdt.core.groovy.tests.search.OperatorOverloadingInferencingTests)  Time elapsed: 0.118 sec
14-May-2018 18:55:57 testLongExpr3(org.eclipse.jdt.core.groovy.tests.search.OperatorOverloadingInferencingTests)  Time elapsed: 0.105 sec
14-May-2018 18:55:57 testAttributeExpr1(org.eclipse.jdt.core.groovy.tests.search.OperatorOverloadingInferencingTests)  Time elapsed: 0.112 sec
14-May-2018 18:55:57 testAttributeExpr2(org.eclipse.jdt.core.groovy.tests.search.OperatorOverloadingInferencingTests)  Time elapsed: 0.109 sec
14-May-2018 18:55:57 testDivide(org.eclipse.jdt.core.groovy.tests.search.OperatorOverloadingInferencingTests)  Time elapsed: 0.107 sec
14-May-2018 18:55:57 testMultiply(org.eclipse.jdt.core.groovy.tests.search.OperatorOverloadingInferencingTests)  Time elapsed: 0.104 sec
14-May-2018 18:55:57 testGetAt1(org.eclipse.jdt.core.groovy.tests.search.OperatorOverloadingInferencingTests)  Time elapsed: 0.109 sec
14-May-2018 18:55:57 testGetAt2(org.eclipse.jdt.core.groovy.tests.search.OperatorOverloadingInferencingTests)  Time elapsed: 0.116 sec
14-May-2018 18:55:57 testGetAt3(org.eclipse.jdt.core.groovy.tests.search.OperatorOverloadingInferencingTests)  Time elapsed: 0.134 sec
14-May-2018 18:55:57 testGetAt4(org.eclipse.jdt.core.groovy.tests.search.OperatorOverloadingInferencingTests)  Time elapsed: 0.112 sec
14-May-2018 18:55:57 testGetAt5(org.eclipse.jdt.core.groovy.tests.search.OperatorOverloadingInferencingTests)  Time elapsed: 0.116 sec
14-May-2018 18:55:57 testGetAt6(org.eclipse.jdt.core.groovy.tests.search.OperatorOverloadingInferencingTests)  Time elapsed: 0.117 sec
14-May-2018 18:55:57 testGetAt7(org.eclipse.jdt.core.groovy.tests.search.OperatorOverloadingInferencingTests)  Time elapsed: 0.113 sec
14-May-2018 18:55:57 testGetAt8(org.eclipse.jdt.core.groovy.tests.search.OperatorOverloadingInferencingTests)  Time elapsed: 0.117 sec
14-May-2018 18:55:57 testGetAt9(org.eclipse.jdt.core.groovy.tests.search.OperatorOverloadingInferencingTests)  Time elapsed: 0.123 sec
14-May-2018 18:55:57 testPostfix1(org.eclipse.jdt.core.groovy.tests.search.OperatorOverloadingInferencingTests)  Time elapsed: 0.112 sec
14-May-2018 18:55:57 testPostfix2(org.eclipse.jdt.core.groovy.tests.search.OperatorOverloadingInferencingTests)  Time elapsed: 0.126 sec
14-May-2018 18:55:57 testMinus1(org.eclipse.jdt.core.groovy.tests.search.OperatorOverloadingInferencingTests)  Time elapsed: 0.122 sec
14-May-2018 18:55:57 testMinus2(org.eclipse.jdt.core.groovy.tests.search.OperatorOverloadingInferencingTests)  Time elapsed: 0.131 sec
14-May-2018 18:55:57 testNumberPlusString1(org.eclipse.jdt.core.groovy.tests.search.OperatorOverloadingInferencingTests)  Time elapsed: 0.108 sec
14-May-2018 18:55:57 testNumberPlusString2(org.eclipse.jdt.core.groovy.tests.search.OperatorOverloadingInferencingTests)  Time elapsed: 0.106 sec
14-May-2018 18:55:57 testCompleteExpr1(org.eclipse.jdt.core.groovy.tests.search.OperatorOverloadingInferencingTests)  Time elapsed: 0.104 sec
14-May-2018 18:55:57 testCompleteExpr2(org.eclipse.jdt.core.groovy.tests.search.OperatorOverloadingInferencingTests)  Time elapsed: 0.113 sec
14-May-2018 18:55:57 testCompleteExpr3(org.eclipse.jdt.core.groovy.tests.search.OperatorOverloadingInferencingTests)  Time elapsed: 0.091 sec
14-May-2018 18:55:57 testCompleteExpr4(org.eclipse.jdt.core.groovy.tests.search.OperatorOverloadingInferencingTests)  Time elapsed: 0.097 sec
14-May-2018 18:55:57 testCompleteExpr5(org.eclipse.jdt.core.groovy.tests.search.OperatorOverloadingInferencingTests)  Time elapsed: 0.114 sec
14-May-2018 18:55:57 testCompleteExpr6(org.eclipse.jdt.core.groovy.tests.search.OperatorOverloadingInferencingTests)  Time elapsed: 0.101 sec
14-May-2018 18:55:57 testCompleteExpr7(org.eclipse.jdt.core.groovy.tests.search.OperatorOverloadingInferencingTests)  Time elapsed: 0.099 sec
14-May-2018 18:55:57 testCompleteExpr8(org.eclipse.jdt.core.groovy.tests.search.OperatorOverloadingInferencingTests)  Time elapsed: 0.095 sec
14-May-2018 18:55:57 testNonStaticReference1(org.eclipse.jdt.core.groovy.tests.search.StaticInferencingTests)  Time elapsed: 0.1 sec
14-May-2018 18:55:57 testNonStaticReference2(org.eclipse.jdt.core.groovy.tests.search.StaticInferencingTests)  Time elapsed: 0.101 sec
14-May-2018 18:55:57 testNonStaticReference3(org.eclipse.jdt.core.groovy.tests.search.StaticInferencingTests)  Time elapsed: 0.099 sec
14-May-2018 18:55:57 testNonStaticReference4(org.eclipse.jdt.core.groovy.tests.search.StaticInferencingTests)  Time elapsed: 0.099 sec
14-May-2018 18:55:57 testNonStaticReference5(org.eclipse.jdt.core.groovy.tests.search.StaticInferencingTests)  Time elapsed: 0.096 sec
14-May-2018 18:55:57 testNonStaticReference6(org.eclipse.jdt.core.groovy.tests.search.StaticInferencingTests)  Time elapsed: 0.099 sec
14-May-2018 18:55:57 testNonStaticReference7(org.eclipse.jdt.core.groovy.tests.search.StaticInferencingTests)  Time elapsed: 0.095 sec
14-May-2018 18:55:57 testNonStaticReference8(org.eclipse.jdt.core.groovy.tests.search.StaticInferencingTests)  Time elapsed: 0.098 sec
14-May-2018 18:55:57 testStaticReference1(org.eclipse.jdt.core.groovy.tests.search.StaticInferencingTests)  Time elapsed: 0.1 sec
14-May-2018 18:55:57 testStaticImport1(org.eclipse.jdt.core.groovy.tests.search.StaticInferencingTests)  Time elapsed: 0.108 sec
14-May-2018 18:55:57 testStaticImport2(org.eclipse.jdt.core.groovy.tests.search.StaticInferencingTests)  Time elapsed: 0.106 sec
14-May-2018 18:55:57 testStaticImport3(org.eclipse.jdt.core.groovy.tests.search.StaticInferencingTests)  Time elapsed: 0.112 sec
14-May-2018 18:55:57 testStaticImport4(org.eclipse.jdt.core.groovy.tests.search.StaticInferencingTests)  Time elapsed: 0.11 sec
14-May-2018 18:55:57 testStaticImport5(org.eclipse.jdt.core.groovy.tests.search.StaticInferencingTests)  Time elapsed: 0.106 sec
14-May-2018 18:55:57 testStaticImport6(org.eclipse.jdt.core.groovy.tests.search.StaticInferencingTests)  Time elapsed: 0.147 sec
14-May-2018 18:55:57 testStaticImport7(org.eclipse.jdt.core.groovy.tests.search.StaticInferencingTests)  Time elapsed: 0.117 sec
14-May-2018 18:55:57 testStaticImport8(org.eclipse.jdt.core.groovy.tests.search.StaticInferencingTests)  Time elapsed: 0.105 sec
14-May-2018 18:55:57 testStaticImport9(org.eclipse.jdt.core.groovy.tests.search.StaticInferencingTests)  Time elapsed: 0.109 sec
14-May-2018 18:55:57 testSTCAndClassInstance(org.eclipse.jdt.core.groovy.tests.search.StaticInferencingTests)  Time elapsed: 0.101 sec
14-May-2018 18:55:57 testClassReference10(org.eclipse.jdt.core.groovy.tests.search.StaticInferencingTests)  Time elapsed: 0.099 sec
14-May-2018 18:55:57 testClassReference11(org.eclipse.jdt.core.groovy.tests.search.StaticInferencingTests)  Time elapsed: 0.091 sec
14-May-2018 18:55:57 testClassReference12(org.eclipse.jdt.core.groovy.tests.search.StaticInferencingTests)  Time elapsed: 0.097 sec
14-May-2018 18:55:57 testClassReference13(org.eclipse.jdt.core.groovy.tests.search.StaticInferencingTests)  Time elapsed: 0.119 sec
14-May-2018 18:55:57 testClassReference14(org.eclipse.jdt.core.groovy.tests.search.StaticInferencingTests)  Time elapsed: 0.098 sec
14-May-2018 18:55:57 testClassReference15(org.eclipse.jdt.core.groovy.tests.search.StaticInferencingTests)  Time elapsed: 0.106 sec
14-May-2018 18:55:57 testClassReference4a(org.eclipse.jdt.core.groovy.tests.search.StaticInferencingTests)  Time elapsed: 0.1 sec
14-May-2018 18:55:57 testClassReference1(org.eclipse.jdt.core.groovy.tests.search.StaticInferencingTests)  Time elapsed: 0.098 sec
14-May-2018 18:55:57 testClassReference2(org.eclipse.jdt.core.groovy.tests.search.StaticInferencingTests)  Time elapsed: 0.103 sec
14-May-2018 18:55:57 testClassReference3(org.eclipse.jdt.core.groovy.tests.search.StaticInferencingTests)  Time elapsed: 0.109 sec
14-May-2018 18:55:57 testClassReference4(org.eclipse.jdt.core.groovy.tests.search.StaticInferencingTests)  Time elapsed: 0.098 sec
14-May-2018 18:55:57 testClassReference5(org.eclipse.jdt.core.groovy.tests.search.StaticInferencingTests)  Time elapsed: 0.115 sec
14-May-2018 18:55:57 testClassReference6(org.eclipse.jdt.core.groovy.tests.search.StaticInferencingTests)  Time elapsed: 0.1 sec
14-May-2018 18:55:57 testClassReference7(org.eclipse.jdt.core.groovy.tests.search.StaticInferencingTests)  Time elapsed: 0.097 sec
14-May-2018 18:55:57 testClassReference8(org.eclipse.jdt.core.groovy.tests.search.StaticInferencingTests)  Time elapsed: 0.096 sec
14-May-2018 18:55:57 testClassReference9(org.eclipse.jdt.core.groovy.tests.search.StaticInferencingTests)  Time elapsed: 0.097 sec
14-May-2018 18:55:57 testSyntheticAccessors1(org.eclipse.jdt.core.groovy.tests.search.SyntheticAccessorInferencingTests)  Time elapsed: 0.125 sec
14-May-2018 18:55:57 testSyntheticAccessors2(org.eclipse.jdt.core.groovy.tests.search.SyntheticAccessorInferencingTests)  Time elapsed: 0.127 sec
14-May-2018 18:55:57 testSyntheticAccessors3(org.eclipse.jdt.core.groovy.tests.search.SyntheticAccessorInferencingTests)  Time elapsed: 0.119 sec
14-May-2018 18:55:57 testSyntheticAccessors4(org.eclipse.jdt.core.groovy.tests.search.SyntheticAccessorInferencingTests)  Time elapsed: 1.161 sec
14-May-2018 18:55:57 testFindClassDeclarationWithPattern(org.eclipse.jdt.core.groovy.tests.search.TypeReferenceSearchTests)  Time elapsed: 0.629 sec
14-May-2018 18:55:57 testInnerTypes1(org.eclipse.jdt.core.groovy.tests.search.TypeReferenceSearchTests)  Time elapsed: 1.026 sec
14-May-2018 18:55:57 testInnerTypes2(org.eclipse.jdt.core.groovy.tests.search.TypeReferenceSearchTests)  Time elapsed: 1.041 sec
14-May-2018 18:55:57 testInnerTypes3(org.eclipse.jdt.core.groovy.tests.search.TypeReferenceSearchTests)  Time elapsed: 1.027 sec
14-May-2018 18:55:57 testSearchForTypesScript1(org.eclipse.jdt.core.groovy.tests.search.TypeReferenceSearchTests)  Time elapsed: 0.108 sec
14-May-2018 18:55:57 testSearchForTypesScript2(org.eclipse.jdt.core.groovy.tests.search.TypeReferenceSearchTests)  Time elapsed: 0.113 sec
14-May-2018 18:55:57 testSearchForTypesScript3(org.eclipse.jdt.core.groovy.tests.search.TypeReferenceSearchTests)  Time elapsed: 0.113 sec
14-May-2018 18:55:57 testSearchForTypesScript4(org.eclipse.jdt.core.groovy.tests.search.TypeReferenceSearchTests)  Time elapsed: 0.115 sec
14-May-2018 18:55:57 testSearchForTypesScript5(org.eclipse.jdt.core.groovy.tests.search.TypeReferenceSearchTests)  Time elapsed: 0.111 sec
14-May-2018 18:55:57 testSearchForTypesScript6(org.eclipse.jdt.core.groovy.tests.search.TypeReferenceSearchTests)  Time elapsed: 0.113 sec
14-May-2018 18:55:57 testShouldntFindClassDeclarationInScript(org.eclipse.jdt.core.groovy.tests.search.TypeReferenceSearchTests)  Time elapsed: 0.1 sec
14-May-2018 18:55:57 testSearchForTypesArray1(org.eclipse.jdt.core.groovy.tests.search.TypeReferenceSearchTests)  Time elapsed: 0.113 sec
14-May-2018 18:55:57 testSearchForTypesClass1(org.eclipse.jdt.core.groovy.tests.search.TypeReferenceSearchTests)  Time elapsed: 0.121 sec
14-May-2018 18:55:57 testSearchForTypesClass2(org.eclipse.jdt.core.groovy.tests.search.TypeReferenceSearchTests)  Time elapsed: 0.125 sec
14-May-2018 18:55:57 testSearchForTypesClass3(org.eclipse.jdt.core.groovy.tests.search.TypeReferenceSearchTests)  Time elapsed: 0.115 sec
14-May-2018 18:55:57 testSearchForTypesClass4(org.eclipse.jdt.core.groovy.tests.search.TypeReferenceSearchTests)  Time elapsed: 0.109 sec
14-May-2018 18:55:57 testSearchForTypesClass5(org.eclipse.jdt.core.groovy.tests.search.TypeReferenceSearchTests)  Time elapsed: 0.113 sec
14-May-2018 18:55:57 testSearchForTypesClass6(org.eclipse.jdt.core.groovy.tests.search.TypeReferenceSearchTests)  Time elapsed: 0.113 sec
14-May-2018 18:55:57 testSearchForTypesClass7(org.eclipse.jdt.core.groovy.tests.search.TypeReferenceSearchTests)  Time elapsed: 0.128 sec
14-May-2018 18:55:57 testSearchForTypesClosure1(org.eclipse.jdt.core.groovy.tests.search.TypeReferenceSearchTests)  Time elapsed: 0.121 sec
14-May-2018 18:55:57 testSearchForTypesClosure2(org.eclipse.jdt.core.groovy.tests.search.TypeReferenceSearchTests)  Time elapsed: 0.114 sec
14-May-2018 18:55:57 testSearchForTypesClosure3(org.eclipse.jdt.core.groovy.tests.search.TypeReferenceSearchTests)  Time elapsed: 0.117 sec
14-May-2018 18:55:57 testFindClassDeclaration(org.eclipse.jdt.core.groovy.tests.search.TypeReferenceSearchTests)  Time elapsed: 0.104 sec
14-May-2018 18:55:57 testConstructorWithDefaultArgsInCompileStatic(org.eclipse.jdt.core.groovy.tests.search.TypeReferenceSearchTests)  Time elapsed: 0.368 sec
14-May-2018 18:55:57
14-May-2018 18:55:57 Results :
14-May-2018 18:55:57
14-May-2018 18:55:57 Tests run: 5041, Failures: 0, Errors: 0, Skipped: 167
14-May-2018 18:55:57
14-May-2018 18:55:58
14-May-2018 18:55:58 !ENTRY org.eclipse.e4.ui.workbench.swt 4 2 2018-05-14 18:55:58.730
14-May-2018 18:55:58 !MESSAGE Problems occurred when invoking code from plug-in: "org.eclipse.e4.ui.workbench.swt".
14-May-2018 18:55:58 !STACK 0
14-May-2018 18:55:58 org.eclipse.e4.core.di.InjectionException: org.eclipse.swt.SWTException: Widget is disposed
14-May-2018 18:55:58         at org.eclipse.e4.core.internal.di.MethodRequestor.execute(MethodRequestor.java:62)
14-May-2018 18:55:58         at org.eclipse.e4.core.internal.di.InjectorImpl.processAnnotated(InjectorImpl.java:888)
14-May-2018 18:55:58         at org.eclipse.e4.core.internal.di.InjectorImpl.disposed(InjectorImpl.java:390)
14-May-2018 18:55:58         at org.eclipse.e4.core.internal.di.Requestor.disposed(Requestor.java:143)
14-May-2018 18:55:58         at org.eclipse.e4.core.internal.contexts.ContextObjectSupplier$ContextInjectionListener.update(ContextObjectSupplier.java:76)
14-May-2018 18:55:58         at org.eclipse.e4.core.internal.contexts.TrackableComputationExt.update(TrackableComputationExt.java:107)
14-May-2018 18:55:58         at org.eclipse.e4.core.internal.contexts.TrackableComputationExt.handleInvalid(TrackableComputationExt.java:70)
14-May-2018 18:55:58         at org.eclipse.e4.core.internal.contexts.EclipseContext.dispose(EclipseContext.java:175)
14-May-2018 18:55:58         at org.eclipse.e4.ui.internal.workbench.swt.PartRenderingEngine.clearContext(PartRenderingEngine.java:974)
14-May-2018 18:55:58         at org.eclipse.e4.ui.internal.workbench.swt.PartRenderingEngine.safeRemoveGui(PartRenderingEngine.java:954)
14-May-2018 18:55:58         at org.eclipse.e4.ui.internal.workbench.swt.PartRenderingEngine.access$3(PartRenderingEngine.java:862)
14-May-2018 18:55:58         at org.eclipse.e4.ui.internal.workbench.swt.PartRenderingEngine$8.run(PartRenderingEngine.java:857)
14-May-2018 18:55:58         at org.eclipse.core.runtime.SafeRunner.run(SafeRunner.java:42)
14-May-2018 18:55:58         at org.eclipse.e4.ui.internal.workbench.swt.PartRenderingEngine.removeGui(PartRenderingEngine.java:841)
14-May-2018 18:55:58         at org.eclipse.e4.ui.internal.workbench.swt.PartRenderingEngine.stop(PartRenderingEngine.java:1220)
14-May-2018 18:55:58         at org.eclipse.e4.ui.internal.workbench.E4Workbench.close(E4Workbench.java:184)
14-May-2018 18:55:58         at org.eclipse.e4.ui.internal.workbench.swt.E4Testable$2.run(E4Testable.java:130)
14-May-2018 18:55:58         at org.eclipse.swt.widgets.RunnableLock.run(RunnableLock.java:35)
14-May-2018 18:55:58         at org.eclipse.swt.widgets.Synchronizer.runAsyncMessages(Synchronizer.java:136)
14-May-2018 18:55:58         at org.eclipse.swt.widgets.Display.runAsyncMessages(Display.java:3774)
14-May-2018 18:55:58         at org.eclipse.swt.widgets.Display.readAndDispatch(Display.java:3412)
14-May-2018 18:55:58         at org.eclipse.e4.ui.internal.workbench.swt.PartRenderingEngine$9.run(PartRenderingEngine.java:1151)
14-May-2018 18:55:58         at org.eclipse.core.databinding.observable.Realm.runWithDefault(Realm.java:332)
14-May-2018 18:55:58         at org.eclipse.e4.ui.internal.workbench.swt.PartRenderingEngine.run(PartRenderingEngine.java:1032)
14-May-2018 18:55:58         at org.eclipse.e4.ui.internal.workbench.E4Workbench.createAndRunUI(E4Workbench.java:148)
14-May-2018 18:55:58         at org.eclipse.ui.internal.Workbench$5.run(Workbench.java:636)
14-May-2018 18:55:58         at org.eclipse.core.databinding.observable.Realm.runWithDefault(Realm.java:332)
14-May-2018 18:55:58         at org.eclipse.ui.internal.Workbench.createAndRunWorkbench(Workbench.java:579)
14-May-2018 18:55:58         at org.eclipse.ui.PlatformUI.createAndRunWorkbench(PlatformUI.java:150)
14-May-2018 18:55:58         at org.eclipse.ui.internal.ide.application.IDEApplication.start(IDEApplication.java:135)
14-May-2018 18:55:58         at org.eclipse.tycho.surefire.osgibooter.UITestApplication.runApplication(UITestApplication.java:31)
14-May-2018 18:55:58         at org.eclipse.tycho.surefire.osgibooter.AbstractUITestApplication.run(AbstractUITestApplication.java:120)
14-May-2018 18:55:58         at org.eclipse.tycho.surefire.osgibooter.UITestApplication.start(UITestApplication.java:37)
14-May-2018 18:55:58         at org.eclipse.equinox.internal.app.EclipseAppHandle.run(EclipseAppHandle.java:196)
14-May-2018 18:55:58         at org.eclipse.core.runtime.internal.adaptor.EclipseAppLauncher.runApplication(EclipseAppLauncher.java:134)
14-May-2018 18:55:58         at org.eclipse.core.runtime.internal.adaptor.EclipseAppLauncher.start(EclipseAppLauncher.java:104)
14-May-2018 18:55:58         at org.eclipse.core.runtime.adaptor.EclipseStarter.run(EclipseStarter.java:380)
14-May-2018 18:55:58         at org.eclipse.core.runtime.adaptor.EclipseStarter.run(EclipseStarter.java:235)
14-May-2018 18:55:58         at sun.reflect.NativeMethodAccessorImpl.invoke0(Native Method)
14-May-2018 18:55:58         at sun.reflect.NativeMethodAccessorImpl.invoke(NativeMethodAccessorImpl.java:57)
14-May-2018 18:55:58         at sun.reflect.DelegatingMethodAccessorImpl.invoke(DelegatingMethodAccessorImpl.java:43)
14-May-2018 18:55:58         at java.lang.reflect.Method.invoke(Method.java:606)
14-May-2018 18:55:58         at org.eclipse.equinox.launcher.Main.invokeFramework(Main.java:648)
14-May-2018 18:55:58         at org.eclipse.equinox.launcher.Main.basicRun(Main.java:603)
14-May-2018 18:55:58         at org.eclipse.equinox.launcher.Main.run(Main.java:1465)
14-May-2018 18:55:58         at org.eclipse.equinox.launcher.Main.main(Main.java:1438)
14-May-2018 18:55:58 Caused by: org.eclipse.swt.SWTException: Widget is disposed
14-May-2018 18:55:58         at org.eclipse.swt.SWT.error(SWT.java:4441)
14-May-2018 18:55:58         at org.eclipse.swt.SWT.error(SWT.java:4356)
14-May-2018 18:55:58         at org.eclipse.swt.SWT.error(SWT.java:4327)
14-May-2018 18:55:58         at org.eclipse.swt.widgets.Widget.error(Widget.java:476)
14-May-2018 18:55:58         at org.eclipse.swt.widgets.Widget.checkWidget(Widget.java:413)
14-May-2018 18:55:58         at org.eclipse.swt.widgets.Shell.getSize(Shell.java:1111)
14-May-2018 18:55:58         at org.eclipse.ui.internal.quickaccess.SearchField.storeDialog(SearchField.java:580)
14-May-2018 18:55:58         at org.eclipse.ui.internal.quickaccess.SearchField.dispose(SearchField.java:557)
14-May-2018 18:55:58         at sun.reflect.NativeMethodAccessorImpl.invoke0(Native Method)
14-May-2018 18:55:58         at sun.reflect.NativeMethodAccessorImpl.invoke(NativeMethodAccessorImpl.java:57)
14-May-2018 18:55:58         at sun.reflect.DelegatingMethodAccessorImpl.invoke(DelegatingMethodAccessorImpl.java:43)
14-May-2018 18:55:58         at java.lang.reflect.Method.invoke(Method.java:606)
14-May-2018 18:55:58         at org.eclipse.e4.core.internal.di.MethodRequestor.execute(MethodRequestor.java:55)
14-May-2018 18:55:58         ... 45 more
14-May-2018 18:55:58
14-May-2018 18:55:58 !ENTRY org.eclipse.e4.ui.workbench 4 0 2018-05-14 18:55:58.732
14-May-2018 18:55:58 !MESSAGE Exception occurred while unrendering: org.eclipse.e4.ui.model.application.ui.basic.impl.TrimmedWindowImpl@15320ddc (elementId: IDEWindow, tags: [topLevel], contributorURI: platform:/plugin/org.eclipse.ui.workbench) (widget: null, renderer: null, toBeRendered: true, onTop: false, visible: true, containerData: null, accessibilityPhrase: null) (label: %trimmedwindow.label.eclipseSDK, iconURI: null, tooltip: null, context: null, variables: [], x: 0, y: 0, width: 1024, height: 768)
14-May-2018 18:55:58 !STACK 0
14-May-2018 18:55:58 org.eclipse.e4.core.di.InjectionException: org.eclipse.swt.SWTException: Widget is disposed
14-May-2018 18:55:58         at org.eclipse.e4.core.internal.di.MethodRequestor.execute(MethodRequestor.java:62)
14-May-2018 18:55:58         at org.eclipse.e4.core.internal.di.InjectorImpl.processAnnotated(InjectorImpl.java:888)
14-May-2018 18:55:58         at org.eclipse.e4.core.internal.di.InjectorImpl.disposed(InjectorImpl.java:390)
14-May-2018 18:55:58         at org.eclipse.e4.core.internal.di.Requestor.disposed(Requestor.java:143)
14-May-2018 18:55:58         at org.eclipse.e4.core.internal.contexts.ContextObjectSupplier$ContextInjectionListener.update(ContextObjectSupplier.java:76)
14-May-2018 18:55:58         at org.eclipse.e4.core.internal.contexts.TrackableComputationExt.update(TrackableComputationExt.java:107)
14-May-2018 18:55:58         at org.eclipse.e4.core.internal.contexts.TrackableComputationExt.handleInvalid(TrackableComputationExt.java:70)
14-May-2018 18:55:58         at org.eclipse.e4.core.internal.contexts.EclipseContext.dispose(EclipseContext.java:175)
14-May-2018 18:55:58         at org.eclipse.e4.ui.internal.workbench.swt.PartRenderingEngine.clearContext(PartRenderingEngine.java:974)
14-May-2018 18:55:58         at org.eclipse.e4.ui.internal.workbench.swt.PartRenderingEngine.safeRemoveGui(PartRenderingEngine.java:954)
14-May-2018 18:55:58         at org.eclipse.e4.ui.internal.workbench.swt.PartRenderingEngine.access$3(PartRenderingEngine.java:862)
14-May-2018 18:55:58         at org.eclipse.e4.ui.internal.workbench.swt.PartRenderingEngine$8.run(PartRenderingEngine.java:857)
14-May-2018 18:55:58         at org.eclipse.core.runtime.SafeRunner.run(SafeRunner.java:42)
14-May-2018 18:55:58         at org.eclipse.e4.ui.internal.workbench.swt.PartRenderingEngine.removeGui(PartRenderingEngine.java:841)
14-May-2018 18:55:58         at org.eclipse.e4.ui.internal.workbench.swt.PartRenderingEngine.stop(PartRenderingEngine.java:1220)
14-May-2018 18:55:58         at org.eclipse.e4.ui.internal.workbench.E4Workbench.close(E4Workbench.java:184)
14-May-2018 18:55:58         at org.eclipse.e4.ui.internal.workbench.swt.E4Testable$2.run(E4Testable.java:130)
14-May-2018 18:55:58         at org.eclipse.swt.widgets.RunnableLock.run(RunnableLock.java:35)
14-May-2018 18:55:58         at org.eclipse.swt.widgets.Synchronizer.runAsyncMessages(Synchronizer.java:136)
14-May-2018 18:55:58         at org.eclipse.swt.widgets.Display.runAsyncMessages(Display.java:3774)
14-May-2018 18:55:58         at org.eclipse.swt.widgets.Display.readAndDispatch(Display.java:3412)
14-May-2018 18:55:58         at org.eclipse.e4.ui.internal.workbench.swt.PartRenderingEngine$9.run(PartRenderingEngine.java:1151)
14-May-2018 18:55:58         at org.eclipse.core.databinding.observable.Realm.runWithDefault(Realm.java:332)
14-May-2018 18:55:58         at org.eclipse.e4.ui.internal.workbench.swt.PartRenderingEngine.run(PartRenderingEngine.java:1032)
14-May-2018 18:55:58         at org.eclipse.e4.ui.internal.workbench.E4Workbench.createAndRunUI(E4Workbench.java:148)
14-May-2018 18:55:58         at org.eclipse.ui.internal.Workbench$5.run(Workbench.java:636)
14-May-2018 18:55:58         at org.eclipse.core.databinding.observable.Realm.runWithDefault(Realm.java:332)
14-May-2018 18:55:58         at org.eclipse.ui.internal.Workbench.createAndRunWorkbench(Workbench.java:579)
14-May-2018 18:55:58         at org.eclipse.ui.PlatformUI.createAndRunWorkbench(PlatformUI.java:150)
14-May-2018 18:55:58         at org.eclipse.ui.internal.ide.application.IDEApplication.start(IDEApplication.java:135)
14-May-2018 18:55:58         at org.eclipse.tycho.surefire.osgibooter.UITestApplication.runApplication(UITestApplication.java:31)
14-May-2018 18:55:58         at org.eclipse.tycho.surefire.osgibooter.AbstractUITestApplication.run(AbstractUITestApplication.java:120)
14-May-2018 18:55:58         at org.eclipse.tycho.surefire.osgibooter.UITestApplication.start(UITestApplication.java:37)
14-May-2018 18:55:58         at org.eclipse.equinox.internal.app.EclipseAppHandle.run(EclipseAppHandle.java:196)
14-May-2018 18:55:58         at org.eclipse.core.runtime.internal.adaptor.EclipseAppLauncher.runApplication(EclipseAppLauncher.java:134)
14-May-2018 18:55:58         at org.eclipse.core.runtime.internal.adaptor.EclipseAppLauncher.start(EclipseAppLauncher.java:104)
14-May-2018 18:55:58         at org.eclipse.core.runtime.adaptor.EclipseStarter.run(EclipseStarter.java:380)
14-May-2018 18:55:58         at org.eclipse.core.runtime.adaptor.EclipseStarter.run(EclipseStarter.java:235)
14-May-2018 18:55:58         at sun.reflect.NativeMethodAccessorImpl.invoke0(Native Method)
14-May-2018 18:55:58         at sun.reflect.NativeMethodAccessorImpl.invoke(NativeMethodAccessorImpl.java:57)
14-May-2018 18:55:58         at sun.reflect.DelegatingMethodAccessorImpl.invoke(DelegatingMethodAccessorImpl.java:43)
14-May-2018 18:55:58         at java.lang.reflect.Method.invoke(Method.java:606)
14-May-2018 18:55:58         at org.eclipse.equinox.launcher.Main.invokeFramework(Main.java:648)
14-May-2018 18:55:58         at org.eclipse.equinox.launcher.Main.basicRun(Main.java:603)
14-May-2018 18:55:58         at org.eclipse.equinox.launcher.Main.run(Main.java:1465)
14-May-2018 18:55:58         at org.eclipse.equinox.launcher.Main.main(Main.java:1438)
14-May-2018 18:55:58 Caused by: org.eclipse.swt.SWTException: Widget is disposed
14-May-2018 18:55:58         at org.eclipse.swt.SWT.error(SWT.java:4441)
14-May-2018 18:55:58         at org.eclipse.swt.SWT.error(SWT.java:4356)
14-May-2018 18:55:58         at org.eclipse.swt.SWT.error(SWT.java:4327)
14-May-2018 18:55:58         at org.eclipse.swt.widgets.Widget.error(Widget.java:476)
14-May-2018 18:55:58         at org.eclipse.swt.widgets.Widget.checkWidget(Widget.java:413)
14-May-2018 18:55:58         at org.eclipse.swt.widgets.Shell.getSize(Shell.java:1111)
14-May-2018 18:55:58         at org.eclipse.ui.internal.quickaccess.SearchField.storeDialog(SearchField.java:580)
14-May-2018 18:55:58         at org.eclipse.ui.internal.quickaccess.SearchField.dispose(SearchField.java:557)
14-May-2018 18:55:58         at sun.reflect.NativeMethodAccessorImpl.invoke0(Native Method)
14-May-2018 18:55:58         at sun.reflect.NativeMethodAccessorImpl.invoke(NativeMethodAccessorImpl.java:57)
14-May-2018 18:55:58         at sun.reflect.DelegatingMethodAccessorImpl.invoke(DelegatingMethodAccessorImpl.java:43)
14-May-2018 18:55:58         at java.lang.reflect.Method.invoke(Method.java:606)
14-May-2018 18:55:58         at org.eclipse.e4.core.internal.di.MethodRequestor.execute(MethodRequestor.java:55)
14-May-2018 18:55:58         ... 45 more
14-May-2018 18:56:00 [INFO] All tests passed!
14-May-2018 18:56:00 [INFO]
14-May-2018 18:56:00 [INFO] --- maven-install-plugin:2.3.1:install (default-install) @ org.codehaus.groovy.alltests ---
14-May-2018 18:56:00 [INFO] Installing /opt/bamboo-home/xml-data/build-dir/GRECLIPSE-E44TP-JOB1/ide-test/org.codehaus.groovy.alltests/target/org.codehaus.groovy.alltests-2.9.3-SNAPSHOT.jar to /home/bamboo/.m2/repository/org/codehaus/groovy/eclipse/org.codehaus.groovy.alltests/2.9.3-SNAPSHOT/org.codehaus.groovy.alltests-2.9.3-SNAPSHOT.jar
14-May-2018 18:56:00 [INFO] Installing /opt/bamboo-home/xml-data/build-dir/GRECLIPSE-E44TP-JOB1/ide-test/org.codehaus.groovy.alltests/pom.xml to /home/bamboo/.m2/repository/org/codehaus/groovy/eclipse/org.codehaus.groovy.alltests/2.9.3-SNAPSHOT/org.codehaus.groovy.alltests-2.9.3-SNAPSHOT.pom
14-May-2018 18:56:01 [INFO] Installing /opt/bamboo-home/xml-data/build-dir/GRECLIPSE-E44TP-JOB1/ide-test/org.codehaus.groovy.alltests/target/org.codehaus.groovy.alltests-2.9.3-SNAPSHOT-sources.jar to /home/bamboo/.m2/repository/org/codehaus/groovy/eclipse/org.codehaus.groovy.alltests/2.9.3-SNAPSHOT/org.codehaus.groovy.alltests-2.9.3-SNAPSHOT-sources.jar
14-May-2018 18:56:01 [INFO] Installing /opt/bamboo-home/xml-data/build-dir/GRECLIPSE-E44TP-JOB1/ide-test/org.codehaus.groovy.alltests/target/p2content.xml to /home/bamboo/.m2/repository/org/codehaus/groovy/eclipse/org.codehaus.groovy.alltests/2.9.3-SNAPSHOT/org.codehaus.groovy.alltests-2.9.3-SNAPSHOT-p2metadata.xml
14-May-2018 18:56:01 [INFO] Installing /opt/bamboo-home/xml-data/build-dir/GRECLIPSE-E44TP-JOB1/ide-test/org.codehaus.groovy.alltests/target/p2artifacts.xml to /home/bamboo/.m2/repository/org/codehaus/groovy/eclipse/org.codehaus.groovy.alltests/2.9.3-SNAPSHOT/org.codehaus.groovy.alltests-2.9.3-SNAPSHOT-p2artifacts.xml
14-May-2018 18:56:01 [INFO]
14-May-2018 18:56:01 [INFO] --- tycho-p2-plugin:0.24.0:update-local-index (default-update-local-index) @ org.codehaus.groovy.alltests ---
14-May-2018 18:56:01 [INFO]
14-May-2018 18:56:01 [INFO] --- maven-deploy-plugin:2.5:deploy (default-deploy) @ org.codehaus.groovy.alltests ---
14-May-2018 18:56:02 [INFO] Skipping artifact deployment
14-May-2018 18:56:02 [INFO]                                                                         
14-May-2018 18:56:02 [INFO] ------------------------------------------------------------------------
14-May-2018 18:56:02 [INFO] Building org.codehaus.groovy.alltests.feature 2.9.3-SNAPSHOT
14-May-2018 18:56:02 [INFO] ------------------------------------------------------------------------
14-May-2018 18:56:03 [INFO]
14-May-2018 18:56:03 [INFO] --- maven-clean-plugin:2.5:clean (default-clean) @ org.codehaus.groovy.alltests.feature ---
14-May-2018 18:56:03 [INFO] Deleting /opt/bamboo-home/xml-data/build-dir/GRECLIPSE-E44TP-JOB1/ide-test/Feature-org.codehaus.groovy.alltests.feature/target
14-May-2018 18:56:03 [INFO]
14-May-2018 18:56:03 [INFO] --- tycho-packaging-plugin:0.24.0:build-qualifier-aggregator (default-build-qualifier-aggregator) @ org.codehaus.groovy.alltests.feature ---
14-May-2018 18:56:03 [INFO] The project's OSGi version is 2.9.3.xx-201805141725-e44
14-May-2018 18:56:03 [INFO]
14-May-2018 18:56:03 [INFO] --- tycho-packaging-plugin:0.24.0:validate-id (default-validate-id) @ org.codehaus.groovy.alltests.feature ---
14-May-2018 18:56:03 [INFO]
14-May-2018 18:56:03 [INFO] --- tycho-packaging-plugin:0.24.0:validate-version (default-validate-version) @ org.codehaus.groovy.alltests.feature ---
14-May-2018 18:56:03 [INFO]
14-May-2018 18:56:03 [INFO] --- properties-maven-plugin:1.0-alpha-2:read-project-properties (default) @ org.codehaus.groovy.alltests.feature ---
14-May-2018 18:56:03 [INFO]
14-May-2018 18:56:03 [INFO] --- tycho-source-plugin:0.24.0:plugin-source (plugin-source) @ org.codehaus.groovy.alltests.feature ---
14-May-2018 18:56:03 [INFO]
14-May-2018 18:56:03 [INFO] --- target-platform-configuration:0.24.0:target-platform (default-target-platform) @ org.codehaus.groovy.alltests.feature ---
14-May-2018 18:56:13 [INFO]
14-May-2018 18:56:13 [INFO] --- tycho-packaging-plugin:0.24.0:package-feature (default-package-feature) @ org.codehaus.groovy.alltests.feature ---
14-May-2018 18:56:14 [INFO] Building jar: /opt/bamboo-home/xml-data/build-dir/GRECLIPSE-E44TP-JOB1/ide-test/Feature-org.codehaus.groovy.alltests.feature/target/org.codehaus.groovy.alltests.feature-2.9.3-SNAPSHOT.jar
14-May-2018 18:56:14 [INFO]
14-May-2018 18:56:14 [INFO] --- tycho-p2-plugin:0.24.0:p2-metadata-default (default-p2-metadata-default) @ org.codehaus.groovy.alltests.feature ---
14-May-2018 18:56:14 [INFO]
14-May-2018 18:56:14 [INFO] --- tycho-p2-plugin:0.24.0:feature-p2-metadata (default-feature-p2-metadata) @ org.codehaus.groovy.alltests.feature ---
14-May-2018 18:56:14 [INFO]
14-May-2018 18:56:14 [INFO] --- maven-jarsigner-plugin:1.2:sign (sign) @ org.codehaus.groovy.alltests.feature ---
14-May-2018 18:56:15 [INFO] 1 archive(s) processed
14-May-2018 18:56:15 [INFO]
14-May-2018 18:56:15 [INFO] --- tycho-source-feature-plugin:0.24.0:source-feature (source-feature) @ org.codehaus.groovy.alltests.feature ---
14-May-2018 18:56:17 [INFO] Building jar: /opt/bamboo-home/xml-data/build-dir/GRECLIPSE-E44TP-JOB1/ide-test/Feature-org.codehaus.groovy.alltests.feature/target/org.codehaus.groovy.alltests.feature-2.9.3-SNAPSHOT-sources-feature.jar
14-May-2018 18:56:17 [INFO]
14-May-2018 18:56:17 [INFO] --- tycho-p2-plugin:0.24.0:p2-metadata (attach-p2-metadata) @ org.codehaus.groovy.alltests.feature ---
14-May-2018 18:56:17 [INFO]
14-May-2018 18:56:17 [INFO] --- maven-install-plugin:2.3.1:install (default-install) @ org.codehaus.groovy.alltests.feature ---
14-May-2018 18:56:17 [INFO] Installing /opt/bamboo-home/xml-data/build-dir/GRECLIPSE-E44TP-JOB1/ide-test/Feature-org.codehaus.groovy.alltests.feature/target/org.codehaus.groovy.alltests.feature-2.9.3-SNAPSHOT.jar to /home/bamboo/.m2/repository/org/codehaus/groovy/eclipse/org.codehaus.groovy.alltests.feature/2.9.3-SNAPSHOT/org.codehaus.groovy.alltests.feature-2.9.3-SNAPSHOT.jar
14-May-2018 18:56:17 [INFO] Installing /opt/bamboo-home/xml-data/build-dir/GRECLIPSE-E44TP-JOB1/ide-test/Feature-org.codehaus.groovy.alltests.feature/pom.xml to /home/bamboo/.m2/repository/org/codehaus/groovy/eclipse/org.codehaus.groovy.alltests.feature/2.9.3-SNAPSHOT/org.codehaus.groovy.alltests.feature-2.9.3-SNAPSHOT.pom
14-May-2018 18:56:17 [INFO] Installing /opt/bamboo-home/xml-data/build-dir/GRECLIPSE-E44TP-JOB1/ide-test/Feature-org.codehaus.groovy.alltests.feature/target/p2content.xml to /home/bamboo/.m2/repository/org/codehaus/groovy/eclipse/org.codehaus.groovy.alltests.feature/2.9.3-SNAPSHOT/org.codehaus.groovy.alltests.feature-2.9.3-SNAPSHOT-p2metadata.xml
14-May-2018 18:56:17 [INFO] Installing /opt/bamboo-home/xml-data/build-dir/GRECLIPSE-E44TP-JOB1/ide-test/Feature-org.codehaus.groovy.alltests.feature/target/p2artifacts.xml to /home/bamboo/.m2/repository/org/codehaus/groovy/eclipse/org.codehaus.groovy.alltests.feature/2.9.3-SNAPSHOT/org.codehaus.groovy.alltests.feature-2.9.3-SNAPSHOT-p2artifacts.xml
14-May-2018 18:56:17 [INFO] Installing /opt/bamboo-home/xml-data/build-dir/GRECLIPSE-E44TP-JOB1/ide-test/Feature-org.codehaus.groovy.alltests.feature/target/org.codehaus.groovy.alltests.feature-2.9.3-SNAPSHOT-sources-feature.jar to /home/bamboo/.m2/repository/org/codehaus/groovy/eclipse/org.codehaus.groovy.alltests.feature/2.9.3-SNAPSHOT/org.codehaus.groovy.alltests.feature-2.9.3-SNAPSHOT-sources-feature.jar
14-May-2018 18:56:17 [INFO]
14-May-2018 18:56:17 [INFO] --- tycho-p2-plugin:0.24.0:update-local-index (default-update-local-index) @ org.codehaus.groovy.alltests.feature ---
14-May-2018 18:56:17 [INFO]
14-May-2018 18:56:17 [INFO] --- maven-deploy-plugin:2.5:deploy (default-deploy) @ org.codehaus.groovy.alltests.feature ---
14-May-2018 18:56:17 [INFO] Skipping artifact deployment
14-May-2018 18:56:17 [INFO]                                                                         
14-May-2018 18:56:17 [INFO] ------------------------------------------------------------------------
14-May-2018 18:56:17 [INFO] Building org.codehaus.groovy.m2eclipse 2.9.3-SNAPSHOT
14-May-2018 18:56:17 [INFO] ------------------------------------------------------------------------
14-May-2018 18:56:17 [INFO]
14-May-2018 18:56:17 [INFO] --- maven-clean-plugin:2.5:clean (default-clean) @ org.codehaus.groovy.m2eclipse ---
14-May-2018 18:56:17 [INFO]
14-May-2018 18:56:17 [INFO] --- tycho-packaging-plugin:0.24.0:build-qualifier (default-build-qualifier) @ org.codehaus.groovy.m2eclipse ---
14-May-2018 18:56:17 [INFO] The project's OSGi version is 2.9.3.xx-201805141725-e44
14-May-2018 18:56:17 [INFO]
14-May-2018 18:56:17 [INFO] --- tycho-packaging-plugin:0.24.0:validate-id (default-validate-id) @ org.codehaus.groovy.m2eclipse ---
14-May-2018 18:56:17 [INFO]
14-May-2018 18:56:17 [INFO] --- tycho-packaging-plugin:0.24.0:validate-version (default-validate-version) @ org.codehaus.groovy.m2eclipse ---
14-May-2018 18:56:17 [INFO]
14-May-2018 18:56:17 [INFO] --- properties-maven-plugin:1.0-alpha-2:read-project-properties (default) @ org.codehaus.groovy.m2eclipse ---
14-May-2018 18:56:17 [INFO]
14-May-2018 18:56:17 [INFO] --- maven-resources-plugin:2.4.3:resources (default-resources) @ org.codehaus.groovy.m2eclipse ---
14-May-2018 18:56:17 [WARNING] Using platform encoding (UTF-8 actually) to copy filtered resources, i.e. build is platform dependent!
14-May-2018 18:56:17 [INFO] skip non existing resourceDirectory /opt/bamboo-home/xml-data/build-dir/GRECLIPSE-E44TP-JOB1/extras/org.codehaus.groovy.m2eclipse/src/main/resources
14-May-2018 18:56:17 [INFO]
14-May-2018 18:56:17 [INFO] --- tycho-compiler-plugin:0.24.0:compile (default-compile) @ org.codehaus.groovy.m2eclipse ---
14-May-2018 18:56:17 [INFO] Compiling 2 source files to /opt/bamboo-home/xml-data/build-dir/GRECLIPSE-E44TP-JOB1/extras/org.codehaus.groovy.m2eclipse/target/classes
14-May-2018 18:56:19 [INFO]
14-May-2018 18:56:19 [INFO] --- maven-resources-plugin:2.4.3:testResources (default-testResources) @ org.codehaus.groovy.m2eclipse ---
14-May-2018 18:56:19 [WARNING] Using platform encoding (UTF-8 actually) to copy filtered resources, i.e. build is platform dependent!
14-May-2018 18:56:19 [INFO] skip non existing resourceDirectory /opt/bamboo-home/xml-data/build-dir/GRECLIPSE-E44TP-JOB1/extras/org.codehaus.groovy.m2eclipse/src/test/resources
14-May-2018 18:56:19 [INFO]
14-May-2018 18:56:19 [INFO] --- tycho-source-plugin:0.24.0:plugin-source (plugin-source) @ org.codehaus.groovy.m2eclipse ---
14-May-2018 18:56:19 [WARNING] bundle localization file /opt/bamboo-home/xml-data/build-dir/GRECLIPSE-E44TP-JOB1/extras/org.codehaus.groovy.m2eclipse/plugin.properties not found
14-May-2018 18:56:19 [INFO] Building jar: /opt/bamboo-home/xml-data/build-dir/GRECLIPSE-E44TP-JOB1/extras/org.codehaus.groovy.m2eclipse/target/org.codehaus.groovy.m2eclipse-2.9.3-SNAPSHOT-sources.jar
14-May-2018 18:56:20 [INFO]
14-May-2018 18:56:20 [INFO] --- target-platform-configuration:0.24.0:target-platform (default-target-platform) @ org.codehaus.groovy.m2eclipse ---
14-May-2018 18:56:20 [INFO]
14-May-2018 18:56:20 [INFO] --- tycho-packaging-plugin:0.24.0:package-plugin (default-package-plugin) @ org.codehaus.groovy.m2eclipse ---
14-May-2018 18:56:20 [INFO] Building jar: /opt/bamboo-home/xml-data/build-dir/GRECLIPSE-E44TP-JOB1/extras/org.codehaus.groovy.m2eclipse/target/org.codehaus.groovy.m2eclipse-2.9.3-SNAPSHOT.jar
14-May-2018 18:56:20 [INFO]
14-May-2018 18:56:20 [INFO] --- tycho-p2-plugin:0.24.0:p2-metadata-default (default-p2-metadata-default) @ org.codehaus.groovy.m2eclipse ---
14-May-2018 18:56:20 [INFO]
14-May-2018 18:56:20 [INFO] --- maven-jarsigner-plugin:1.2:sign (sign) @ org.codehaus.groovy.m2eclipse ---
14-May-2018 18:56:21 [INFO] 2 archive(s) processed
14-May-2018 18:56:21 [INFO]
14-May-2018 18:56:21 [INFO] --- tycho-source-feature-plugin:0.24.0:source-feature (source-feature) @ org.codehaus.groovy.m2eclipse ---
14-May-2018 18:56:21 [INFO]
14-May-2018 18:56:21 [INFO] --- tycho-p2-plugin:0.24.0:p2-metadata (attach-p2-metadata) @ org.codehaus.groovy.m2eclipse ---
14-May-2018 18:56:21 [INFO]
14-May-2018 18:56:21 [INFO] --- maven-install-plugin:2.3.1:install (default-install) @ org.codehaus.groovy.m2eclipse ---
14-May-2018 18:56:21 [INFO] Installing /opt/bamboo-home/xml-data/build-dir/GRECLIPSE-E44TP-JOB1/extras/org.codehaus.groovy.m2eclipse/target/org.codehaus.groovy.m2eclipse-2.9.3-SNAPSHOT.jar to /home/bamboo/.m2/repository/org/codehaus/groovy/eclipse/org.codehaus.groovy.m2eclipse/2.9.3-SNAPSHOT/org.codehaus.groovy.m2eclipse-2.9.3-SNAPSHOT.jar
14-May-2018 18:56:21 [INFO] Installing /opt/bamboo-home/xml-data/build-dir/GRECLIPSE-E44TP-JOB1/extras/org.codehaus.groovy.m2eclipse/pom.xml to /home/bamboo/.m2/repository/org/codehaus/groovy/eclipse/org.codehaus.groovy.m2eclipse/2.9.3-SNAPSHOT/org.codehaus.groovy.m2eclipse-2.9.3-SNAPSHOT.pom
14-May-2018 18:56:21 [INFO] Installing /opt/bamboo-home/xml-data/build-dir/GRECLIPSE-E44TP-JOB1/extras/org.codehaus.groovy.m2eclipse/target/org.codehaus.groovy.m2eclipse-2.9.3-SNAPSHOT-sources.jar to /home/bamboo/.m2/repository/org/codehaus/groovy/eclipse/org.codehaus.groovy.m2eclipse/2.9.3-SNAPSHOT/org.codehaus.groovy.m2eclipse-2.9.3-SNAPSHOT-sources.jar
14-May-2018 18:56:21 [INFO] Installing /opt/bamboo-home/xml-data/build-dir/GRECLIPSE-E44TP-JOB1/extras/org.codehaus.groovy.m2eclipse/target/p2content.xml to /home/bamboo/.m2/repository/org/codehaus/groovy/eclipse/org.codehaus.groovy.m2eclipse/2.9.3-SNAPSHOT/org.codehaus.groovy.m2eclipse-2.9.3-SNAPSHOT-p2metadata.xml
14-May-2018 18:56:21 [INFO] Installing /opt/bamboo-home/xml-data/build-dir/GRECLIPSE-E44TP-JOB1/extras/org.codehaus.groovy.m2eclipse/target/p2artifacts.xml to /home/bamboo/.m2/repository/org/codehaus/groovy/eclipse/org.codehaus.groovy.m2eclipse/2.9.3-SNAPSHOT/org.codehaus.groovy.m2eclipse-2.9.3-SNAPSHOT-p2artifacts.xml
14-May-2018 18:56:21 [INFO]
14-May-2018 18:56:21 [INFO] --- tycho-p2-plugin:0.24.0:update-local-index (default-update-local-index) @ org.codehaus.groovy.m2eclipse ---
14-May-2018 18:56:21 [INFO]
14-May-2018 18:56:21 [INFO] --- maven-deploy-plugin:2.5:deploy (default-deploy) @ org.codehaus.groovy.m2eclipse ---
14-May-2018 18:56:21 [INFO] Skipping artifact deployment
14-May-2018 18:56:21 [INFO]                                                                         
14-May-2018 18:56:21 [INFO] ------------------------------------------------------------------------
14-May-2018 18:56:21 [INFO] Building org.codehaus.groovy.m2eclipse.feature 2.9.3-SNAPSHOT
14-May-2018 18:56:21 [INFO] ------------------------------------------------------------------------
14-May-2018 18:56:21 [INFO]
14-May-2018 18:56:21 [INFO] --- maven-clean-plugin:2.5:clean (default-clean) @ org.codehaus.groovy.m2eclipse.feature ---
14-May-2018 18:56:21 [INFO] Deleting /opt/bamboo-home/xml-data/build-dir/GRECLIPSE-E44TP-JOB1/extras/Feature-org.codehaus.groovy.m2eclipse/target
14-May-2018 18:56:21 [INFO]
14-May-2018 18:56:21 [INFO] --- tycho-packaging-plugin:0.24.0:build-qualifier-aggregator (default-build-qualifier-aggregator) @ org.codehaus.groovy.m2eclipse.feature ---
14-May-2018 18:56:21 [INFO] The project's OSGi version is 2.9.3.xx-201805141725-e44
14-May-2018 18:56:21 [INFO]
14-May-2018 18:56:21 [INFO] --- tycho-packaging-plugin:0.24.0:validate-id (default-validate-id) @ org.codehaus.groovy.m2eclipse.feature ---
14-May-2018 18:56:21 [INFO]
14-May-2018 18:56:21 [INFO] --- tycho-packaging-plugin:0.24.0:validate-version (default-validate-version) @ org.codehaus.groovy.m2eclipse.feature ---
14-May-2018 18:56:21 [INFO]
14-May-2018 18:56:21 [INFO] --- properties-maven-plugin:1.0-alpha-2:read-project-properties (default) @ org.codehaus.groovy.m2eclipse.feature ---
14-May-2018 18:56:21 [INFO]
14-May-2018 18:56:21 [INFO] --- tycho-source-plugin:0.24.0:plugin-source (plugin-source) @ org.codehaus.groovy.m2eclipse.feature ---
14-May-2018 18:56:21 [INFO]
14-May-2018 18:56:21 [INFO] --- target-platform-configuration:0.24.0:target-platform (default-target-platform) @ org.codehaus.groovy.m2eclipse.feature ---
14-May-2018 18:56:21 [INFO]
14-May-2018 18:56:21 [INFO] --- tycho-packaging-plugin:0.24.0:package-feature (default-package-feature) @ org.codehaus.groovy.m2eclipse.feature ---
14-May-2018 18:56:21 [INFO] Building jar: /opt/bamboo-home/xml-data/build-dir/GRECLIPSE-E44TP-JOB1/extras/Feature-org.codehaus.groovy.m2eclipse/target/org.codehaus.groovy.m2eclipse.feature-2.9.3-SNAPSHOT.jar
14-May-2018 18:56:21 [INFO]
14-May-2018 18:56:21 [INFO] --- tycho-p2-plugin:0.24.0:p2-metadata-default (default-p2-metadata-default) @ org.codehaus.groovy.m2eclipse.feature ---
14-May-2018 18:56:21 [INFO]
14-May-2018 18:56:21 [INFO] --- tycho-p2-plugin:0.24.0:feature-p2-metadata (default-feature-p2-metadata) @ org.codehaus.groovy.m2eclipse.feature ---
14-May-2018 18:56:21 [INFO]
14-May-2018 18:56:21 [INFO] --- maven-jarsigner-plugin:1.2:sign (sign) @ org.codehaus.groovy.m2eclipse.feature ---
14-May-2018 18:56:22 [INFO] 1 archive(s) processed
14-May-2018 18:56:22 [INFO]
14-May-2018 18:56:22 [INFO] --- tycho-source-feature-plugin:0.24.0:source-feature (source-feature) @ org.codehaus.groovy.m2eclipse.feature ---
14-May-2018 18:56:22 [INFO] Building jar: /opt/bamboo-home/xml-data/build-dir/GRECLIPSE-E44TP-JOB1/extras/Feature-org.codehaus.groovy.m2eclipse/target/org.codehaus.groovy.m2eclipse.feature-2.9.3-SNAPSHOT-sources-feature.jar
14-May-2018 18:56:22 [INFO]
14-May-2018 18:56:22 [INFO] --- tycho-p2-plugin:0.24.0:p2-metadata (attach-p2-metadata) @ org.codehaus.groovy.m2eclipse.feature ---
14-May-2018 18:56:22 [INFO]
14-May-2018 18:56:22 [INFO] --- maven-install-plugin:2.3.1:install (default-install) @ org.codehaus.groovy.m2eclipse.feature ---
14-May-2018 18:56:22 [INFO] Installing /opt/bamboo-home/xml-data/build-dir/GRECLIPSE-E44TP-JOB1/extras/Feature-org.codehaus.groovy.m2eclipse/target/org.codehaus.groovy.m2eclipse.feature-2.9.3-SNAPSHOT.jar to /home/bamboo/.m2/repository/org/codehaus/groovy/eclipse/org.codehaus.groovy.m2eclipse.feature/2.9.3-SNAPSHOT/org.codehaus.groovy.m2eclipse.feature-2.9.3-SNAPSHOT.jar
14-May-2018 18:56:22 [INFO] Installing /opt/bamboo-home/xml-data/build-dir/GRECLIPSE-E44TP-JOB1/extras/Feature-org.codehaus.groovy.m2eclipse/pom.xml to /home/bamboo/.m2/repository/org/codehaus/groovy/eclipse/org.codehaus.groovy.m2eclipse.feature/2.9.3-SNAPSHOT/org.codehaus.groovy.m2eclipse.feature-2.9.3-SNAPSHOT.pom
14-May-2018 18:56:22 [INFO] Installing /opt/bamboo-home/xml-data/build-dir/GRECLIPSE-E44TP-JOB1/extras/Feature-org.codehaus.groovy.m2eclipse/target/p2content.xml to /home/bamboo/.m2/repository/org/codehaus/groovy/eclipse/org.codehaus.groovy.m2eclipse.feature/2.9.3-SNAPSHOT/org.codehaus.groovy.m2eclipse.feature-2.9.3-SNAPSHOT-p2metadata.xml
14-May-2018 18:56:22 [INFO] Installing /opt/bamboo-home/xml-data/build-dir/GRECLIPSE-E44TP-JOB1/extras/Feature-org.codehaus.groovy.m2eclipse/target/p2artifacts.xml to /home/bamboo/.m2/repository/org/codehaus/groovy/eclipse/org.codehaus.groovy.m2eclipse.feature/2.9.3-SNAPSHOT/org.codehaus.groovy.m2eclipse.feature-2.9.3-SNAPSHOT-p2artifacts.xml
14-May-2018 18:56:22 [INFO] Installing /opt/bamboo-home/xml-data/build-dir/GRECLIPSE-E44TP-JOB1/extras/Feature-org.codehaus.groovy.m2eclipse/target/org.codehaus.groovy.m2eclipse.feature-2.9.3-SNAPSHOT-sources-feature.jar to /home/bamboo/.m2/repository/org/codehaus/groovy/eclipse/org.codehaus.groovy.m2eclipse.feature/2.9.3-SNAPSHOT/org.codehaus.groovy.m2eclipse.feature-2.9.3-SNAPSHOT-sources-feature.jar
14-May-2018 18:56:22 [INFO]
14-May-2018 18:56:22 [INFO] --- tycho-p2-plugin:0.24.0:update-local-index (default-update-local-index) @ org.codehaus.groovy.m2eclipse.feature ---
14-May-2018 18:56:22 [INFO]
14-May-2018 18:56:22 [INFO] --- maven-deploy-plugin:2.5:deploy (default-deploy) @ org.codehaus.groovy.m2eclipse.feature ---
14-May-2018 18:56:22 [INFO] Skipping artifact deployment
14-May-2018 18:56:22 [INFO]                                                                         
14-May-2018 18:56:22 [INFO] ------------------------------------------------------------------------
14-May-2018 18:56:22 [INFO] Building org.codehaus.groovy.eclipse.site 2.9.3-SNAPSHOT
14-May-2018 18:56:22 [INFO] ------------------------------------------------------------------------
14-May-2018 18:56:23 [INFO]
14-May-2018 18:56:23 [INFO] --- maven-clean-plugin:2.5:clean (default-clean) @ org.codehaus.groovy.eclipse.site ---
14-May-2018 18:56:23 [INFO]
14-May-2018 18:56:23 [INFO] --- tycho-packaging-plugin:0.24.0:build-qualifier (default-build-qualifier) @ org.codehaus.groovy.eclipse.site ---
14-May-2018 18:56:23 [INFO] The project's OSGi version is 2.9.3.xx-201805141725-e44
14-May-2018 18:56:23 [INFO]
14-May-2018 18:56:23 [INFO] --- properties-maven-plugin:1.0-alpha-2:read-project-properties (default) @ org.codehaus.groovy.eclipse.site ---
14-May-2018 18:56:23 [INFO]
14-May-2018 18:56:23 [INFO] --- tycho-source-plugin:0.24.0:plugin-source (plugin-source) @ org.codehaus.groovy.eclipse.site ---
14-May-2018 18:56:23 [INFO]
14-May-2018 18:56:23 [INFO] --- tycho-packaging-plugin:0.24.0:update-site (default-update-site) @ org.codehaus.groovy.eclipse.site ---
14-May-2018 18:56:25 [INFO]
14-May-2018 18:56:25 [INFO] --- tycho-p2-plugin:0.24.0:update-site-p2-metadata (default-update-site-p2-metadata) @ org.codehaus.groovy.eclipse.site ---
14-May-2018 18:56:26 [INFO] Command line:
14-May-2018 18:56:26         [/opt/jdk1.7.0_80/jre/bin/java, -jar, /opt/users/bamboo/.m2/repository/org/eclipse/tycho/tycho-bundles-external/0.24.0/eclipse/plugins/org.eclipse.equinox.launcher_1.3.100.v20150511-1540.jar, -configuration, /tmp/GRECLIPSE-E44TP-JOB1/tycho-p2-runtime4141100851218519541.tmp/configuration, -nosplash, -application, org.eclipse.equinox.p2.publisher.UpdateSitePublisher, -source, /opt/bamboo-home/xml-data/build-dir/GRECLIPSE-E44TP-JOB1/Site-org.codehaus.groovy.eclipse/target/site, -metadataRepository, file:/opt/bamboo-home/xml-data/build-dir/GRECLIPSE-E44TP-JOB1/Site-org.codehaus.groovy.eclipse/target/site/, -metadataRepositoryName, org.codehaus.groovy.eclipse.site, -artifactRepository, file:/opt/bamboo-home/xml-data/build-dir/GRECLIPSE-E44TP-JOB1/Site-org.codehaus.groovy.eclipse/target/site/, -artifactRepositoryName, org.codehaus.groovy.eclipse.site Artifacts, -noDefaultIUs, -compress]
14-May-2018 18:56:28 Generating metadata for ..
14-May-2018 18:56:28 Generation completed with success [0 seconds].
14-May-2018 18:56:29 [INFO]
14-May-2018 18:56:29 [INFO] --- tycho-packaging-plugin:0.24.0:update-site-packaging (default-update-site-packaging) @ org.codehaus.groovy.eclipse.site ---
14-May-2018 18:56:29 [INFO] Building zip: /opt/bamboo-home/xml-data/build-dir/GRECLIPSE-E44TP-JOB1/Site-org.codehaus.groovy.eclipse/target/site.zip
14-May-2018 18:56:29 [INFO]
14-May-2018 18:56:29 [INFO] --- maven-jarsigner-plugin:1.2:sign (sign) @ org.codehaus.groovy.eclipse.site ---
14-May-2018 18:56:29 [INFO] 1 archive(s) processed
14-May-2018 18:56:29 [INFO]
14-May-2018 18:56:29 [INFO] --- tycho-source-feature-plugin:0.24.0:source-feature (source-feature) @ org.codehaus.groovy.eclipse.site ---
14-May-2018 18:56:29 [INFO]
14-May-2018 18:56:29 [INFO] --- tycho-p2-plugin:0.24.0:p2-metadata (attach-p2-metadata) @ org.codehaus.groovy.eclipse.site ---
14-May-2018 18:56:29 [INFO]
14-May-2018 18:56:29 [INFO] --- maven-install-plugin:2.3.1:install (default-install) @ org.codehaus.groovy.eclipse.site ---
14-May-2018 18:56:29 [INFO] Installing /opt/bamboo-home/xml-data/build-dir/GRECLIPSE-E44TP-JOB1/Site-org.codehaus.groovy.eclipse/target/site.zip to /home/bamboo/.m2/repository/org/codehaus/groovy/eclipse/org.codehaus.groovy.eclipse.site/2.9.3-SNAPSHOT/org.codehaus.groovy.eclipse.site-2.9.3-SNAPSHOT.zip
14-May-2018 18:56:29 [INFO] Installing /opt/bamboo-home/xml-data/build-dir/GRECLIPSE-E44TP-JOB1/Site-org.codehaus.groovy.eclipse/pom.xml to /home/bamboo/.m2/repository/org/codehaus/groovy/eclipse/org.codehaus.groovy.eclipse.site/2.9.3-SNAPSHOT/org.codehaus.groovy.eclipse.site-2.9.3-SNAPSHOT.pom
14-May-2018 18:56:29 [INFO]
14-May-2018 18:56:29 [INFO] --- maven-deploy-plugin:2.5:deploy (default-deploy) @ org.codehaus.groovy.eclipse.site ---
14-May-2018 18:56:29 [INFO] Skipping artifact deployment
14-May-2018 18:56:29 [INFO]
14-May-2018 18:56:29 [INFO] --- maven-antrun-plugin:1.6:run (upload-dist) @ org.codehaus.groovy.eclipse.site ---
14-May-2018 18:56:31 [INFO] Executing tasks
14-May-2018 18:56:31
14-May-2018 18:56:31 main:
14-May-2018 18:56:31      [echo] Uploading main update site to s3..."
14-May-2018 18:56:32      [echo] ==== dist props are set so we can deploy? ===
14-May-2018 18:56:32      [echo] bamboo.s3.properties=${bamboo.s3.properties}
14-May-2018 18:56:32      [echo] dist_properties=/home/bamboo/tools/s3.properties
14-May-2018 18:56:32      [echo] env.bamboo_s3_properties_rel=/home/bamboo/tools/s3.properties
14-May-2018 18:56:32      [echo] dist.accessKey=AKIAJKUKWKYLMXOFIFDA
14-May-2018 18:56:32      [echo] accessKey=AKIAIBYM5QE7XBKC6JJQ
14-May-2018 18:56:32      [echo] site.target.dir=/opt/bamboo-home/xml-data/build-dir/GRECLIPSE-E44TP-JOB1/Site-org.codehaus.groovy.eclipse/target
14-May-2018 18:56:32      [echo] unqualifiedVersion=2.9.3
14-May-2018 18:56:32      [echo] buildQualifier=xx-201805141725-e44
14-May-2018 18:56:32      [echo] dist.full.version=2.9.3.xx-201805141725-e44
14-May-2018 18:56:32      [echo] dist.file.name=org.codehaus.groovy-2.9.3.xx-201805141725-e44-updatesite.zip
14-May-2018 18:56:32       [zip] Building zip: /opt/bamboo-home/xml-data/build-dir/GRECLIPSE-E44TP-JOB1/Site-org.codehaus.groovy.eclipse/target/site/org.codehaus.groovy-2.9.3.xx-201805141725-e44-updatesite.zip
14-May-2018 18:56:39      [echo] Preparing for upload... This will happen:
14-May-2018 18:56:39      [echo] Will Delete:
14-May-2018 18:56:39      [echo] dist.bucket=dist.springsource.org
14-May-2018 18:56:39      [echo] dist.path=snapshot/GRECLIPSE/e4.4
14-May-2018 18:56:39      [echo] Will Upload:
14-May-2018 18:56:39      [echo] dist.bucket=dist.springsource.org
14-May-2018 18:56:39      [echo] toDir=snapshot/GRECLIPSE/e4.4
14-May-2018 18:56:39      [echo] fromDir=/opt/bamboo-home/xml-data/build-dir/GRECLIPSE-E44TP-JOB1/Site-org.codehaus.groovy.eclipse/target/site
14-May-2018 18:56:39      [echo] Will Upload:
14-May-2018 18:56:39      [echo] dist.bucket=dist.springsource.org
14-May-2018 18:56:39      [echo] toFile=snapshot/GRECLIPSE/e4.4/org.codehaus.groovy-2.9.3.xx-201805141725-e44-updatesite.zip
14-May-2018 18:56:39      [echo] fromFile=snapshot/GRECLIPSE/e4.4/org.codehaus.groovy-2.9.3.xx-201805141725-e44-updatesite.zip
14-May-2018 18:56:39      [echo] metadata project.name=Groovy Eclipse
14-May-2018 18:56:39      [echo] metadata release.type=snapshot
14-May-2018 18:56:39      [echo] metadata bundle.version=2.9.3.xx-201805141725-e44
14-May-2018 18:56:39      [echo] metadata package.file.name=org.codehaus.groovy-2.9.3.xx-201805141725-e44-updatesite.zip
14-May-2018 18:56:42 Deleted s3://dist.springsource.org/snapshot/GRECLIPSE/e4.4/artifacts.jar
14-May-2018 18:56:42 Deleted s3://dist.springsource.org/snapshot/GRECLIPSE/e4.4/content.jar
14-May-2018 18:56:42 Deleted s3://dist.springsource.org/snapshot/GRECLIPSE/e4.4/features/
14-May-2018 18:56:43 Deleted s3://dist.springsource.org/snapshot/GRECLIPSE/e4.4/features/org.codehaus.groovy.compilerless.feature_2.9.3.xx-201803080255-e44.jar
14-May-2018 18:56:43 Deleted s3://dist.springsource.org/snapshot/GRECLIPSE/e4.4/features/org.codehaus.groovy.eclipse.feature_2.9.3.xx-201803080255-e44.jar
14-May-2018 18:56:43 Deleted s3://dist.springsource.org/snapshot/GRECLIPSE/e4.4/features/org.codehaus.groovy.headless.feature_2.9.3.xx-201803080255-e44.jar
14-May-2018 18:56:43 Deleted s3://dist.springsource.org/snapshot/GRECLIPSE/e4.4/features/org.codehaus.groovy.jdt.patch_2.9.3.xx-201803080255-e44.jar
14-May-2018 18:56:43 Deleted s3://dist.springsource.org/snapshot/GRECLIPSE/e4.4/features/org.codehaus.groovy.m2eclipse.feature_2.9.3.xx-201803080255-e44.jar
14-May-2018 18:56:43 Deleted s3://dist.springsource.org/snapshot/GRECLIPSE/e4.4/features/org.codehaus.groovy18.feature_2.9.3.xx-201803080255-e44.jar
14-May-2018 18:56:43 Deleted s3://dist.springsource.org/snapshot/GRECLIPSE/e4.4/features/org.codehaus.groovy20.feature_2.9.3.xx-201803080255-e44.jar
14-May-2018 18:56:43 Deleted s3://dist.springsource.org/snapshot/GRECLIPSE/e4.4/features/org.codehaus.groovy21.feature_2.9.3.xx-201803080255-e44.jar
14-May-2018 18:56:44 Deleted s3://dist.springsource.org/snapshot/GRECLIPSE/e4.4/features/org.codehaus.groovy22.feature_2.9.3.xx-201803080255-e44.jar
14-May-2018 18:56:44 Deleted s3://dist.springsource.org/snapshot/GRECLIPSE/e4.4/features/org.codehaus.groovy23.feature_2.9.3.xx-201803080255-e44.jar
14-May-2018 18:56:44 Deleted s3://dist.springsource.org/snapshot/GRECLIPSE/e4.4/features/org.codehaus.groovy24.feature_2.9.3.xx-201803080255-e44.jar
14-May-2018 18:56:44 Deleted s3://dist.springsource.org/snapshot/GRECLIPSE/e4.4/features/org.codehaus.groovy25.feature_2.9.3.xx-201803080255-e44.jar
14-May-2018 18:56:44 Deleted s3://dist.springsource.org/snapshot/GRECLIPSE/e4.4/plugins/
14-May-2018 18:56:44 Deleted s3://dist.springsource.org/snapshot/GRECLIPSE/e4.4/plugins/org.codehaus.groovy.eclipse.ant_2.9.3.xx-201803080255-e44.jar
14-May-2018 18:56:44 Deleted s3://dist.springsource.org/snapshot/GRECLIPSE/e4.4/plugins/org.codehaus.groovy.eclipse.astviews_2.9.3.xx-201803080255-e44.jar
14-May-2018 18:56:44 Deleted s3://dist.springsource.org/snapshot/GRECLIPSE/e4.4/plugins/org.codehaus.groovy.eclipse.codeassist.completion_2.9.3.xx-201803080255-e44.jar
14-May-2018 18:56:45 Deleted s3://dist.springsource.org/snapshot/GRECLIPSE/e4.4/plugins/org.codehaus.groovy.eclipse.codebrowsing_2.9.3.xx-201803080255-e44.jar
14-May-2018 18:56:45 Deleted s3://dist.springsource.org/snapshot/GRECLIPSE/e4.4/plugins/org.codehaus.groovy.eclipse.compilerResolver_2.9.3.xx-201803080255-e44.jar
14-May-2018 18:56:45 Deleted s3://dist.springsource.org/snapshot/GRECLIPSE/e4.4/plugins/org.codehaus.groovy.eclipse.core_2.9.3.xx-201803080255-e44.jar
14-May-2018 18:56:46 Deleted s3://dist.springsource.org/snapshot/GRECLIPSE/e4.4/plugins/org.codehaus.groovy.eclipse.dsl_2.9.3.xx-201803080255-e44.jar
14-May-2018 18:56:46 Deleted s3://dist.springsource.org/snapshot/GRECLIPSE/e4.4/plugins/org.codehaus.groovy.eclipse.quickfix_2.9.3.xx-201803080255-e44.jar
14-May-2018 18:56:46 Deleted s3://dist.springsource.org/snapshot/GRECLIPSE/e4.4/plugins/org.codehaus.groovy.eclipse.refactoring_2.9.3.xx-201803080255-e44.jar
14-May-2018 18:56:47 Deleted s3://dist.springsource.org/snapshot/GRECLIPSE/e4.4/plugins/org.codehaus.groovy.eclipse.ui_2.9.3.xx-201803080255-e44.jar
14-May-2018 18:56:47 Deleted s3://dist.springsource.org/snapshot/GRECLIPSE/e4.4/plugins/org.codehaus.groovy.eclipse_2.9.3.xx-201803080255-e44.jar
14-May-2018 18:56:47 Deleted s3://dist.springsource.org/snapshot/GRECLIPSE/e4.4/plugins/org.codehaus.groovy.m2eclipse_2.9.3.xx-201803080255-e44.jar
14-May-2018 18:56:47 Deleted s3://dist.springsource.org/snapshot/GRECLIPSE/e4.4/plugins/org.codehaus.groovy_1.8.9.xx-201803080255-e44.jar
14-May-2018 18:56:47 Deleted s3://dist.springsource.org/snapshot/GRECLIPSE/e4.4/plugins/org.codehaus.groovy_2.0.8.xx-201803080255-e44.jar
14-May-2018 18:56:47 Deleted s3://dist.springsource.org/snapshot/GRECLIPSE/e4.4/plugins/org.codehaus.groovy_2.1.9.xx-201803080255-e44.jar
14-May-2018 18:56:47 Deleted s3://dist.springsource.org/snapshot/GRECLIPSE/e4.4/plugins/org.codehaus.groovy_2.2.2.xx-201803080255-e44.jar
14-May-2018 18:56:47 Deleted s3://dist.springsource.org/snapshot/GRECLIPSE/e4.4/plugins/org.codehaus.groovy_2.3.11.xx-201803080255-e44.jar
14-May-2018 18:56:47 Deleted s3://dist.springsource.org/snapshot/GRECLIPSE/e4.4/plugins/org.codehaus.groovy_2.4.13.xx-201803080255-e44.jar
14-May-2018 18:56:48 Deleted s3://dist.springsource.org/snapshot/GRECLIPSE/e4.4/plugins/org.codehaus.groovy_2.5.0.xx-201803080255-e44.jar
14-May-2018 18:56:48 Deleted s3://dist.springsource.org/snapshot/GRECLIPSE/e4.4/plugins/org.eclipse.jdt.core_3.10.2.xx-201803080255-e44.jar
14-May-2018 18:56:48 Deleted s3://dist.springsource.org/snapshot/GRECLIPSE/e4.4/plugins/org.eclipse.jdt.groovy.core_2.9.3.xx-201803080255-e44.jar
14-May-2018 18:56:48 Deleted s3://dist.springsource.org/snapshot/GRECLIPSE/e4.4/site.xml
14-May-2018 18:56:48 Uploading /opt/bamboo-home/xml-data/build-dir/GRECLIPSE-E44TP-JOB1/Site-org.codehaus.groovy.eclipse/target/site/artifacts.jar (1.9 KB) to s3://dist.springsource.org/snapshot/GRECLIPSE/e4.4/artifacts.jar
14-May-2018 18:56:48 Transfer Time: .2 s - Transfer Rate: 11.0 KB/s
14-May-2018 18:56:49 Uploading /opt/bamboo-home/xml-data/build-dir/GRECLIPSE-E44TP-JOB1/Site-org.codehaus.groovy.eclipse/target/site/content.jar (16.5 KB) to s3://dist.springsource.org/snapshot/GRECLIPSE/e4.4/content.jar
14-May-2018 18:56:49 Transfer Time: .4 s - Transfer Rate: 43.1 KB/s
14-May-2018 18:56:49 Uploading /opt/bamboo-home/xml-data/build-dir/GRECLIPSE-E44TP-JOB1/Site-org.codehaus.groovy.eclipse/target/site/features/org.codehaus.groovy.compilerless.feature_2.9.3.xx-201805141725-e44.jar (15.5 KB) to s3://dist.springsource.org/snapshot/GRECLIPSE/e4.4/features/org.codehaus.groovy.compilerless.feature_2.9.3.xx-201805141725-e44.jar
14-May-2018 18:56:50 Transfer Time: .3 s - Transfer Rate: 61.5 KB/s
14-May-2018 18:56:50 Uploading /opt/bamboo-home/xml-data/build-dir/GRECLIPSE-E44TP-JOB1/Site-org.codehaus.groovy.eclipse/target/site/features/org.codehaus.groovy.eclipse.feature_2.9.3.xx-201805141725-e44.jar (15.0 KB) to s3://dist.springsource.org/snapshot/GRECLIPSE/e4.4/features/org.codehaus.groovy.eclipse.feature_2.9.3.xx-201805141725-e44.jar
14-May-2018 18:56:50 Transfer Time: .2 s - Transfer Rate: 77.1 KB/s
14-May-2018 18:56:51 Uploading /opt/bamboo-home/xml-data/build-dir/GRECLIPSE-E44TP-JOB1/Site-org.codehaus.groovy.eclipse/target/site/features/org.codehaus.groovy.headless.feature_2.9.3.xx-201805141725-e44.jar (15.3 KB) to s3://dist.springsource.org/snapshot/GRECLIPSE/e4.4/features/org.codehaus.groovy.headless.feature_2.9.3.xx-201805141725-e44.jar
14-May-2018 18:56:51 Transfer Time: .2 s - Transfer Rate: 78.3 KB/s
14-May-2018 18:56:51 Uploading /opt/bamboo-home/xml-data/build-dir/GRECLIPSE-E44TP-JOB1/Site-org.codehaus.groovy.eclipse/target/site/features/org.codehaus.groovy.jdt.patch_2.9.3.xx-201805141725-e44.jar (9.4 KB) to s3://dist.springsource.org/snapshot/GRECLIPSE/e4.4/features/org.codehaus.groovy.jdt.patch_2.9.3.xx-201805141725-e44.jar
14-May-2018 18:56:51 Transfer Time: .2 s - Transfer Rate: 55.2 KB/s
14-May-2018 18:56:52 Uploading /opt/bamboo-home/xml-data/build-dir/GRECLIPSE-E44TP-JOB1/Site-org.codehaus.groovy.eclipse/target/site/features/org.codehaus.groovy.m2eclipse.feature_2.9.3.xx-201805141725-e44.jar (15.0 KB) to s3://dist.springsource.org/snapshot/GRECLIPSE/e4.4/features/org.codehaus.groovy.m2eclipse.feature_2.9.3.xx-201805141725-e44.jar
14-May-2018 18:56:52 Transfer Time: .2 s - Transfer Rate: 81.3 KB/s
14-May-2018 18:56:52 Uploading /opt/bamboo-home/xml-data/build-dir/GRECLIPSE-E44TP-JOB1/Site-org.codehaus.groovy.eclipse/target/site/features/org.codehaus.groovy18.feature_2.9.3.xx-201805141725-e44.jar (15.1 KB) to s3://dist.springsource.org/snapshot/GRECLIPSE/e4.4/features/org.codehaus.groovy18.feature_2.9.3.xx-201805141725-e44.jar
14-May-2018 18:56:53 Transfer Time: .2 s - Transfer Rate: 74.0 KB/s
14-May-2018 18:56:53 Uploading /opt/bamboo-home/xml-data/build-dir/GRECLIPSE-E44TP-JOB1/Site-org.codehaus.groovy.eclipse/target/site/features/org.codehaus.groovy20.feature_2.9.3.xx-201805141725-e44.jar (15.1 KB) to s3://dist.springsource.org/snapshot/GRECLIPSE/e4.4/features/org.codehaus.groovy20.feature_2.9.3.xx-201805141725-e44.jar
14-May-2018 18:56:53 Transfer Time: .2 s - Transfer Rate: 90.4 KB/s
14-May-2018 18:56:54 Uploading /opt/bamboo-home/xml-data/build-dir/GRECLIPSE-E44TP-JOB1/Site-org.codehaus.groovy.eclipse/target/site/features/org.codehaus.groovy21.feature_2.9.3.xx-201805141725-e44.jar (15.1 KB) to s3://dist.springsource.org/snapshot/GRECLIPSE/e4.4/features/org.codehaus.groovy21.feature_2.9.3.xx-201805141725-e44.jar
14-May-2018 18:56:54 Transfer Time: .5 s - Transfer Rate: 29.4 KB/s
14-May-2018 18:56:54 Uploading /opt/bamboo-home/xml-data/build-dir/GRECLIPSE-E44TP-JOB1/Site-org.codehaus.groovy.eclipse/target/site/features/org.codehaus.groovy22.feature_2.9.3.xx-201805141725-e44.jar (15.1 KB) to s3://dist.springsource.org/snapshot/GRECLIPSE/e4.4/features/org.codehaus.groovy22.feature_2.9.3.xx-201805141725-e44.jar
14-May-2018 18:56:55 Transfer Time: .2 s - Transfer Rate: 87.3 KB/s
14-May-2018 18:56:55 Uploading /opt/bamboo-home/xml-data/build-dir/GRECLIPSE-E44TP-JOB1/Site-org.codehaus.groovy.eclipse/target/site/features/org.codehaus.groovy23.feature_2.9.3.xx-201805141725-e44.jar (15.1 KB) to s3://dist.springsource.org/snapshot/GRECLIPSE/e4.4/features/org.codehaus.groovy23.feature_2.9.3.xx-201805141725-e44.jar
14-May-2018 18:56:55 Transfer Time: .2 s - Transfer Rate: 81.6 KB/s
14-May-2018 18:56:56 Uploading /opt/bamboo-home/xml-data/build-dir/GRECLIPSE-E44TP-JOB1/Site-org.codehaus.groovy.eclipse/target/site/features/org.codehaus.groovy24.feature_2.9.3.xx-201805141725-e44.jar (14.9 KB) to s3://dist.springsource.org/snapshot/GRECLIPSE/e4.4/features/org.codehaus.groovy24.feature_2.9.3.xx-201805141725-e44.jar
14-May-2018 18:56:56 Transfer Time: .2 s - Transfer Rate: 60.9 KB/s
14-May-2018 18:56:56 Uploading /opt/bamboo-home/xml-data/build-dir/GRECLIPSE-E44TP-JOB1/Site-org.codehaus.groovy.eclipse/target/site/features/org.codehaus.groovy25.feature_2.9.3.xx-201805141725-e44.jar (14.9 KB) to s3://dist.springsource.org/snapshot/GRECLIPSE/e4.4/features/org.codehaus.groovy25.feature_2.9.3.xx-201805141725-e44.jar
14-May-2018 18:56:57 Transfer Time: .2 s - Transfer Rate: 78.6 KB/s
14-May-2018 18:56:57 Uploading /opt/bamboo-home/xml-data/build-dir/GRECLIPSE-E44TP-JOB1/Site-org.codehaus.groovy.eclipse/target/site/org.codehaus.groovy-2.9.3.xx-201805141725-e44-updatesite.zip.md5 (.0 KB) to s3://dist.springsource.org/snapshot/GRECLIPSE/e4.4/org.codehaus.groovy-2.9.3.xx-201805141725-e44-updatesite.zip.md5
14-May-2018 18:56:57 Transfer Time: .2 s - Transfer Rate: .2 KB/s
14-May-2018 18:56:57 Uploading /opt/bamboo-home/xml-data/build-dir/GRECLIPSE-E44TP-JOB1/Site-org.codehaus.groovy.eclipse/target/site/org.codehaus.groovy-2.9.3.xx-201805141725-e44-updatesite.zip.sha1 (.0 KB) to s3://dist.springsource.org/snapshot/GRECLIPSE/e4.4/org.codehaus.groovy-2.9.3.xx-201805141725-e44-updatesite.zip.sha1
14-May-2018 18:56:57 Transfer Time: .2 s - Transfer Rate: .3 KB/s
14-May-2018 18:56:58 Uploading /opt/bamboo-home/xml-data/build-dir/GRECLIPSE-E44TP-JOB1/Site-org.codehaus.groovy.eclipse/target/site/plugins/org.codehaus.groovy.eclipse.ant_2.9.3.xx-201805141725-e44.jar (11.1 KB) to s3://dist.springsource.org/snapshot/GRECLIPSE/e4.4/plugins/org.codehaus.groovy.eclipse.ant_2.9.3.xx-201805141725-e44.jar
14-May-2018 18:56:58 Transfer Time: .2 s - Transfer Rate: 67.4 KB/s
14-May-2018 18:56:58 Uploading /opt/bamboo-home/xml-data/build-dir/GRECLIPSE-E44TP-JOB1/Site-org.codehaus.groovy.eclipse/target/site/plugins/org.codehaus.groovy.eclipse.astviews_2.9.3.xx-201805141725-e44.jar (68.9 KB) to s3://dist.springsource.org/snapshot/GRECLIPSE/e4.4/plugins/org.codehaus.groovy.eclipse.astviews_2.9.3.xx-201805141725-e44.jar
14-May-2018 18:56:59 Transfer Time: .7 s - Transfer Rate: 94.2 KB/s
14-May-2018 18:57:00 Uploading /opt/bamboo-home/xml-data/build-dir/GRECLIPSE-E44TP-JOB1/Site-org.codehaus.groovy.eclipse/target/site/plugins/org.codehaus.groovy.eclipse.codeassist.completion_2.9.3.xx-201805141725-e44.jar (234.4 KB) to s3://dist.springsource.org/snapshot/GRECLIPSE/e4.4/plugins/org.codehaus.groovy.eclipse.codeassist.completion_2.9.3.xx-201805141725-e44.jar
14-May-2018 18:57:00 Transfer Time: .4 s - Transfer Rate: 556.7 KB/s
14-May-2018 18:57:00 Uploading /opt/bamboo-home/xml-data/build-dir/GRECLIPSE-E44TP-JOB1/Site-org.codehaus.groovy.eclipse/target/site/plugins/org.codehaus.groovy.eclipse.codebrowsing_2.9.3.xx-201805141725-e44.jar (82.1 KB) to s3://dist.springsource.org/snapshot/GRECLIPSE/e4.4/plugins/org.codehaus.groovy.eclipse.codebrowsing_2.9.3.xx-201805141725-e44.jar
14-May-2018 18:57:01 Transfer Time: .2 s - Transfer Rate: 382.0 KB/s
14-May-2018 18:57:01 Uploading /opt/bamboo-home/xml-data/build-dir/GRECLIPSE-E44TP-JOB1/Site-org.codehaus.groovy.eclipse/target/site/plugins/org.codehaus.groovy.eclipse.compilerResolver_2.9.3.xx-201805141725-e44.jar (17.9 KB) to s3://dist.springsource.org/snapshot/GRECLIPSE/e4.4/plugins/org.codehaus.groovy.eclipse.compilerResolver_2.9.3.xx-201805141725-e44.jar
14-May-2018 18:57:01 Transfer Time: .2 s - Transfer Rate: 95.6 KB/s
14-May-2018 18:57:02 Uploading /opt/bamboo-home/xml-data/build-dir/GRECLIPSE-E44TP-JOB1/Site-org.codehaus.groovy.eclipse/target/site/plugins/org.codehaus.groovy.eclipse.core_2.9.3.xx-201805141725-e44.jar (92.3 KB) to s3://dist.springsource.org/snapshot/GRECLIPSE/e4.4/plugins/org.codehaus.groovy.eclipse.core_2.9.3.xx-201805141725-e44.jar
14-May-2018 18:57:02 Transfer Time: .2 s - Transfer Rate: 533.4 KB/s
14-May-2018 18:57:02 Uploading /opt/bamboo-home/xml-data/build-dir/GRECLIPSE-E44TP-JOB1/Site-org.codehaus.groovy.eclipse/target/site/plugins/org.codehaus.groovy.eclipse.dsl_2.9.3.xx-201805141725-e44.jar (373.4 KB) to s3://dist.springsource.org/snapshot/GRECLIPSE/e4.4/plugins/org.codehaus.groovy.eclipse.dsl_2.9.3.xx-201805141725-e44.jar
14-May-2018 18:57:03 Transfer Time: .6 s - Transfer Rate: 657.3 KB/s
14-May-2018 18:57:03 Uploading /opt/bamboo-home/xml-data/build-dir/GRECLIPSE-E44TP-JOB1/Site-org.codehaus.groovy.eclipse/target/site/plugins/org.codehaus.groovy.eclipse.quickfix_2.9.3.xx-201805141725-e44.jar (99.7 KB) to s3://dist.springsource.org/snapshot/GRECLIPSE/e4.4/plugins/org.codehaus.groovy.eclipse.quickfix_2.9.3.xx-201805141725-e44.jar
14-May-2018 18:57:03 Transfer Time: .2 s - Transfer Rate: 493.8 KB/s
14-May-2018 18:57:04 Uploading /opt/bamboo-home/xml-data/build-dir/GRECLIPSE-E44TP-JOB1/Site-org.codehaus.groovy.eclipse/target/site/plugins/org.codehaus.groovy.eclipse.refactoring_2.9.3.xx-201805141725-e44.jar (251.6 KB) to s3://dist.springsource.org/snapshot/GRECLIPSE/e4.4/plugins/org.codehaus.groovy.eclipse.refactoring_2.9.3.xx-201805141725-e44.jar
14-May-2018 18:57:04 Transfer Time: .3 s - Transfer Rate: 908.4 KB/s
14-May-2018 18:57:04 Uploading /opt/bamboo-home/xml-data/build-dir/GRECLIPSE-E44TP-JOB1/Site-org.codehaus.groovy.eclipse/target/site/plugins/org.codehaus.groovy.eclipse.ui_2.9.3.xx-201805141725-e44.jar (520.2 KB) to s3://dist.springsource.org/snapshot/GRECLIPSE/e4.4/plugins/org.codehaus.groovy.eclipse.ui_2.9.3.xx-201805141725-e44.jar
14-May-2018 18:57:05 Transfer Time: .3 s - Transfer Rate: 1.9 MB/s
14-May-2018 18:57:05 Uploading /opt/bamboo-home/xml-data/build-dir/GRECLIPSE-E44TP-JOB1/Site-org.codehaus.groovy.eclipse/target/site/plugins/org.codehaus.groovy.eclipse_2.9.3.xx-201805141725-e44.jar (16.5 KB) to s3://dist.springsource.org/snapshot/GRECLIPSE/e4.4/plugins/org.codehaus.groovy.eclipse_2.9.3.xx-201805141725-e44.jar
14-May-2018 18:57:05 Transfer Time: .2 s - Transfer Rate: 90.4 KB/s
14-May-2018 18:57:06 Uploading /opt/bamboo-home/xml-data/build-dir/GRECLIPSE-E44TP-JOB1/Site-org.codehaus.groovy.eclipse/target/site/plugins/org.codehaus.groovy.m2eclipse_2.9.3.xx-201805141725-e44.jar (14.1 KB) to s3://dist.springsource.org/snapshot/GRECLIPSE/e4.4/plugins/org.codehaus.groovy.m2eclipse_2.9.3.xx-201805141725-e44.jar
14-May-2018 18:57:06 Transfer Time: .2 s - Transfer Rate: 74.8 KB/s
14-May-2018 18:57:06 Uploading /opt/bamboo-home/xml-data/build-dir/GRECLIPSE-E44TP-JOB1/Site-org.codehaus.groovy.eclipse/target/site/plugins/org.codehaus.groovy_1.8.9.xx-201805141725-e44.jar (9.7 MB) to s3://dist.springsource.org/snapshot/GRECLIPSE/e4.4/plugins/org.codehaus.groovy_1.8.9.xx-201805141725-e44.jar
14-May-2018 18:57:07 Transfer Time: .8 s - Transfer Rate: 12.6 MB/s
14-May-2018 18:57:07 Uploading /opt/bamboo-home/xml-data/build-dir/GRECLIPSE-E44TP-JOB1/Site-org.codehaus.groovy.eclipse/target/site/plugins/org.codehaus.groovy_2.0.8.xx-201805141725-e44.jar (10.0 MB) to s3://dist.springsource.org/snapshot/GRECLIPSE/e4.4/plugins/org.codehaus.groovy_2.0.8.xx-201805141725-e44.jar
14-May-2018 18:57:08 Transfer Time: 1.0 s - Transfer Rate: 10.0 MB/s
14-May-2018 18:57:09 Uploading /opt/bamboo-home/xml-data/build-dir/GRECLIPSE-E44TP-JOB1/Site-org.codehaus.groovy.eclipse/target/site/plugins/org.codehaus.groovy_2.1.9.xx-201805141725-e44.jar (10.1 MB) to s3://dist.springsource.org/snapshot/GRECLIPSE/e4.4/plugins/org.codehaus.groovy_2.1.9.xx-201805141725-e44.jar
14-May-2018 18:57:09 Transfer Time: .7 s - Transfer Rate: 13.8 MB/s
14-May-2018 18:57:10 Uploading /opt/bamboo-home/xml-data/build-dir/GRECLIPSE-E44TP-JOB1/Site-org.codehaus.groovy.eclipse/target/site/plugins/org.codehaus.groovy_2.2.2.xx-201805141725-e44.jar (10.7 MB) to s3://dist.springsource.org/snapshot/GRECLIPSE/e4.4/plugins/org.codehaus.groovy_2.2.2.xx-201805141725-e44.jar
14-May-2018 18:57:10 Transfer Time: .7 s - Transfer Rate: 14.9 MB/s
14-May-2018 18:57:11 Uploading /opt/bamboo-home/xml-data/build-dir/GRECLIPSE-E44TP-JOB1/Site-org.codehaus.groovy.eclipse/target/site/plugins/org.codehaus.groovy_2.3.11.xx-201805141725-e44.jar (11.7 MB) to s3://dist.springsource.org/snapshot/GRECLIPSE/e4.4/plugins/org.codehaus.groovy_2.3.11.xx-201805141725-e44.jar
14-May-2018 18:57:15 Transfer Time: 3.7 s - Transfer Rate: 3.1 MB/s
14-May-2018 18:57:15 Uploading /opt/bamboo-home/xml-data/build-dir/GRECLIPSE-E44TP-JOB1/Site-org.codehaus.groovy.eclipse/target/site/plugins/org.codehaus.groovy_2.4.13.xx-201805141725-e44.jar (11.7 MB) to s3://dist.springsource.org/snapshot/GRECLIPSE/e4.4/plugins/org.codehaus.groovy_2.4.13.xx-201805141725-e44.jar
14-May-2018 18:57:20 Transfer Time: 4.7 s - Transfer Rate: 2.5 MB/s
14-May-2018 18:57:20 Uploading /opt/bamboo-home/xml-data/build-dir/GRECLIPSE-E44TP-JOB1/Site-org.codehaus.groovy.eclipse/target/site/plugins/org.codehaus.groovy_2.5.0.xx-201805141725-e44.jar (19.7 MB) to s3://dist.springsource.org/snapshot/GRECLIPSE/e4.4/plugins/org.codehaus.groovy_2.5.0.xx-201805141725-e44.jar
14-May-2018 18:57:28 Transfer Time: 8.1 s - Transfer Rate: 2.4 MB/s
14-May-2018 18:57:29 Uploading /opt/bamboo-home/xml-data/build-dir/GRECLIPSE-E44TP-JOB1/Site-org.codehaus.groovy.eclipse/target/site/plugins/org.eclipse.jdt.core_3.10.2.xx-201805141725-e44.jar (5.4 MB) to s3://dist.springsource.org/snapshot/GRECLIPSE/e4.4/plugins/org.eclipse.jdt.core_3.10.2.xx-201805141725-e44.jar
14-May-2018 18:57:30 Transfer Time: 1.9 s - Transfer Rate: 2.8 MB/s
14-May-2018 18:57:31 Uploading /opt/bamboo-home/xml-data/build-dir/GRECLIPSE-E44TP-JOB1/Site-org.codehaus.groovy.eclipse/target/site/plugins/org.eclipse.jdt.groovy.core_2.9.3.xx-201805141725-e44.jar (408.0 KB) to s3://dist.springsource.org/snapshot/GRECLIPSE/e4.4/plugins/org.eclipse.jdt.groovy.core_2.9.3.xx-201805141725-e44.jar
14-May-2018 18:57:31 Transfer Time: .3 s - Transfer Rate: 1.4 MB/s
14-May-2018 18:57:31 Uploading /opt/bamboo-home/xml-data/build-dir/GRECLIPSE-E44TP-JOB1/Site-org.codehaus.groovy.eclipse/target/site/site.xml (3.8 KB) to s3://dist.springsource.org/snapshot/GRECLIPSE/e4.4/site.xml
14-May-2018 18:57:32 Transfer Time: .2 s - Transfer Rate: 21.3 KB/s
14-May-2018 18:57:32 Uploading /opt/bamboo-home/xml-data/build-dir/GRECLIPSE-E44TP-JOB1/Site-org.codehaus.groovy.eclipse/target/site/org.codehaus.groovy-2.9.3.xx-201805141725-e44-updatesite.zip (90.8 MB) to s3://dist.springsource.org/snapshot/GRECLIPSE/e4.4/org.codehaus.groovy-2.9.3.xx-201805141725-e44-updatesite.zip
14-May-2018 18:57:54 Transfer Time: 21.9 s - Transfer Rate: 4.2 MB/s
14-May-2018 18:57:54 [INFO] Executed tasks
14-May-2018 18:57:54 [INFO] ------------------------------------------------------------------------
14-May-2018 18:57:54 [INFO] Reactor Summary:
14-May-2018 18:57:54 [INFO]
14-May-2018 18:57:54 [INFO] org.codehaus.groovy.eclipse.parent ................ SUCCESS [0.203s]
14-May-2018 18:57:54 [INFO] org.codehaus.groovy ............................... SUCCESS [8.250s]
14-May-2018 18:57:54 [INFO] org.codehaus.groovy ............................... SUCCESS [5.402s]
14-May-2018 18:57:54 [INFO] org.codehaus.groovy ............................... SUCCESS [4.560s]
14-May-2018 18:57:54 [INFO] org.codehaus.groovy ............................... SUCCESS [4.802s]
14-May-2018 18:57:54 [INFO] org.codehaus.groovy ............................... SUCCESS [5.096s]
14-May-2018 18:57:54 [INFO] org.codehaus.groovy ............................... SUCCESS [4.634s]
14-May-2018 18:57:54 [INFO] org.codehaus.groovy ............................... SUCCESS [5.863s]
14-May-2018 18:57:54 [INFO] org.codehaus.groovy.eclipse.compilerResolver ...... SUCCESS [1.140s]
14-May-2018 18:57:54 [INFO] org.eclipse.jdt.core .............................. SUCCESS [17.518s]
14-May-2018 18:57:54 [INFO] org.eclipse.jdt.groovy.core ....................... SUCCESS [2.571s]
14-May-2018 18:57:54 [INFO] org.codehaus.groovy.eclipse ....................... SUCCESS [0.596s]
14-May-2018 18:57:54 [INFO] org.codehaus.groovy.eclipse.core .................. SUCCESS [1.661s]
14-May-2018 18:57:54 [INFO] org.codehaus.groovy.eclipse.ant ................... SUCCESS [1.213s]
14-May-2018 18:57:54 [INFO] org.codehaus.groovy.eclipse.codebrowsing .......... SUCCESS [1.471s]
14-May-2018 18:57:54 [INFO] org.codehaus.groovy.eclipse.refactoring ........... SUCCESS [2.030s]
14-May-2018 18:57:54 [INFO] org.codehaus.groovy.eclipse.ui .................... SUCCESS [3.185s]
14-May-2018 18:57:54 [INFO] org.codehaus.groovy.eclipse.astviews .............. SUCCESS [2.864s]
14-May-2018 18:57:54 [INFO] org.codehaus.groovy.eclipse.codeassist.completion . SUCCESS [2.026s]
14-May-2018 18:57:54 [INFO] org.codehaus.groovy.eclipse.dsl ................... SUCCESS [2.417s]
14-May-2018 18:57:54 [INFO] org.codehaus.groovy.eclipse.quickfix .............. SUCCESS [1.711s]
14-May-2018 18:57:54 [INFO] org.codehaus.groovy18.feature ..................... SUCCESS [0.728s]
14-May-2018 18:57:54 [INFO] org.codehaus.groovy20.feature ..................... SUCCESS [0.596s]
14-May-2018 18:57:54 [INFO] org.codehaus.groovy21.feature ..................... SUCCESS [0.615s]
14-May-2018 18:57:54 [INFO] org.codehaus.groovy22.feature ..................... SUCCESS [0.610s]
14-May-2018 18:57:54 [INFO] org.codehaus.groovy23.feature ..................... SUCCESS [0.606s]
14-May-2018 18:57:54 [INFO] org.codehaus.groovy24.feature ..................... SUCCESS [0.632s]
14-May-2018 18:57:54 [INFO] org.codehaus.groovy25.feature ..................... SUCCESS [0.654s]
14-May-2018 18:57:54 [INFO] org.codehaus.groovy.jdt.patch ..................... SUCCESS [0.621s]
14-May-2018 18:57:54 [INFO] org.codehaus.groovy.headless.feature .............. SUCCESS [0.917s]
14-May-2018 18:57:54 [INFO] org.codehaus.groovy.compilerless.feature .......... SUCCESS [1.055s]
14-May-2018 18:57:54 [INFO] org.codehaus.groovy.eclipse.feature ............... SUCCESS [0.709s]
14-May-2018 18:57:54 [INFO] org.eclipse.jdt.core.tests.compiler ............... SUCCESS [7.047s]
14-May-2018 18:57:54 [INFO] org.eclipse.jdt.core.tests.builder ................ SUCCESS [1.588s]
14-May-2018 18:57:54 [INFO] org.eclipse.jdt.groovy.core.tests.compiler ........ SUCCESS [1.287s]
14-May-2018 18:57:54 [INFO] org.eclipse.jdt.groovy.core.tests.builder ......... SUCCESS [1.854s]
14-May-2018 18:57:54 [INFO] org.codehaus.groovy.eclipse.tests ................. SUCCESS [6.361s]
14-May-2018 18:57:54 [INFO] org.codehaus.groovy.eclipse.codeassist.completion.test  SUCCESS [2.930s]
14-May-2018 18:57:54 [INFO] org.codehaus.groovy.eclipse.codebrowsing.test ..... SUCCESS [2.173s]
14-May-2018 18:57:54 [INFO] org.codehaus.groovy.eclipse.core.test ............. SUCCESS [1.555s]
14-May-2018 18:57:54 [INFO] org.codehaus.groovy.eclipse.dsl.tests ............. SUCCESS [2.275s]
14-May-2018 18:57:54 [INFO] org.codehaus.groovy.eclipse.junit.test ............ SUCCESS [1.479s]
14-May-2018 18:57:54 [INFO] org.codehaus.groovy.eclipse.refactoring.test ...... SUCCESS [3.456s]
14-May-2018 18:57:54 [INFO] org.codehaus.groovy.eclipse.quickfix.test ......... SUCCESS [1.833s]
14-May-2018 18:57:54 [INFO] org.codehaus.groovy.alltests ...................... SUCCESS [1:28:24.272s]
14-May-2018 18:57:54 [INFO] org.codehaus.groovy.alltests.feature .............. SUCCESS [15.515s]
14-May-2018 18:57:54 [INFO] org.codehaus.groovy.m2eclipse ..................... SUCCESS [3.707s]
14-May-2018 18:57:54 [INFO] org.codehaus.groovy.m2eclipse.feature ............. SUCCESS [1.521s]
14-May-2018 18:57:54 [INFO] org.codehaus.groovy.eclipse.site .................. SUCCESS [1:31.520s]
14-May-2018 18:57:54 [INFO] ------------------------------------------------------------------------
14-May-2018 18:57:54 [INFO] BUILD SUCCESS
14-May-2018 18:57:54 [INFO] ------------------------------------------------------------------------
14-May-2018 18:57:54 [INFO] Total time: 1:38:27.812s
14-May-2018 18:57:54 [INFO] Finished at: Mon May 14 18:57:54 UTC 2018
14-May-2018 18:57:57 [INFO] Final Memory: 284M/1051M
14-May-2018 18:57:57 [INFO] ------------------------------------------------------------------------
14-May-2018 18:57:59 Parsing test results under /opt/bamboo-home/xml-data/build-dir/GRECLIPSE-E44TP-JOB1...
14-May-2018 18:58:04 Finished task 'Maven 3.x' with result: Success
14-May-2018 18:58:04 Running post build plugin 'Docker Container Cleanup'
14-May-2018 18:58:05 Running post build plugin 'NCover Results Collector'
14-May-2018 18:58:05 Running post build plugin 'Artifactory Release Management Staging'
14-May-2018 18:58:05 Running post build plugin 'Artifactory Build Info Copier'
14-May-2018 18:58:05 Running post build plugin 'Artifactory Gradle Properties Info Copier'
14-May-2018 18:58:05 Running post build plugin 'Clover Results Collector'
14-May-2018 18:58:05 Running post build plugin 'npm Cache Cleanup'
14-May-2018 18:58:05 Running post build plugin 'Artifact Copier'
14-May-2018 18:58:05 Publishing an artifact: Zipped Update Site
14-May-2018 18:58:11 Finished publishing of artifact Job artifact: [Zipped Update Site], pattern: [**/*updatesite.zip] anchored at: [Site-org.codehaus.groovy.eclipse/target/site] in 6.155 s
14-May-2018 18:58:11 Publishing an artifact: surefire-reports
14-May-2018 18:58:13 Finished publishing of artifact Job artifact: [surefire-reports], pattern: [**/target/TEST-*.xml] in 1.753 s
14-May-2018 18:58:14 Successfully removed working directory at '/opt/bamboo-home/xml-data/build-dir/GRECLIPSE-E44TP-JOB1'
14-May-2018 18:58:14 Finalising the build...
14-May-2018 18:58:14 Stopping timer.
14-May-2018 18:58:14 Build GRECLIPSE-E44TP-JOB1-804 completed.
14-May-2018 18:58:14 Running on server: post build plugin 'NCover Results Collector'
14-May-2018 18:58:14 Running on server: post build plugin 'Build Hanging Detection Configuration'
14-May-2018 18:58:14 Running on server: post build plugin 'Clover Delta Calculator'
14-May-2018 18:58:14 Running on server: post build plugin 'Maven Dependencies Postprocessor'
14-May-2018 18:58:14 All post build plugins have finished
14-May-2018 18:58:14 Generating build results summary...
14-May-2018 18:58:15 Saving build results to disk...
14-May-2018 18:58:16 Logging substituted variables...
14-May-2018 18:58:16 Indexing build results...
14-May-2018 18:58:16 Finished building GRECLIPSE-E44TP-JOB1-804.