E44 build, test and publish

Build: #806 was successful

Job: Default Job was successful

Stages & jobs

  1. Default Stage

Build log

The build generated 36,157 lines of output.The output is too long and has been truncated to the last 1,000 lines. Download or view full build log

26-Jun-2018 16:55:12 testForLoop4(org.eclipse.jdt.core.groovy.tests.search.GenericInferencingTests)  Time elapsed: 0.108 sec
26-Jun-2018 16:55:12 testForLoop5(org.eclipse.jdt.core.groovy.tests.search.GenericInferencingTests)  Time elapsed: 0.101 sec
26-Jun-2018 16:55:12 testForLoop6(org.eclipse.jdt.core.groovy.tests.search.GenericInferencingTests)  Time elapsed: 0.105 sec
26-Jun-2018 16:55:12 testForLoop7(org.eclipse.jdt.core.groovy.tests.search.GenericInferencingTests)  Time elapsed: 0.107 sec
26-Jun-2018 16:55:12 testForLoop8(org.eclipse.jdt.core.groovy.tests.search.GenericInferencingTests)  Time elapsed: 0.122 sec
26-Jun-2018 16:55:12 testForLoop9(org.eclipse.jdt.core.groovy.tests.search.GenericInferencingTests)  Time elapsed: 0.111 sec
26-Jun-2018 16:55:12 testInferringRange1(org.eclipse.jdt.core.groovy.tests.search.GenericInferencingTests)  Time elapsed: 0.107 sec
26-Jun-2018 16:55:12 testInferringRange2(org.eclipse.jdt.core.groovy.tests.search.GenericInferencingTests)  Time elapsed: 0.111 sec
26-Jun-2018 16:55:12 testMapOfList(org.eclipse.jdt.core.groovy.tests.search.GenericInferencingTests)  Time elapsed: 0.11 sec
26-Jun-2018 16:55:12 testList10(org.eclipse.jdt.core.groovy.tests.search.GenericInferencingTests)  Time elapsed: 0.106 sec
26-Jun-2018 16:55:12 testForLoop11(org.eclipse.jdt.core.groovy.tests.search.GenericInferencingTests)  Time elapsed: 0.104 sec
26-Jun-2018 16:55:12 testForLoop2a(org.eclipse.jdt.core.groovy.tests.search.GenericInferencingTests)  Time elapsed: 0.101 sec
26-Jun-2018 16:55:12 testDGMClosure10(org.eclipse.jdt.core.groovy.tests.search.GenericInferencingTests)  Time elapsed: 0.113 sec
26-Jun-2018 16:55:12 testDGMClosure11(org.eclipse.jdt.core.groovy.tests.search.GenericInferencingTests)  Time elapsed: 0.113 sec
26-Jun-2018 16:55:12 testDGMClosure12(org.eclipse.jdt.core.groovy.tests.search.GenericInferencingTests)  Time elapsed: 0.106 sec
26-Jun-2018 16:55:12 testDGMClosure13(org.eclipse.jdt.core.groovy.tests.search.GenericInferencingTests)  Time elapsed: 0.107 sec
26-Jun-2018 16:55:12 testDGMClosure14(org.eclipse.jdt.core.groovy.tests.search.GenericInferencingTests)  Time elapsed: 0.102 sec
26-Jun-2018 16:55:12 testDGMClosure15(org.eclipse.jdt.core.groovy.tests.search.GenericInferencingTests)  Time elapsed: 0.118 sec
26-Jun-2018 16:55:12 testDGMClosure16(org.eclipse.jdt.core.groovy.tests.search.GenericInferencingTests)  Time elapsed: 0.108 sec
26-Jun-2018 16:55:12 testDGMClosure17(org.eclipse.jdt.core.groovy.tests.search.GenericInferencingTests)  Time elapsed: 0.109 sec
26-Jun-2018 16:55:12 testDGMClosure18(org.eclipse.jdt.core.groovy.tests.search.GenericInferencingTests)  Time elapsed: 0.123 sec
26-Jun-2018 16:55:12 testDGMClosure19(org.eclipse.jdt.core.groovy.tests.search.GenericInferencingTests)  Time elapsed: 0.121 sec
26-Jun-2018 16:55:12 testDGMClosure20(org.eclipse.jdt.core.groovy.tests.search.GenericInferencingTests)  Time elapsed: 0.115 sec
26-Jun-2018 16:55:12 testDGMClosure21(org.eclipse.jdt.core.groovy.tests.search.GenericInferencingTests)  Time elapsed: 0.134 sec
26-Jun-2018 16:55:12 testDGMClosure22(org.eclipse.jdt.core.groovy.tests.search.GenericInferencingTests)  Time elapsed: 0.103 sec
26-Jun-2018 16:55:12 testDGMClosure23(org.eclipse.jdt.core.groovy.tests.search.GenericInferencingTests)  Time elapsed: 0.13 sec
26-Jun-2018 16:55:12 testClosure1(org.eclipse.jdt.core.groovy.tests.search.GenericInferencingTests)  Time elapsed: 0.103 sec
26-Jun-2018 16:55:12 testClosure2(org.eclipse.jdt.core.groovy.tests.search.GenericInferencingTests)  Time elapsed: 0.111 sec
26-Jun-2018 16:55:12 testClosure3(org.eclipse.jdt.core.groovy.tests.search.GenericInferencingTests)  Time elapsed: 0.107 sec
26-Jun-2018 16:55:12 testClosure4(org.eclipse.jdt.core.groovy.tests.search.GenericInferencingTests)  Time elapsed: 0.113 sec
26-Jun-2018 16:55:12 testInferringList1(org.eclipse.jdt.core.groovy.tests.search.GenericInferencingTests)  Time elapsed: 0.115 sec
26-Jun-2018 16:55:12 testInferringList2(org.eclipse.jdt.core.groovy.tests.search.GenericInferencingTests)  Time elapsed: 0.116 sec
26-Jun-2018 16:55:12 testInferringList3(org.eclipse.jdt.core.groovy.tests.search.GenericInferencingTests)  Time elapsed: 0.116 sec
26-Jun-2018 16:55:12 testMapOfList2(org.eclipse.jdt.core.groovy.tests.search.GenericInferencingTests)  Time elapsed: 0.114 sec
26-Jun-2018 16:55:12 testMapOfList3(org.eclipse.jdt.core.groovy.tests.search.GenericInferencingTests)  Time elapsed: 0.102 sec
26-Jun-2018 16:55:12 testMapOfList4(org.eclipse.jdt.core.groovy.tests.search.GenericInferencingTests)  Time elapsed: 0.109 sec
26-Jun-2018 16:55:12 testMapOfList5(org.eclipse.jdt.core.groovy.tests.search.GenericInferencingTests)  Time elapsed: 0.11 sec
26-Jun-2018 16:55:12 testMapOfList6(org.eclipse.jdt.core.groovy.tests.search.GenericInferencingTests)  Time elapsed: 0.12 sec
26-Jun-2018 16:55:12 testMapOfList7(org.eclipse.jdt.core.groovy.tests.search.GenericInferencingTests)  Time elapsed: 0.114 sec
26-Jun-2018 16:55:12 testGenericsMapper(org.eclipse.jdt.core.groovy.tests.search.GenericsMappingTests)  Time elapsed: 0.097 sec
26-Jun-2018 16:55:12 testCompileStatic10(org.eclipse.jdt.core.groovy.tests.search.Groovy20InferencingTests)  Time elapsed: 0.14 sec
26-Jun-2018 16:55:12 testCompileStatic1(org.eclipse.jdt.core.groovy.tests.search.Groovy20InferencingTests)  Time elapsed: 0.11 sec
26-Jun-2018 16:55:12 testCompileStatic2(org.eclipse.jdt.core.groovy.tests.search.Groovy20InferencingTests)  Time elapsed: 0.122 sec
26-Jun-2018 16:55:12 testCompileStatic3(org.eclipse.jdt.core.groovy.tests.search.Groovy20InferencingTests)  Time elapsed: 0.101 sec
26-Jun-2018 16:55:12 testCompileStatic4(org.eclipse.jdt.core.groovy.tests.search.Groovy20InferencingTests)  Time elapsed: 0.102 sec
26-Jun-2018 16:55:12 testCompileStatic5(org.eclipse.jdt.core.groovy.tests.search.Groovy20InferencingTests)  Time elapsed: 0.108 sec
26-Jun-2018 16:55:12 testCompileStatic6(org.eclipse.jdt.core.groovy.tests.search.Groovy20InferencingTests)  Time elapsed: 0.112 sec
26-Jun-2018 16:55:12 testCompileStatic7(org.eclipse.jdt.core.groovy.tests.search.Groovy20InferencingTests)  Time elapsed: 0.102 sec
26-Jun-2018 16:55:12 testCompileStatic8(org.eclipse.jdt.core.groovy.tests.search.Groovy20InferencingTests)  Time elapsed: 0.108 sec
26-Jun-2018 16:55:12 testCompileStatic9(org.eclipse.jdt.core.groovy.tests.search.Groovy20InferencingTests)  Time elapsed: 0.11 sec
26-Jun-2018 16:55:12 testTypeChecked1(org.eclipse.jdt.core.groovy.tests.search.Groovy20InferencingTests)  Time elapsed: 0.098 sec
26-Jun-2018 16:55:12 testTypeChecked2(org.eclipse.jdt.core.groovy.tests.search.Groovy20InferencingTests)  Time elapsed: 0.103 sec
26-Jun-2018 16:55:12 testTypeChecked3(org.eclipse.jdt.core.groovy.tests.search.Groovy20InferencingTests)  Time elapsed: 0.103 sec
26-Jun-2018 16:55:12 testTypeChecked4(org.eclipse.jdt.core.groovy.tests.search.Groovy20InferencingTests)  Time elapsed: 0.11 sec
26-Jun-2018 16:55:12 testTypeChecked5(org.eclipse.jdt.core.groovy.tests.search.Groovy20InferencingTests)  Time elapsed: 0.11 sec
26-Jun-2018 16:55:12 testTypeChecked6(org.eclipse.jdt.core.groovy.tests.search.Groovy20InferencingTests)  Time elapsed: 0.109 sec
26-Jun-2018 16:55:12 testTypeChecked7(org.eclipse.jdt.core.groovy.tests.search.Groovy20InferencingTests)  Time elapsed: 0.109 sec
26-Jun-2018 16:55:12 testTypeChecked8(org.eclipse.jdt.core.groovy.tests.search.Groovy20InferencingTests)  Time elapsed: 0.113 sec
26-Jun-2018 16:55:12 testTypeCheckingExtension(org.eclipse.jdt.core.groovy.tests.search.Groovy21InferencingTests)  Time elapsed: 0.757 sec
26-Jun-2018 16:55:12 testDelegatesToTarget1(org.eclipse.jdt.core.groovy.tests.search.Groovy21InferencingTests)  Time elapsed: 0.165 sec
26-Jun-2018 16:55:12 testDelegatesToTarget2(org.eclipse.jdt.core.groovy.tests.search.Groovy21InferencingTests)  Time elapsed: 0.169 sec
26-Jun-2018 16:55:12 testDelegatesToTarget3(org.eclipse.jdt.core.groovy.tests.search.Groovy21InferencingTests)  Time elapsed: 0.194 sec
26-Jun-2018 16:55:12 testDelegatesToTarget4(org.eclipse.jdt.core.groovy.tests.search.Groovy21InferencingTests)  Time elapsed: 0.162 sec
26-Jun-2018 16:55:12 testDelegatesToTarget5(org.eclipse.jdt.core.groovy.tests.search.Groovy21InferencingTests)  Time elapsed: 0.173 sec
26-Jun-2018 16:55:12 testDelegatesToValue2(org.eclipse.jdt.core.groovy.tests.search.Groovy21InferencingTests)  Time elapsed: 0.112 sec
26-Jun-2018 16:55:12 testDelegatesToValue3(org.eclipse.jdt.core.groovy.tests.search.Groovy21InferencingTests)  Time elapsed: 0.122 sec
26-Jun-2018 16:55:12 testDelegatesToValue4(org.eclipse.jdt.core.groovy.tests.search.Groovy21InferencingTests)  Time elapsed: 0.116 sec
26-Jun-2018 16:55:12 testDelegatesToValue5(org.eclipse.jdt.core.groovy.tests.search.Groovy21InferencingTests)  Time elapsed: 0.114 sec
26-Jun-2018 16:55:12 testDelegatesToValue6(org.eclipse.jdt.core.groovy.tests.search.Groovy21InferencingTests)  Time elapsed: 0.132 sec
26-Jun-2018 16:55:12 testDelegatesToValue(org.eclipse.jdt.core.groovy.tests.search.Groovy21InferencingTests)  Time elapsed: 0.114 sec
26-Jun-2018 16:55:12 testEnumOverrides(org.eclipse.jdt.core.groovy.tests.search.Groovy21InferencingTests)  Time elapsed: 0.12 sec
26-Jun-2018 16:55:12 testEnumOverrides2(org.eclipse.jdt.core.groovy.tests.search.Groovy21InferencingTests)  Time elapsed: 0.178 sec
26-Jun-2018 16:55:12 testFieldAndPropertyWithSameName(org.eclipse.jdt.core.groovy.tests.search.InferencingTests)  Time elapsed: 0.108 sec
26-Jun-2018 16:55:12 testObjectMethodOnInterface(org.eclipse.jdt.core.groovy.tests.search.InferencingTests)  Time elapsed: 0.105 sec
26-Jun-2018 16:55:12 testNothingIsUnknown(org.eclipse.jdt.core.groovy.tests.search.InferencingTests)  Time elapsed: 0.108 sec
26-Jun-2018 16:55:12 testInnerClass1(org.eclipse.jdt.core.groovy.tests.search.InferencingTests)  Time elapsed: 0.107 sec
26-Jun-2018 16:55:12 testInnerClass2(org.eclipse.jdt.core.groovy.tests.search.InferencingTests)  Time elapsed: 0.11 sec
26-Jun-2018 16:55:12 testInnerClass3(org.eclipse.jdt.core.groovy.tests.search.InferencingTests)  Time elapsed: 0.104 sec
26-Jun-2018 16:55:12 testInnerClass4(org.eclipse.jdt.core.groovy.tests.search.InferencingTests)  Time elapsed: 0.094 sec
26-Jun-2018 16:55:12 testInnerClass5(org.eclipse.jdt.core.groovy.tests.search.InferencingTests)  Time elapsed: 0.099 sec
26-Jun-2018 16:55:12 testInnerClass6(org.eclipse.jdt.core.groovy.tests.search.InferencingTests)  Time elapsed: 0.111 sec
26-Jun-2018 16:55:12 testInnerClass7(org.eclipse.jdt.core.groovy.tests.search.InferencingTests)  Time elapsed: 0.174 sec
26-Jun-2018 16:55:12 testInnerClass8(org.eclipse.jdt.core.groovy.tests.search.InferencingTests)  Time elapsed: 0.179 sec
26-Jun-2018 16:55:12 testInnerClass9(org.eclipse.jdt.core.groovy.tests.search.InferencingTests)  Time elapsed: 0.133 sec
26-Jun-2018 16:55:12 testBoolean1(org.eclipse.jdt.core.groovy.tests.search.InferencingTests)  Time elapsed: 0.103 sec
26-Jun-2018 16:55:12 testBoolean2(org.eclipse.jdt.core.groovy.tests.search.InferencingTests)  Time elapsed: 0.105 sec
26-Jun-2018 16:55:12 testBoolean3(org.eclipse.jdt.core.groovy.tests.search.InferencingTests)  Time elapsed: 0.105 sec
26-Jun-2018 16:55:12 testBoolean4(org.eclipse.jdt.core.groovy.tests.search.InferencingTests)  Time elapsed: 0.107 sec
26-Jun-2018 16:55:12 testBoolean5(org.eclipse.jdt.core.groovy.tests.search.InferencingTests)  Time elapsed: 0.118 sec
26-Jun-2018 16:55:12 testBoolean6(org.eclipse.jdt.core.groovy.tests.search.InferencingTests)  Time elapsed: 0.11 sec
26-Jun-2018 16:55:12 testBoolean7(org.eclipse.jdt.core.groovy.tests.search.InferencingTests)  Time elapsed: 0.107 sec
26-Jun-2018 16:55:12 testDeclarationAtBeginningOfMethod(org.eclipse.jdt.core.groovy.tests.search.InferencingTests)  Time elapsed: 0.103 sec
26-Jun-2018 16:55:12 testLocalTypeAndDefaultImportCollision(org.eclipse.jdt.core.groovy.tests.search.InferencingTests)  Time elapsed: 0.12 sec
26-Jun-2018 16:55:12 testSuperClassMethod(org.eclipse.jdt.core.groovy.tests.search.InferencingTests)  Time elapsed: 0.1 sec
26-Jun-2018 16:55:12 testGRECLIPSE731a(org.eclipse.jdt.core.groovy.tests.search.InferencingTests)  Time elapsed: 0.107 sec
26-Jun-2018 16:55:12 testGRECLIPSE731b(org.eclipse.jdt.core.groovy.tests.search.InferencingTests)  Time elapsed: 0.104 sec
26-Jun-2018 16:55:12 testGRECLIPSE731c(org.eclipse.jdt.core.groovy.tests.search.InferencingTests)  Time elapsed: 0.099 sec
26-Jun-2018 16:55:12 testGRECLIPSE731d(org.eclipse.jdt.core.groovy.tests.search.InferencingTests)  Time elapsed: 0.101 sec
26-Jun-2018 16:55:12 testGRECLIPSE731e(org.eclipse.jdt.core.groovy.tests.search.InferencingTests)  Time elapsed: 0.111 sec
26-Jun-2018 16:55:12 testGRECLIPSE731f(org.eclipse.jdt.core.groovy.tests.search.InferencingTests)  Time elapsed: 0.095 sec
26-Jun-2018 16:55:12 testSpecialConstructor1(org.eclipse.jdt.core.groovy.tests.search.InferencingTests)  Time elapsed: 0.115 sec
26-Jun-2018 16:55:12 testSpecialConstructor2(org.eclipse.jdt.core.groovy.tests.search.InferencingTests)  Time elapsed: 0.121 sec
26-Jun-2018 16:55:12 testInnerClass10(org.eclipse.jdt.core.groovy.tests.search.InferencingTests)  Time elapsed: 0.133 sec
26-Jun-2018 16:55:12 testInnerClass11(org.eclipse.jdt.core.groovy.tests.search.InferencingTests)  Time elapsed: 0.128 sec
26-Jun-2018 16:55:12 testMultiDecl10(org.eclipse.jdt.core.groovy.tests.search.InferencingTests)  Time elapsed: 0.124 sec
26-Jun-2018 16:55:12 testMultiDecl11(org.eclipse.jdt.core.groovy.tests.search.InferencingTests)  Time elapsed: 0.125 sec
26-Jun-2018 16:55:12 testMultiDecl12(org.eclipse.jdt.core.groovy.tests.search.InferencingTests)  Time elapsed: 0.142 sec
26-Jun-2018 16:55:12 testMultiDecl13(org.eclipse.jdt.core.groovy.tests.search.InferencingTests)  Time elapsed: 0.118 sec
26-Jun-2018 16:55:12 testAssignementInInnerBlock(org.eclipse.jdt.core.groovy.tests.search.InferencingTests)  Time elapsed: 0.097 sec
26-Jun-2018 16:55:12 testConstantFromSuper(org.eclipse.jdt.core.groovy.tests.search.InferencingTests)  Time elapsed: 0.107 sec
26-Jun-2018 16:55:12 testAsExpression1(org.eclipse.jdt.core.groovy.tests.search.InferencingTests)  Time elapsed: 0.104 sec
26-Jun-2018 16:55:12 testAsExpression2(org.eclipse.jdt.core.groovy.tests.search.InferencingTests)  Time elapsed: 0.108 sec
26-Jun-2018 16:55:12 testSuperClassMethod2(org.eclipse.jdt.core.groovy.tests.search.InferencingTests)  Time elapsed: 0.108 sec
26-Jun-2018 16:55:12 testNumber1a(org.eclipse.jdt.core.groovy.tests.search.InferencingTests)  Time elapsed: 0.099 sec
26-Jun-2018 16:55:12 testDGM1(org.eclipse.jdt.core.groovy.tests.search.InferencingTests)  Time elapsed: 0.104 sec
26-Jun-2018 16:55:12 testDGM2(org.eclipse.jdt.core.groovy.tests.search.InferencingTests)  Time elapsed: 0.099 sec
26-Jun-2018 16:55:12 testDGM3(org.eclipse.jdt.core.groovy.tests.search.InferencingTests)  Time elapsed: 0.109 sec
26-Jun-2018 16:55:12 testRangeExpression1(org.eclipse.jdt.core.groovy.tests.search.InferencingTests)  Time elapsed: 0.103 sec
26-Jun-2018 16:55:12 testRangeExpression2(org.eclipse.jdt.core.groovy.tests.search.InferencingTests)  Time elapsed: 0.104 sec
26-Jun-2018 16:55:12 testRangeExpression3(org.eclipse.jdt.core.groovy.tests.search.InferencingTests)  Time elapsed: 0.107 sec
26-Jun-2018 16:55:12 testRangeExpression4(org.eclipse.jdt.core.groovy.tests.search.InferencingTests)  Time elapsed: 0.102 sec
26-Jun-2018 16:55:12 testRangeExpression5(org.eclipse.jdt.core.groovy.tests.search.InferencingTests)  Time elapsed: 0.103 sec
26-Jun-2018 16:55:12 testRangeExpression6(org.eclipse.jdt.core.groovy.tests.search.InferencingTests)  Time elapsed: 0.106 sec
26-Jun-2018 16:55:12 testSpread10(org.eclipse.jdt.core.groovy.tests.search.InferencingTests)  Time elapsed: 0.102 sec
26-Jun-2018 16:55:12 testSpread11(org.eclipse.jdt.core.groovy.tests.search.InferencingTests)  Time elapsed: 0.118 sec
26-Jun-2018 16:55:12 testSpread12(org.eclipse.jdt.core.groovy.tests.search.InferencingTests)  Time elapsed: 0.143 sec
26-Jun-2018 16:55:12 testSpread13(org.eclipse.jdt.core.groovy.tests.search.InferencingTests)  Time elapsed: 0.134 sec
26-Jun-2018 16:55:12 testStaticThisAndSuper2(org.eclipse.jdt.core.groovy.tests.search.InferencingTests)  Time elapsed: 0.122 sec
26-Jun-2018 16:55:12 testConstructor1(org.eclipse.jdt.core.groovy.tests.search.InferencingTests)  Time elapsed: 0.212 sec
26-Jun-2018 16:55:12 testConstructor2(org.eclipse.jdt.core.groovy.tests.search.InferencingTests)  Time elapsed: 0.197 sec
26-Jun-2018 16:55:12 testConstructor3(org.eclipse.jdt.core.groovy.tests.search.InferencingTests)  Time elapsed: 0.136 sec
26-Jun-2018 16:55:12 testConstructor4(org.eclipse.jdt.core.groovy.tests.search.InferencingTests)  Time elapsed: 0.162 sec
26-Jun-2018 16:55:12 testConstructor5(org.eclipse.jdt.core.groovy.tests.search.InferencingTests)  Time elapsed: 0.164 sec
26-Jun-2018 16:55:12 testConstructor6(org.eclipse.jdt.core.groovy.tests.search.InferencingTests)  Time elapsed: 0.153 sec
26-Jun-2018 16:55:12 testInterfaceMethodsAsProperty(org.eclipse.jdt.core.groovy.tests.search.InferencingTests)  Time elapsed: 0.155 sec
26-Jun-2018 16:55:12 testPostfix(org.eclipse.jdt.core.groovy.tests.search.InferencingTests)  Time elapsed: 0.104 sec
26-Jun-2018 16:55:12 testListSort1(org.eclipse.jdt.core.groovy.tests.search.InferencingTests)  Time elapsed: 0.118 sec
26-Jun-2018 16:55:12 testListSort2(org.eclipse.jdt.core.groovy.tests.search.InferencingTests)  Time elapsed: 0.142 sec
26-Jun-2018 16:55:12 testListSort3(org.eclipse.jdt.core.groovy.tests.search.InferencingTests)  Time elapsed: 0.164 sec
26-Jun-2018 16:55:12 testLocalVar1(org.eclipse.jdt.core.groovy.tests.search.InferencingTests)  Time elapsed: 0.104 sec
26-Jun-2018 16:55:12 testLocalVar2(org.eclipse.jdt.core.groovy.tests.search.InferencingTests)  Time elapsed: 0.103 sec
26-Jun-2018 16:55:12 testLocalVar3(org.eclipse.jdt.core.groovy.tests.search.InferencingTests)  Time elapsed: 0.103 sec
26-Jun-2018 16:55:12 testLocalVar4(org.eclipse.jdt.core.groovy.tests.search.InferencingTests)  Time elapsed: 0.104 sec
26-Jun-2018 16:55:12 testIndirectInterfaceMethod(org.eclipse.jdt.core.groovy.tests.search.InferencingTests)  Time elapsed: 0.144 sec
26-Jun-2018 16:55:12 testMapLiteral(org.eclipse.jdt.core.groovy.tests.search.InferencingTests)  Time elapsed: 0.1 sec
26-Jun-2018 16:55:12 testListRemove(org.eclipse.jdt.core.groovy.tests.search.InferencingTests)  Time elapsed: 0.122 sec
26-Jun-2018 16:55:12 testCategoryMethodAsProperty(org.eclipse.jdt.core.groovy.tests.search.InferencingTests)  Time elapsed: 0.097 sec
26-Jun-2018 16:55:12 testNothingIsUnknownWithCategories(org.eclipse.jdt.core.groovy.tests.search.InferencingTests)  Time elapsed: 0.124 sec
26-Jun-2018 16:55:12 testImplicitVar1(org.eclipse.jdt.core.groovy.tests.search.InferencingTests)  Time elapsed: 0.097 sec
26-Jun-2018 16:55:12 testImplicitVar2(org.eclipse.jdt.core.groovy.tests.search.InferencingTests)  Time elapsed: 0.105 sec
26-Jun-2018 16:55:12 testImplicitVar3(org.eclipse.jdt.core.groovy.tests.search.InferencingTests)  Time elapsed: 0.103 sec
26-Jun-2018 16:55:12 testImplicitVar4(org.eclipse.jdt.core.groovy.tests.search.InferencingTests)  Time elapsed: 0.11 sec
26-Jun-2018 16:55:12 testImplicitVar5(org.eclipse.jdt.core.groovy.tests.search.InferencingTests)  Time elapsed: 0.102 sec
26-Jun-2018 16:55:12 testImplicitVar6(org.eclipse.jdt.core.groovy.tests.search.InferencingTests)  Time elapsed: 0.114 sec
26-Jun-2018 16:55:12 testImplicitVar7(org.eclipse.jdt.core.groovy.tests.search.InferencingTests)  Time elapsed: 0.102 sec
26-Jun-2018 16:55:12 testClassLiteral1(org.eclipse.jdt.core.groovy.tests.search.InferencingTests)  Time elapsed: 0.097 sec
26-Jun-2018 16:55:12 testClassLiteral2(org.eclipse.jdt.core.groovy.tests.search.InferencingTests)  Time elapsed: 0.124 sec
26-Jun-2018 16:55:12 testClassLiteral3(org.eclipse.jdt.core.groovy.tests.search.InferencingTests)  Time elapsed: 0.109 sec
26-Jun-2018 16:55:12 testClassLiteral4(org.eclipse.jdt.core.groovy.tests.search.InferencingTests)  Time elapsed: 0.101 sec
26-Jun-2018 16:55:12 testClassLiteral5(org.eclipse.jdt.core.groovy.tests.search.InferencingTests)  Time elapsed: 0.099 sec
26-Jun-2018 16:55:12 testScriptDeclaringType(org.eclipse.jdt.core.groovy.tests.search.InferencingTests)  Time elapsed: 0.104 sec
26-Jun-2018 16:55:12 testInstanceOf10(org.eclipse.jdt.core.groovy.tests.search.InferencingTests)  Time elapsed: 0.191 sec
26-Jun-2018 16:55:12 testInstanceOf1a(org.eclipse.jdt.core.groovy.tests.search.InferencingTests)  Time elapsed: 0.175 sec
26-Jun-2018 16:55:12 testInstanceOf1b(org.eclipse.jdt.core.groovy.tests.search.InferencingTests)  Time elapsed: 0.186 sec
26-Jun-2018 16:55:12 testStaticImports1(org.eclipse.jdt.core.groovy.tests.search.InferencingTests)  Time elapsed: 0.115 sec
26-Jun-2018 16:55:12 testStaticImports2(org.eclipse.jdt.core.groovy.tests.search.InferencingTests)  Time elapsed: 0.14 sec
26-Jun-2018 16:55:12 testStaticImports3(org.eclipse.jdt.core.groovy.tests.search.InferencingTests)  Time elapsed: 0.109 sec
26-Jun-2018 16:55:12 testStaticImports4(org.eclipse.jdt.core.groovy.tests.search.InferencingTests)  Time elapsed: 0.115 sec
26-Jun-2018 16:55:12 testElvisOperator(org.eclipse.jdt.core.groovy.tests.search.InferencingTests)  Time elapsed: 0.1 sec
26-Jun-2018 16:55:12 testMultiDecl1(org.eclipse.jdt.core.groovy.tests.search.InferencingTests)  Time elapsed: 0.122 sec
26-Jun-2018 16:55:12 testMultiDecl2(org.eclipse.jdt.core.groovy.tests.search.InferencingTests)  Time elapsed: 0.12 sec
26-Jun-2018 16:55:12 testMultiDecl3(org.eclipse.jdt.core.groovy.tests.search.InferencingTests)  Time elapsed: 0.129 sec
26-Jun-2018 16:55:12 testMultiDecl4(org.eclipse.jdt.core.groovy.tests.search.InferencingTests)  Time elapsed: 0.128 sec
26-Jun-2018 16:55:12 testMultiDecl6(org.eclipse.jdt.core.groovy.tests.search.InferencingTests)  Time elapsed: 0.125 sec
26-Jun-2018 16:55:12 testMultiDecl7(org.eclipse.jdt.core.groovy.tests.search.InferencingTests)  Time elapsed: 0.161 sec
26-Jun-2018 16:55:12 testMultiDecl8(org.eclipse.jdt.core.groovy.tests.search.InferencingTests)  Time elapsed: 0.123 sec
26-Jun-2018 16:55:12 testMultiDecl9(org.eclipse.jdt.core.groovy.tests.search.InferencingTests)  Time elapsed: 0.127 sec
26-Jun-2018 16:55:12 testStaticThisAndSuper(org.eclipse.jdt.core.groovy.tests.search.InferencingTests)  Time elapsed: 0.127 sec
26-Jun-2018 16:55:12 testLocalMethod1(org.eclipse.jdt.core.groovy.tests.search.InferencingTests)  Time elapsed: 0.108 sec
26-Jun-2018 16:55:12 testLocalMethod2(org.eclipse.jdt.core.groovy.tests.search.InferencingTests)  Time elapsed: 0.126 sec
26-Jun-2018 16:55:12 testLocalMethod3(org.eclipse.jdt.core.groovy.tests.search.InferencingTests)  Time elapsed: 0.114 sec
26-Jun-2018 16:55:12 testLocalMethod4(org.eclipse.jdt.core.groovy.tests.search.InferencingTests)  Time elapsed: 0.108 sec
26-Jun-2018 16:55:12 testLocalMethod5(org.eclipse.jdt.core.groovy.tests.search.InferencingTests)  Time elapsed: 0.126 sec
26-Jun-2018 16:55:12 testLocalMethod6(org.eclipse.jdt.core.groovy.tests.search.InferencingTests)  Time elapsed: 0.11 sec
26-Jun-2018 16:55:12 testLocalMethod7(org.eclipse.jdt.core.groovy.tests.search.InferencingTests)  Time elapsed: 0.108 sec
26-Jun-2018 16:55:12 testLocalVar2a(org.eclipse.jdt.core.groovy.tests.search.InferencingTests)  Time elapsed: 0.116 sec
26-Jun-2018 16:55:12 testNoGString(org.eclipse.jdt.core.groovy.tests.search.InferencingTests)  Time elapsed: 0.107 sec
26-Jun-2018 16:55:12 testMapEntries1(org.eclipse.jdt.core.groovy.tests.search.InferencingTests)  Time elapsed: 0.16 sec
26-Jun-2018 16:55:12 testObjectMethodOnInterfaceAsProperty(org.eclipse.jdt.core.groovy.tests.search.InferencingTests)  Time elapsed: 0.113 sec
26-Jun-2018 16:55:12 testMatcher1(org.eclipse.jdt.core.groovy.tests.search.InferencingTests)  Time elapsed: 0.136 sec
26-Jun-2018 16:55:12 testMatcher2(org.eclipse.jdt.core.groovy.tests.search.InferencingTests)  Time elapsed: 0.131 sec
26-Jun-2018 16:55:12 testSuperFieldReference(org.eclipse.jdt.core.groovy.tests.search.InferencingTests)  Time elapsed: 0.104 sec
26-Jun-2018 16:55:12 testAssignementInInnerBlock2(org.eclipse.jdt.core.groovy.tests.search.InferencingTests)  Time elapsed: 0.111 sec
26-Jun-2018 16:55:12 testAssignment1(org.eclipse.jdt.core.groovy.tests.search.InferencingTests)  Time elapsed: 0.119 sec
26-Jun-2018 16:55:12 testAssignment2(org.eclipse.jdt.core.groovy.tests.search.InferencingTests)  Time elapsed: 0.113 sec
26-Jun-2018 16:55:12 testAssignment3(org.eclipse.jdt.core.groovy.tests.search.InferencingTests)  Time elapsed: 0.113 sec
26-Jun-2018 16:55:12 testAssignment4(org.eclipse.jdt.core.groovy.tests.search.InferencingTests)  Time elapsed: 0.116 sec
26-Jun-2018 16:55:12 testAssignment5(org.eclipse.jdt.core.groovy.tests.search.InferencingTests)  Time elapsed: 0.127 sec
26-Jun-2018 16:55:12 testStaticMethodCall2(org.eclipse.jdt.core.groovy.tests.search.InferencingTests)  Time elapsed: 0.125 sec
26-Jun-2018 16:55:12 testStaticMethodCall3(org.eclipse.jdt.core.groovy.tests.search.InferencingTests)  Time elapsed: 0.11 sec
26-Jun-2018 16:55:12 testStaticMethodCall4(org.eclipse.jdt.core.groovy.tests.search.InferencingTests)  Time elapsed: 0.115 sec
26-Jun-2018 16:55:12 testStaticMethodCall5(org.eclipse.jdt.core.groovy.tests.search.InferencingTests)  Time elapsed: 0.111 sec
26-Jun-2018 16:55:12 testStaticMethodCall6(org.eclipse.jdt.core.groovy.tests.search.InferencingTests)  Time elapsed: 0.119 sec
26-Jun-2018 16:55:12 testStaticMethodCall7(org.eclipse.jdt.core.groovy.tests.search.InferencingTests)  Time elapsed: 0.122 sec
26-Jun-2018 16:55:12 testStaticMethodCall8(org.eclipse.jdt.core.groovy.tests.search.InferencingTests)  Time elapsed: 0.119 sec
26-Jun-2018 16:55:12 testStaticMethodCall9(org.eclipse.jdt.core.groovy.tests.search.InferencingTests)  Time elapsed: 0.126 sec
26-Jun-2018 16:55:12 testCatchBlock1(org.eclipse.jdt.core.groovy.tests.search.InferencingTests)  Time elapsed: 0.109 sec
26-Jun-2018 16:55:12 testCatchBlock2(org.eclipse.jdt.core.groovy.tests.search.InferencingTests)  Time elapsed: 0.122 sec
26-Jun-2018 16:55:12 testCatchBlock3(org.eclipse.jdt.core.groovy.tests.search.InferencingTests)  Time elapsed: 0.102 sec
26-Jun-2018 16:55:12 testCatchBlock4(org.eclipse.jdt.core.groovy.tests.search.InferencingTests)  Time elapsed: 0.106 sec
26-Jun-2018 16:55:12 testCatchBlock5(org.eclipse.jdt.core.groovy.tests.search.InferencingTests)  Time elapsed: 0.108 sec
26-Jun-2018 16:55:12 testTernaryExpression(org.eclipse.jdt.core.groovy.tests.search.InferencingTests)  Time elapsed: 0.103 sec
26-Jun-2018 16:55:12 testInterfaceMethodAsProperty2(org.eclipse.jdt.core.groovy.tests.search.InferencingTests)  Time elapsed: 0.154 sec
26-Jun-2018 16:55:12 testInterfaceMethodAsProperty3(org.eclipse.jdt.core.groovy.tests.search.InferencingTests)  Time elapsed: 0.149 sec
26-Jun-2018 16:55:12 testGetAt1(org.eclipse.jdt.core.groovy.tests.search.InferencingTests)  Time elapsed: 0.129 sec
26-Jun-2018 16:55:12 testGetAt2(org.eclipse.jdt.core.groovy.tests.search.InferencingTests)  Time elapsed: 0.112 sec
26-Jun-2018 16:55:12 testGetAt3(org.eclipse.jdt.core.groovy.tests.search.InferencingTests)  Time elapsed: 0.109 sec
26-Jun-2018 16:55:12 testGetAt4(org.eclipse.jdt.core.groovy.tests.search.InferencingTests)  Time elapsed: 0.111 sec
26-Jun-2018 16:55:12 testGetAt5(org.eclipse.jdt.core.groovy.tests.search.InferencingTests)  Time elapsed: 0.118 sec
26-Jun-2018 16:55:12 testGetAt6(org.eclipse.jdt.core.groovy.tests.search.InferencingTests)  Time elapsed: 0.124 sec
26-Jun-2018 16:55:12 testGetAt7(org.eclipse.jdt.core.groovy.tests.search.InferencingTests)  Time elapsed: 0.154 sec
26-Jun-2018 16:55:12 testFieldWithInitializer1(org.eclipse.jdt.core.groovy.tests.search.InferencingTests)  Time elapsed: 0.101 sec
26-Jun-2018 16:55:12 testFieldWithInitializer2(org.eclipse.jdt.core.groovy.tests.search.InferencingTests)  Time elapsed: 0.118 sec
26-Jun-2018 16:55:12 testNested1(org.eclipse.jdt.core.groovy.tests.search.InferencingTests)  Time elapsed: 0.097 sec
26-Jun-2018 16:55:12 testNested2(org.eclipse.jdt.core.groovy.tests.search.InferencingTests)  Time elapsed: 0.123 sec
26-Jun-2018 16:55:12 testNested3(org.eclipse.jdt.core.groovy.tests.search.InferencingTests)  Time elapsed: 0.121 sec
26-Jun-2018 16:55:12 testNested4(org.eclipse.jdt.core.groovy.tests.search.InferencingTests)  Time elapsed: 0.109 sec
26-Jun-2018 16:55:12 testIndirectInterfaceConstant(org.eclipse.jdt.core.groovy.tests.search.InferencingTests)  Time elapsed: 0.17 sec
26-Jun-2018 16:55:12 testInstanceOf1(org.eclipse.jdt.core.groovy.tests.search.InferencingTests)  Time elapsed: 0.162 sec
26-Jun-2018 16:55:12 testInstanceOf2(org.eclipse.jdt.core.groovy.tests.search.InferencingTests)  Time elapsed: 0.161 sec
26-Jun-2018 16:55:12 testInstanceOf3(org.eclipse.jdt.core.groovy.tests.search.InferencingTests)  Time elapsed: 0.187 sec
26-Jun-2018 16:55:12 testInstanceOf4(org.eclipse.jdt.core.groovy.tests.search.InferencingTests)  Time elapsed: 0.265 sec
26-Jun-2018 16:55:12 testInstanceOf5(org.eclipse.jdt.core.groovy.tests.search.InferencingTests)  Time elapsed: 0.185 sec
26-Jun-2018 16:55:12 testInstanceOf6(org.eclipse.jdt.core.groovy.tests.search.InferencingTests)  Time elapsed: 0.17 sec
26-Jun-2018 16:55:12 testInstanceOf7(org.eclipse.jdt.core.groovy.tests.search.InferencingTests)  Time elapsed: 0.166 sec
26-Jun-2018 16:55:12 testInstanceOf8(org.eclipse.jdt.core.groovy.tests.search.InferencingTests)  Time elapsed: 0.195 sec
26-Jun-2018 16:55:12 testInstanceOf9(org.eclipse.jdt.core.groovy.tests.search.InferencingTests)  Time elapsed: 0.161 sec
26-Jun-2018 16:55:12 testAnonInner1(org.eclipse.jdt.core.groovy.tests.search.InferencingTests)  Time elapsed: 0.105 sec
26-Jun-2018 16:55:12 testAnonInner2(org.eclipse.jdt.core.groovy.tests.search.InferencingTests)  Time elapsed: 0.105 sec
26-Jun-2018 16:55:12 testAnonInner3(org.eclipse.jdt.core.groovy.tests.search.InferencingTests)  Time elapsed: 0.106 sec
26-Jun-2018 16:55:12 testAnonInner4(org.eclipse.jdt.core.groovy.tests.search.InferencingTests)  Time elapsed: 0.116 sec
26-Jun-2018 16:55:12 testAnonInner5(org.eclipse.jdt.core.groovy.tests.search.InferencingTests)  Time elapsed: 0.107 sec
26-Jun-2018 16:55:12 testAnonInner6(org.eclipse.jdt.core.groovy.tests.search.InferencingTests)  Time elapsed: 0.131 sec
26-Jun-2018 16:55:12 testAnonInner7(org.eclipse.jdt.core.groovy.tests.search.InferencingTests)  Time elapsed: 0.184 sec
26-Jun-2018 16:55:12 testThisInInnerClass1(org.eclipse.jdt.core.groovy.tests.search.InferencingTests)  Time elapsed: 0.131 sec
26-Jun-2018 16:55:12 testNumber1(org.eclipse.jdt.core.groovy.tests.search.InferencingTests)  Time elapsed: 0.104 sec
26-Jun-2018 16:55:12 testNumber2(org.eclipse.jdt.core.groovy.tests.search.InferencingTests)  Time elapsed: 0.101 sec
26-Jun-2018 16:55:12 testNumber3(org.eclipse.jdt.core.groovy.tests.search.InferencingTests)  Time elapsed: 0.105 sec
26-Jun-2018 16:55:12 testNumber4(org.eclipse.jdt.core.groovy.tests.search.InferencingTests)  Time elapsed: 0.104 sec
26-Jun-2018 16:55:12 testNumber5(org.eclipse.jdt.core.groovy.tests.search.InferencingTests)  Time elapsed: 0.102 sec
26-Jun-2018 16:55:12 testNumber6(org.eclipse.jdt.core.groovy.tests.search.InferencingTests)  Time elapsed: 0.111 sec
26-Jun-2018 16:55:12 testSpread1(org.eclipse.jdt.core.groovy.tests.search.InferencingTests)  Time elapsed: 0.124 sec
26-Jun-2018 16:55:12 testSpread2(org.eclipse.jdt.core.groovy.tests.search.InferencingTests)  Time elapsed: 0.105 sec
26-Jun-2018 16:55:12 testSpread3(org.eclipse.jdt.core.groovy.tests.search.InferencingTests)  Time elapsed: 0.103 sec
26-Jun-2018 16:55:12 testSpread4(org.eclipse.jdt.core.groovy.tests.search.InferencingTests)  Time elapsed: 0.103 sec
26-Jun-2018 16:55:12 testSpread5(org.eclipse.jdt.core.groovy.tests.search.InferencingTests)  Time elapsed: 0.109 sec
26-Jun-2018 16:55:12 testSpread6(org.eclipse.jdt.core.groovy.tests.search.InferencingTests)  Time elapsed: 0.109 sec
26-Jun-2018 16:55:12 testSpread7(org.eclipse.jdt.core.groovy.tests.search.InferencingTests)  Time elapsed: 0.106 sec
26-Jun-2018 16:55:12 testSpread8(org.eclipse.jdt.core.groovy.tests.search.InferencingTests)  Time elapsed: 0.115 sec
26-Jun-2018 16:55:12 testSpread9(org.eclipse.jdt.core.groovy.tests.search.InferencingTests)  Time elapsed: 0.104 sec
26-Jun-2018 16:55:12 testPattern1(org.eclipse.jdt.core.groovy.tests.search.InferencingTests)  Time elapsed: 0.103 sec
26-Jun-2018 16:55:12 testPattern2(org.eclipse.jdt.core.groovy.tests.search.InferencingTests)  Time elapsed: 0.109 sec
26-Jun-2018 16:55:12 testString1(org.eclipse.jdt.core.groovy.tests.search.InferencingTests)  Time elapsed: 0.109 sec
26-Jun-2018 16:55:12 testString2(org.eclipse.jdt.core.groovy.tests.search.InferencingTests)  Time elapsed: 0.11 sec
26-Jun-2018 16:55:12 testString3(org.eclipse.jdt.core.groovy.tests.search.InferencingTests)  Time elapsed: 0.109 sec
26-Jun-2018 16:55:12 testString4(org.eclipse.jdt.core.groovy.tests.search.InferencingTests)  Time elapsed: 0.113 sec
26-Jun-2018 16:55:12 testStaticMethodCall(org.eclipse.jdt.core.groovy.tests.search.InferencingTests)  Time elapsed: 0.125 sec
26-Jun-2018 16:55:12 testClassReference1(org.eclipse.jdt.core.groovy.tests.search.InferencingTests)  Time elapsed: 0.116 sec
26-Jun-2018 16:55:12 testClassReference2(org.eclipse.jdt.core.groovy.tests.search.InferencingTests)  Time elapsed: 0.117 sec
26-Jun-2018 16:55:12 testClassReference3(org.eclipse.jdt.core.groovy.tests.search.InferencingTests)  Time elapsed: 0.137 sec
26-Jun-2018 16:55:12 testClassReference4(org.eclipse.jdt.core.groovy.tests.search.InferencingTests)  Time elapsed: 0.114 sec
26-Jun-2018 16:55:12 testPropertyNodeFromJava1(org.eclipse.jdt.core.groovy.tests.search.JDTPropertyNodeInferencingTests)  Time elapsed: 0.122 sec
26-Jun-2018 16:55:12 testPropertyNodeFromJava2(org.eclipse.jdt.core.groovy.tests.search.JDTPropertyNodeInferencingTests)  Time elapsed: 0.125 sec
26-Jun-2018 16:55:12 testPropertyNodeFromJava3(org.eclipse.jdt.core.groovy.tests.search.JDTPropertyNodeInferencingTests)  Time elapsed: 0.116 sec
26-Jun-2018 16:55:12 testPropertyNodeFromJava4(org.eclipse.jdt.core.groovy.tests.search.JDTPropertyNodeInferencingTests)  Time elapsed: 0.113 sec
26-Jun-2018 16:55:12 testNodeFromJava1(org.eclipse.jdt.core.groovy.tests.search.JDTPropertyNodeInferencingTests)  Time elapsed: 0.121 sec
26-Jun-2018 16:55:12 testPropertyNodeReferenceInBinary1(org.eclipse.jdt.core.groovy.tests.search.JDTPropertyNodeInferencingTests)  Time elapsed: 0.117 sec
26-Jun-2018 16:55:12 testvarReferenceInGString1(org.eclipse.jdt.core.groovy.tests.search.LocalVariableReferenceSearchTests)  Time elapsed: 0.139 sec
26-Jun-2018 16:55:12 testvarReferenceInGString2(org.eclipse.jdt.core.groovy.tests.search.LocalVariableReferenceSearchTests)  Time elapsed: 0.142 sec
26-Jun-2018 16:55:12 testvarReferenceInGString3(org.eclipse.jdt.core.groovy.tests.search.LocalVariableReferenceSearchTests)  Time elapsed: 0.104 sec
26-Jun-2018 16:55:12 testvarReferenceInGString4(org.eclipse.jdt.core.groovy.tests.search.LocalVariableReferenceSearchTests)  Time elapsed: 0.138 sec
26-Jun-2018 16:55:12 testvarReferenceInGString5(org.eclipse.jdt.core.groovy.tests.search.LocalVariableReferenceSearchTests)  Time elapsed: 0.108 sec
26-Jun-2018 16:55:12 testvarReference1(org.eclipse.jdt.core.groovy.tests.search.LocalVariableReferenceSearchTests)  Time elapsed: 0.119 sec
26-Jun-2018 16:55:12 testvarReference2(org.eclipse.jdt.core.groovy.tests.search.LocalVariableReferenceSearchTests)  Time elapsed: 0.114 sec
26-Jun-2018 16:55:12 testvarReference3(org.eclipse.jdt.core.groovy.tests.search.LocalVariableReferenceSearchTests)  Time elapsed: 0.114 sec
26-Jun-2018 16:55:12 testvarReference4(org.eclipse.jdt.core.groovy.tests.search.LocalVariableReferenceSearchTests)  Time elapsed: 0.108 sec
26-Jun-2018 16:55:12 testvarReference5(org.eclipse.jdt.core.groovy.tests.search.LocalVariableReferenceSearchTests)  Time elapsed: 0.116 sec
26-Jun-2018 16:55:12 testvarReference6(org.eclipse.jdt.core.groovy.tests.search.LocalVariableReferenceSearchTests)  Time elapsed: 0.136 sec
26-Jun-2018 16:55:12 testvarReference7(org.eclipse.jdt.core.groovy.tests.search.LocalVariableReferenceSearchTests)  Time elapsed: 0.113 sec
26-Jun-2018 16:55:12 testvarReference8(org.eclipse.jdt.core.groovy.tests.search.LocalVariableReferenceSearchTests)  Time elapsed: 0.109 sec
26-Jun-2018 16:55:12 testvarReference9(org.eclipse.jdt.core.groovy.tests.search.LocalVariableReferenceSearchTests)  Time elapsed: 0.114 sec
26-Jun-2018 16:55:12 testvarReference10(org.eclipse.jdt.core.groovy.tests.search.LocalVariableReferenceSearchTests)  Time elapsed: 0.102 sec
26-Jun-2018 16:55:12 testConstructorReferenceSearch(org.eclipse.jdt.core.groovy.tests.search.MethodReferenceSearchTests)  Time elapsed: 0.21 sec
26-Jun-2018 16:55:12 testOverloadedMethodReferences1(org.eclipse.jdt.core.groovy.tests.search.MethodReferenceSearchTests)  Time elapsed: 0.187 sec
26-Jun-2018 16:55:12 testOverloadedMethodReferences2(org.eclipse.jdt.core.groovy.tests.search.MethodReferenceSearchTests)  Time elapsed: 0.22 sec
26-Jun-2018 16:55:12 testOverloadedMethodReferences3(org.eclipse.jdt.core.groovy.tests.search.MethodReferenceSearchTests)  Time elapsed: 0.208 sec
26-Jun-2018 16:55:12 testOverloadedMethodReferences4(org.eclipse.jdt.core.groovy.tests.search.MethodReferenceSearchTests)  Time elapsed: 0.222 sec
26-Jun-2018 16:55:12 testOverloadedMethodReferences5(org.eclipse.jdt.core.groovy.tests.search.MethodReferenceSearchTests)  Time elapsed: 0.28 sec
26-Jun-2018 16:55:12 testOverloadedMethodReferences6(org.eclipse.jdt.core.groovy.tests.search.MethodReferenceSearchTests)  Time elapsed: 0.266 sec
26-Jun-2018 16:55:12 testStaticMethodReferenceSearch(org.eclipse.jdt.core.groovy.tests.search.MethodReferenceSearchTests)  Time elapsed: 0.109 sec
26-Jun-2018 16:55:12 testMethodReferencesInClass1(org.eclipse.jdt.core.groovy.tests.search.MethodReferenceSearchTests)  Time elapsed: 0.203 sec
26-Jun-2018 16:55:12 testMethodReferencesInClass2(org.eclipse.jdt.core.groovy.tests.search.MethodReferenceSearchTests)  Time elapsed: 0.216 sec
26-Jun-2018 16:55:12 testMethodReferencesInClass3(org.eclipse.jdt.core.groovy.tests.search.MethodReferenceSearchTests)  Time elapsed: 0.204 sec
26-Jun-2018 16:55:12 testMethodReferencesInClass4(org.eclipse.jdt.core.groovy.tests.search.MethodReferenceSearchTests)  Time elapsed: 0.227 sec
26-Jun-2018 16:55:12 testGenericsMethodReferenceSearch(org.eclipse.jdt.core.groovy.tests.search.MethodReferenceSearchTests)  Time elapsed: 0.2 sec
26-Jun-2018 16:55:12 testMethodReferencesInScript1GRE_1180(org.eclipse.jdt.core.groovy.tests.search.MethodReferenceSearchTests)  Time elapsed: 0.217 sec
26-Jun-2018 16:55:12 testMethodReferencesInScript1(org.eclipse.jdt.core.groovy.tests.search.MethodReferenceSearchTests)  Time elapsed: 0.22 sec
26-Jun-2018 16:55:12 testMethodReferencesInScript2(org.eclipse.jdt.core.groovy.tests.search.MethodReferenceSearchTests)  Time elapsed: 0.203 sec
26-Jun-2018 16:55:12 testMethodReferencesInScript3(org.eclipse.jdt.core.groovy.tests.search.MethodReferenceSearchTests)  Time elapsed: 0.213 sec
26-Jun-2018 16:55:12 testMethodReferencesInScript4(org.eclipse.jdt.core.groovy.tests.search.MethodReferenceSearchTests)  Time elapsed: 0.212 sec
26-Jun-2018 16:55:12 testMethodReferencesInScript5(org.eclipse.jdt.core.groovy.tests.search.MethodReferenceSearchTests)  Time elapsed: 0.211 sec
26-Jun-2018 16:55:12 testMethodReferencesInScript6(org.eclipse.jdt.core.groovy.tests.search.MethodReferenceSearchTests)  Time elapsed: 0.207 sec
26-Jun-2018 16:55:12 testMethodReferencesInScript7(org.eclipse.jdt.core.groovy.tests.search.MethodReferenceSearchTests)  Time elapsed: 0.219 sec
26-Jun-2018 16:55:12 testMethodReferencesInScript8(org.eclipse.jdt.core.groovy.tests.search.MethodReferenceSearchTests)  Time elapsed: 0.213 sec
26-Jun-2018 16:55:12 testMethodWithDefaultParameters1(org.eclipse.jdt.core.groovy.tests.search.MethodReferenceSearchTests)  Time elapsed: 0.223 sec
26-Jun-2018 16:55:12 testMethodWithDefaultParameters2(org.eclipse.jdt.core.groovy.tests.search.MethodReferenceSearchTests)  Time elapsed: 0.233 sec
26-Jun-2018 16:55:12 testRightShift(org.eclipse.jdt.core.groovy.tests.search.OperatorOverloadingInferencingTests)  Time elapsed: 0.115 sec
26-Jun-2018 16:55:12 testLeftShift(org.eclipse.jdt.core.groovy.tests.search.OperatorOverloadingInferencingTests)  Time elapsed: 0.104 sec
26-Jun-2018 16:55:12 testAnd(org.eclipse.jdt.core.groovy.tests.search.OperatorOverloadingInferencingTests)  Time elapsed: 0.112 sec
26-Jun-2018 16:55:12 testMod(org.eclipse.jdt.core.groovy.tests.search.OperatorOverloadingInferencingTests)  Time elapsed: 0.12 sec
26-Jun-2018 16:55:12 testXor(org.eclipse.jdt.core.groovy.tests.search.OperatorOverloadingInferencingTests)  Time elapsed: 0.116 sec
26-Jun-2018 16:55:12 testPlus1(org.eclipse.jdt.core.groovy.tests.search.OperatorOverloadingInferencingTests)  Time elapsed: 0.118 sec
26-Jun-2018 16:55:12 testPlus2(org.eclipse.jdt.core.groovy.tests.search.OperatorOverloadingInferencingTests)  Time elapsed: 0.12 sec
26-Jun-2018 16:55:12 testPlus3(org.eclipse.jdt.core.groovy.tests.search.OperatorOverloadingInferencingTests)  Time elapsed: 0.128 sec
26-Jun-2018 16:55:12 testOr(org.eclipse.jdt.core.groovy.tests.search.OperatorOverloadingInferencingTests)  Time elapsed: 0.102 sec
26-Jun-2018 16:55:12 testPrefix1(org.eclipse.jdt.core.groovy.tests.search.OperatorOverloadingInferencingTests)  Time elapsed: 0.101 sec
26-Jun-2018 16:55:12 testPrefix2(org.eclipse.jdt.core.groovy.tests.search.OperatorOverloadingInferencingTests)  Time elapsed: 0.107 sec
26-Jun-2018 16:55:12 testPrefix3(org.eclipse.jdt.core.groovy.tests.search.OperatorOverloadingInferencingTests)  Time elapsed: 0.108 sec
26-Jun-2018 16:55:12 testPrefix4(org.eclipse.jdt.core.groovy.tests.search.OperatorOverloadingInferencingTests)  Time elapsed: 0.126 sec
26-Jun-2018 16:55:12 testPrefix5(org.eclipse.jdt.core.groovy.tests.search.OperatorOverloadingInferencingTests)  Time elapsed: 0.099 sec
26-Jun-2018 16:55:12 testPrefix6(org.eclipse.jdt.core.groovy.tests.search.OperatorOverloadingInferencingTests)  Time elapsed: 0.111 sec
26-Jun-2018 16:55:12 testLongExpr1(org.eclipse.jdt.core.groovy.tests.search.OperatorOverloadingInferencingTests)  Time elapsed: 0.11 sec
26-Jun-2018 16:55:12 testLongExpr2(org.eclipse.jdt.core.groovy.tests.search.OperatorOverloadingInferencingTests)  Time elapsed: 0.108 sec
26-Jun-2018 16:55:12 testLongExpr3(org.eclipse.jdt.core.groovy.tests.search.OperatorOverloadingInferencingTests)  Time elapsed: 0.107 sec
26-Jun-2018 16:55:12 testAttributeExpr1(org.eclipse.jdt.core.groovy.tests.search.OperatorOverloadingInferencingTests)  Time elapsed: 0.108 sec
26-Jun-2018 16:55:12 testAttributeExpr2(org.eclipse.jdt.core.groovy.tests.search.OperatorOverloadingInferencingTests)  Time elapsed: 0.104 sec
26-Jun-2018 16:55:12 testDivide(org.eclipse.jdt.core.groovy.tests.search.OperatorOverloadingInferencingTests)  Time elapsed: 0.108 sec
26-Jun-2018 16:55:12 testMultiply(org.eclipse.jdt.core.groovy.tests.search.OperatorOverloadingInferencingTests)  Time elapsed: 0.123 sec
26-Jun-2018 16:55:12 testGetAt1(org.eclipse.jdt.core.groovy.tests.search.OperatorOverloadingInferencingTests)  Time elapsed: 0.107 sec
26-Jun-2018 16:55:12 testGetAt2(org.eclipse.jdt.core.groovy.tests.search.OperatorOverloadingInferencingTests)  Time elapsed: 0.11 sec
26-Jun-2018 16:55:12 testGetAt3(org.eclipse.jdt.core.groovy.tests.search.OperatorOverloadingInferencingTests)  Time elapsed: 0.107 sec
26-Jun-2018 16:55:12 testGetAt4(org.eclipse.jdt.core.groovy.tests.search.OperatorOverloadingInferencingTests)  Time elapsed: 0.111 sec
26-Jun-2018 16:55:12 testGetAt5(org.eclipse.jdt.core.groovy.tests.search.OperatorOverloadingInferencingTests)  Time elapsed: 0.108 sec
26-Jun-2018 16:55:12 testGetAt6(org.eclipse.jdt.core.groovy.tests.search.OperatorOverloadingInferencingTests)  Time elapsed: 0.11 sec
26-Jun-2018 16:55:12 testGetAt7(org.eclipse.jdt.core.groovy.tests.search.OperatorOverloadingInferencingTests)  Time elapsed: 0.111 sec
26-Jun-2018 16:55:12 testGetAt8(org.eclipse.jdt.core.groovy.tests.search.OperatorOverloadingInferencingTests)  Time elapsed: 0.118 sec
26-Jun-2018 16:55:12 testGetAt9(org.eclipse.jdt.core.groovy.tests.search.OperatorOverloadingInferencingTests)  Time elapsed: 0.13 sec
26-Jun-2018 16:55:12 testPostfix1(org.eclipse.jdt.core.groovy.tests.search.OperatorOverloadingInferencingTests)  Time elapsed: 0.111 sec
26-Jun-2018 16:55:12 testPostfix2(org.eclipse.jdt.core.groovy.tests.search.OperatorOverloadingInferencingTests)  Time elapsed: 0.1 sec
26-Jun-2018 16:55:12 testMinus1(org.eclipse.jdt.core.groovy.tests.search.OperatorOverloadingInferencingTests)  Time elapsed: 0.116 sec
26-Jun-2018 16:55:12 testMinus2(org.eclipse.jdt.core.groovy.tests.search.OperatorOverloadingInferencingTests)  Time elapsed: 0.102 sec
26-Jun-2018 16:55:12 testNumberPlusString1(org.eclipse.jdt.core.groovy.tests.search.OperatorOverloadingInferencingTests)  Time elapsed: 0.11 sec
26-Jun-2018 16:55:12 testNumberPlusString2(org.eclipse.jdt.core.groovy.tests.search.OperatorOverloadingInferencingTests)  Time elapsed: 0.103 sec
26-Jun-2018 16:55:12 testCompleteExpr1(org.eclipse.jdt.core.groovy.tests.search.OperatorOverloadingInferencingTests)  Time elapsed: 0.105 sec
26-Jun-2018 16:55:12 testCompleteExpr2(org.eclipse.jdt.core.groovy.tests.search.OperatorOverloadingInferencingTests)  Time elapsed: 0.101 sec
26-Jun-2018 16:55:12 testCompleteExpr3(org.eclipse.jdt.core.groovy.tests.search.OperatorOverloadingInferencingTests)  Time elapsed: 0.102 sec
26-Jun-2018 16:55:12 testCompleteExpr4(org.eclipse.jdt.core.groovy.tests.search.OperatorOverloadingInferencingTests)  Time elapsed: 0.108 sec
26-Jun-2018 16:55:12 testCompleteExpr5(org.eclipse.jdt.core.groovy.tests.search.OperatorOverloadingInferencingTests)  Time elapsed: 0.109 sec
26-Jun-2018 16:55:12 testCompleteExpr6(org.eclipse.jdt.core.groovy.tests.search.OperatorOverloadingInferencingTests)  Time elapsed: 0.125 sec
26-Jun-2018 16:55:12 testCompleteExpr7(org.eclipse.jdt.core.groovy.tests.search.OperatorOverloadingInferencingTests)  Time elapsed: 0.104 sec
26-Jun-2018 16:55:12 testCompleteExpr8(org.eclipse.jdt.core.groovy.tests.search.OperatorOverloadingInferencingTests)  Time elapsed: 0.103 sec
26-Jun-2018 16:55:12 testNonStaticReference1(org.eclipse.jdt.core.groovy.tests.search.StaticInferencingTests)  Time elapsed: 0.106 sec
26-Jun-2018 16:55:12 testNonStaticReference2(org.eclipse.jdt.core.groovy.tests.search.StaticInferencingTests)  Time elapsed: 0.106 sec
26-Jun-2018 16:55:12 testNonStaticReference3(org.eclipse.jdt.core.groovy.tests.search.StaticInferencingTests)  Time elapsed: 0.128 sec
26-Jun-2018 16:55:12 testNonStaticReference4(org.eclipse.jdt.core.groovy.tests.search.StaticInferencingTests)  Time elapsed: 0.11 sec
26-Jun-2018 16:55:12 testNonStaticReference5(org.eclipse.jdt.core.groovy.tests.search.StaticInferencingTests)  Time elapsed: 0.106 sec
26-Jun-2018 16:55:12 testNonStaticReference6(org.eclipse.jdt.core.groovy.tests.search.StaticInferencingTests)  Time elapsed: 0.112 sec
26-Jun-2018 16:55:12 testNonStaticReference7(org.eclipse.jdt.core.groovy.tests.search.StaticInferencingTests)  Time elapsed: 0.095 sec
26-Jun-2018 16:55:12 testNonStaticReference8(org.eclipse.jdt.core.groovy.tests.search.StaticInferencingTests)  Time elapsed: 0.109 sec
26-Jun-2018 16:55:12 testStaticReference1(org.eclipse.jdt.core.groovy.tests.search.StaticInferencingTests)  Time elapsed: 0.111 sec
26-Jun-2018 16:55:12 testStaticImport1(org.eclipse.jdt.core.groovy.tests.search.StaticInferencingTests)  Time elapsed: 0.128 sec
26-Jun-2018 16:55:12 testStaticImport2(org.eclipse.jdt.core.groovy.tests.search.StaticInferencingTests)  Time elapsed: 0.106 sec
26-Jun-2018 16:55:12 testStaticImport3(org.eclipse.jdt.core.groovy.tests.search.StaticInferencingTests)  Time elapsed: 0.126 sec
26-Jun-2018 16:55:12 testStaticImport4(org.eclipse.jdt.core.groovy.tests.search.StaticInferencingTests)  Time elapsed: 0.136 sec
26-Jun-2018 16:55:12 testStaticImport5(org.eclipse.jdt.core.groovy.tests.search.StaticInferencingTests)  Time elapsed: 0.121 sec
26-Jun-2018 16:55:12 testStaticImport6(org.eclipse.jdt.core.groovy.tests.search.StaticInferencingTests)  Time elapsed: 0.151 sec
26-Jun-2018 16:55:12 testStaticImport7(org.eclipse.jdt.core.groovy.tests.search.StaticInferencingTests)  Time elapsed: 0.115 sec
26-Jun-2018 16:55:12 testStaticImport8(org.eclipse.jdt.core.groovy.tests.search.StaticInferencingTests)  Time elapsed: 0.121 sec
26-Jun-2018 16:55:12 testStaticImport9(org.eclipse.jdt.core.groovy.tests.search.StaticInferencingTests)  Time elapsed: 0.118 sec
26-Jun-2018 16:55:12 testSTCAndClassInstance(org.eclipse.jdt.core.groovy.tests.search.StaticInferencingTests)  Time elapsed: 0.11 sec
26-Jun-2018 16:55:12 testClassReference10(org.eclipse.jdt.core.groovy.tests.search.StaticInferencingTests)  Time elapsed: 0.122 sec
26-Jun-2018 16:55:12 testClassReference11(org.eclipse.jdt.core.groovy.tests.search.StaticInferencingTests)  Time elapsed: 0.118 sec
26-Jun-2018 16:55:12 testClassReference12(org.eclipse.jdt.core.groovy.tests.search.StaticInferencingTests)  Time elapsed: 0.114 sec
26-Jun-2018 16:55:12 testClassReference13(org.eclipse.jdt.core.groovy.tests.search.StaticInferencingTests)  Time elapsed: 0.118 sec
26-Jun-2018 16:55:12 testClassReference14(org.eclipse.jdt.core.groovy.tests.search.StaticInferencingTests)  Time elapsed: 0.107 sec
26-Jun-2018 16:55:12 testClassReference15(org.eclipse.jdt.core.groovy.tests.search.StaticInferencingTests)  Time elapsed: 0.125 sec
26-Jun-2018 16:55:12 testClassReference4a(org.eclipse.jdt.core.groovy.tests.search.StaticInferencingTests)  Time elapsed: 0.106 sec
26-Jun-2018 16:55:12 testClassReference1(org.eclipse.jdt.core.groovy.tests.search.StaticInferencingTests)  Time elapsed: 0.112 sec
26-Jun-2018 16:55:12 testClassReference2(org.eclipse.jdt.core.groovy.tests.search.StaticInferencingTests)  Time elapsed: 0.111 sec
26-Jun-2018 16:55:12 testClassReference3(org.eclipse.jdt.core.groovy.tests.search.StaticInferencingTests)  Time elapsed: 0.11 sec
26-Jun-2018 16:55:12 testClassReference4(org.eclipse.jdt.core.groovy.tests.search.StaticInferencingTests)  Time elapsed: 0.112 sec
26-Jun-2018 16:55:12 testClassReference5(org.eclipse.jdt.core.groovy.tests.search.StaticInferencingTests)  Time elapsed: 0.11 sec
26-Jun-2018 16:55:12 testClassReference6(org.eclipse.jdt.core.groovy.tests.search.StaticInferencingTests)  Time elapsed: 0.106 sec
26-Jun-2018 16:55:12 testClassReference7(org.eclipse.jdt.core.groovy.tests.search.StaticInferencingTests)  Time elapsed: 0.106 sec
26-Jun-2018 16:55:12 testClassReference8(org.eclipse.jdt.core.groovy.tests.search.StaticInferencingTests)  Time elapsed: 0.107 sec
26-Jun-2018 16:55:12 testClassReference9(org.eclipse.jdt.core.groovy.tests.search.StaticInferencingTests)  Time elapsed: 0.107 sec
26-Jun-2018 16:55:12 testSyntheticAccessors1(org.eclipse.jdt.core.groovy.tests.search.SyntheticAccessorInferencingTests)  Time elapsed: 0.132 sec
26-Jun-2018 16:55:12 testSyntheticAccessors2(org.eclipse.jdt.core.groovy.tests.search.SyntheticAccessorInferencingTests)  Time elapsed: 0.152 sec
26-Jun-2018 16:55:12 testSyntheticAccessors3(org.eclipse.jdt.core.groovy.tests.search.SyntheticAccessorInferencingTests)  Time elapsed: 0.136 sec
26-Jun-2018 16:55:12 testSyntheticAccessors4(org.eclipse.jdt.core.groovy.tests.search.SyntheticAccessorInferencingTests)  Time elapsed: 1.248 sec
26-Jun-2018 16:55:12 testFindClassDeclarationWithPattern(org.eclipse.jdt.core.groovy.tests.search.TypeReferenceSearchTests)  Time elapsed: 0.625 sec
26-Jun-2018 16:55:12 testInnerTypes1(org.eclipse.jdt.core.groovy.tests.search.TypeReferenceSearchTests)  Time elapsed: 1.027 sec
26-Jun-2018 16:55:12 testInnerTypes2(org.eclipse.jdt.core.groovy.tests.search.TypeReferenceSearchTests)  Time elapsed: 1.025 sec
26-Jun-2018 16:55:12 testInnerTypes3(org.eclipse.jdt.core.groovy.tests.search.TypeReferenceSearchTests)  Time elapsed: 1.044 sec
26-Jun-2018 16:55:12 testSearchForTypesScript1(org.eclipse.jdt.core.groovy.tests.search.TypeReferenceSearchTests)  Time elapsed: 0.12 sec
26-Jun-2018 16:55:12 testSearchForTypesScript2(org.eclipse.jdt.core.groovy.tests.search.TypeReferenceSearchTests)  Time elapsed: 0.125 sec
26-Jun-2018 16:55:12 testSearchForTypesScript3(org.eclipse.jdt.core.groovy.tests.search.TypeReferenceSearchTests)  Time elapsed: 0.12 sec
26-Jun-2018 16:55:12 testSearchForTypesScript4(org.eclipse.jdt.core.groovy.tests.search.TypeReferenceSearchTests)  Time elapsed: 0.142 sec
26-Jun-2018 16:55:12 testSearchForTypesScript5(org.eclipse.jdt.core.groovy.tests.search.TypeReferenceSearchTests)  Time elapsed: 0.111 sec
26-Jun-2018 16:55:12 testSearchForTypesScript6(org.eclipse.jdt.core.groovy.tests.search.TypeReferenceSearchTests)  Time elapsed: 0.121 sec
26-Jun-2018 16:55:12 testShouldntFindClassDeclarationInScript(org.eclipse.jdt.core.groovy.tests.search.TypeReferenceSearchTests)  Time elapsed: 0.108 sec
26-Jun-2018 16:55:12 testSearchForTypesArray1(org.eclipse.jdt.core.groovy.tests.search.TypeReferenceSearchTests)  Time elapsed: 0.136 sec
26-Jun-2018 16:55:12 testSearchForTypesClass1(org.eclipse.jdt.core.groovy.tests.search.TypeReferenceSearchTests)  Time elapsed: 0.123 sec
26-Jun-2018 16:55:12 testSearchForTypesClass2(org.eclipse.jdt.core.groovy.tests.search.TypeReferenceSearchTests)  Time elapsed: 0.127 sec
26-Jun-2018 16:55:12 testSearchForTypesClass3(org.eclipse.jdt.core.groovy.tests.search.TypeReferenceSearchTests)  Time elapsed: 0.124 sec
26-Jun-2018 16:55:12 testSearchForTypesClass4(org.eclipse.jdt.core.groovy.tests.search.TypeReferenceSearchTests)  Time elapsed: 0.118 sec
26-Jun-2018 16:55:12 testSearchForTypesClass5(org.eclipse.jdt.core.groovy.tests.search.TypeReferenceSearchTests)  Time elapsed: 0.122 sec
26-Jun-2018 16:55:12 testSearchForTypesClass6(org.eclipse.jdt.core.groovy.tests.search.TypeReferenceSearchTests)  Time elapsed: 0.119 sec
26-Jun-2018 16:55:12 testSearchForTypesClass7(org.eclipse.jdt.core.groovy.tests.search.TypeReferenceSearchTests)  Time elapsed: 0.156 sec
26-Jun-2018 16:55:12 testSearchForTypesClosure1(org.eclipse.jdt.core.groovy.tests.search.TypeReferenceSearchTests)  Time elapsed: 0.125 sec
26-Jun-2018 16:55:12 testSearchForTypesClosure2(org.eclipse.jdt.core.groovy.tests.search.TypeReferenceSearchTests)  Time elapsed: 0.126 sec
26-Jun-2018 16:55:12 testSearchForTypesClosure3(org.eclipse.jdt.core.groovy.tests.search.TypeReferenceSearchTests)  Time elapsed: 0.123 sec
26-Jun-2018 16:55:12 testFindClassDeclaration(org.eclipse.jdt.core.groovy.tests.search.TypeReferenceSearchTests)  Time elapsed: 0.113 sec
26-Jun-2018 16:55:12 testConstructorWithDefaultArgsInCompileStatic(org.eclipse.jdt.core.groovy.tests.search.TypeReferenceSearchTests)  Time elapsed: 0.676 sec
26-Jun-2018 16:55:12
26-Jun-2018 16:55:12 Results :
26-Jun-2018 16:55:12
26-Jun-2018 16:55:12 Tests run: 5041, Failures: 0, Errors: 0, Skipped: 167
26-Jun-2018 16:55:12
26-Jun-2018 16:55:13
26-Jun-2018 16:55:13 !ENTRY org.eclipse.e4.ui.workbench.swt 4 2 2018-06-26 16:55:13.696
26-Jun-2018 16:55:13 !MESSAGE Problems occurred when invoking code from plug-in: "org.eclipse.e4.ui.workbench.swt".
26-Jun-2018 16:55:13 !STACK 0
26-Jun-2018 16:55:13 org.eclipse.e4.core.di.InjectionException: org.eclipse.swt.SWTException: Widget is disposed
26-Jun-2018 16:55:13         at org.eclipse.e4.core.internal.di.MethodRequestor.execute(MethodRequestor.java:62)
26-Jun-2018 16:55:13         at org.eclipse.e4.core.internal.di.InjectorImpl.processAnnotated(InjectorImpl.java:888)
26-Jun-2018 16:55:13         at org.eclipse.e4.core.internal.di.InjectorImpl.disposed(InjectorImpl.java:390)
26-Jun-2018 16:55:13         at org.eclipse.e4.core.internal.di.Requestor.disposed(Requestor.java:143)
26-Jun-2018 16:55:13         at org.eclipse.e4.core.internal.contexts.ContextObjectSupplier$ContextInjectionListener.update(ContextObjectSupplier.java:76)
26-Jun-2018 16:55:13         at org.eclipse.e4.core.internal.contexts.TrackableComputationExt.update(TrackableComputationExt.java:107)
26-Jun-2018 16:55:13         at org.eclipse.e4.core.internal.contexts.TrackableComputationExt.handleInvalid(TrackableComputationExt.java:70)
26-Jun-2018 16:55:13         at org.eclipse.e4.core.internal.contexts.EclipseContext.dispose(EclipseContext.java:175)
26-Jun-2018 16:55:13         at org.eclipse.e4.ui.internal.workbench.swt.PartRenderingEngine.clearContext(PartRenderingEngine.java:974)
26-Jun-2018 16:55:13         at org.eclipse.e4.ui.internal.workbench.swt.PartRenderingEngine.safeRemoveGui(PartRenderingEngine.java:954)
26-Jun-2018 16:55:13         at org.eclipse.e4.ui.internal.workbench.swt.PartRenderingEngine.access$3(PartRenderingEngine.java:862)
26-Jun-2018 16:55:13         at org.eclipse.e4.ui.internal.workbench.swt.PartRenderingEngine$8.run(PartRenderingEngine.java:857)
26-Jun-2018 16:55:13         at org.eclipse.core.runtime.SafeRunner.run(SafeRunner.java:42)
26-Jun-2018 16:55:13         at org.eclipse.e4.ui.internal.workbench.swt.PartRenderingEngine.removeGui(PartRenderingEngine.java:841)
26-Jun-2018 16:55:13         at org.eclipse.e4.ui.internal.workbench.swt.PartRenderingEngine.stop(PartRenderingEngine.java:1220)
26-Jun-2018 16:55:13         at org.eclipse.e4.ui.internal.workbench.E4Workbench.close(E4Workbench.java:184)
26-Jun-2018 16:55:13         at org.eclipse.e4.ui.internal.workbench.swt.E4Testable$2.run(E4Testable.java:130)
26-Jun-2018 16:55:13         at org.eclipse.swt.widgets.RunnableLock.run(RunnableLock.java:35)
26-Jun-2018 16:55:13         at org.eclipse.swt.widgets.Synchronizer.runAsyncMessages(Synchronizer.java:136)
26-Jun-2018 16:55:13         at org.eclipse.swt.widgets.Display.runAsyncMessages(Display.java:3774)
26-Jun-2018 16:55:13         at org.eclipse.swt.widgets.Display.readAndDispatch(Display.java:3412)
26-Jun-2018 16:55:13         at org.eclipse.e4.ui.internal.workbench.swt.PartRenderingEngine$9.run(PartRenderingEngine.java:1151)
26-Jun-2018 16:55:13         at org.eclipse.core.databinding.observable.Realm.runWithDefault(Realm.java:332)
26-Jun-2018 16:55:13         at org.eclipse.e4.ui.internal.workbench.swt.PartRenderingEngine.run(PartRenderingEngine.java:1032)
26-Jun-2018 16:55:13         at org.eclipse.e4.ui.internal.workbench.E4Workbench.createAndRunUI(E4Workbench.java:148)
26-Jun-2018 16:55:13         at org.eclipse.ui.internal.Workbench$5.run(Workbench.java:636)
26-Jun-2018 16:55:13         at org.eclipse.core.databinding.observable.Realm.runWithDefault(Realm.java:332)
26-Jun-2018 16:55:13         at org.eclipse.ui.internal.Workbench.createAndRunWorkbench(Workbench.java:579)
26-Jun-2018 16:55:13         at org.eclipse.ui.PlatformUI.createAndRunWorkbench(PlatformUI.java:150)
26-Jun-2018 16:55:13         at org.eclipse.ui.internal.ide.application.IDEApplication.start(IDEApplication.java:135)
26-Jun-2018 16:55:13         at org.eclipse.tycho.surefire.osgibooter.UITestApplication.runApplication(UITestApplication.java:31)
26-Jun-2018 16:55:13         at org.eclipse.tycho.surefire.osgibooter.AbstractUITestApplication.run(AbstractUITestApplication.java:120)
26-Jun-2018 16:55:13         at org.eclipse.tycho.surefire.osgibooter.UITestApplication.start(UITestApplication.java:37)
26-Jun-2018 16:55:13         at org.eclipse.equinox.internal.app.EclipseAppHandle.run(EclipseAppHandle.java:196)
26-Jun-2018 16:55:13         at org.eclipse.core.runtime.internal.adaptor.EclipseAppLauncher.runApplication(EclipseAppLauncher.java:134)
26-Jun-2018 16:55:13         at org.eclipse.core.runtime.internal.adaptor.EclipseAppLauncher.start(EclipseAppLauncher.java:104)
26-Jun-2018 16:55:13         at org.eclipse.core.runtime.adaptor.EclipseStarter.run(EclipseStarter.java:380)
26-Jun-2018 16:55:13         at org.eclipse.core.runtime.adaptor.EclipseStarter.run(EclipseStarter.java:235)
26-Jun-2018 16:55:13         at sun.reflect.NativeMethodAccessorImpl.invoke0(Native Method)
26-Jun-2018 16:55:13         at sun.reflect.NativeMethodAccessorImpl.invoke(NativeMethodAccessorImpl.java:57)
26-Jun-2018 16:55:13         at sun.reflect.DelegatingMethodAccessorImpl.invoke(DelegatingMethodAccessorImpl.java:43)
26-Jun-2018 16:55:13         at java.lang.reflect.Method.invoke(Method.java:606)
26-Jun-2018 16:55:13         at org.eclipse.equinox.launcher.Main.invokeFramework(Main.java:648)
26-Jun-2018 16:55:13         at org.eclipse.equinox.launcher.Main.basicRun(Main.java:603)
26-Jun-2018 16:55:13         at org.eclipse.equinox.launcher.Main.run(Main.java:1465)
26-Jun-2018 16:55:13         at org.eclipse.equinox.launcher.Main.main(Main.java:1438)
26-Jun-2018 16:55:13 Caused by: org.eclipse.swt.SWTException: Widget is disposed
26-Jun-2018 16:55:13         at org.eclipse.swt.SWT.error(SWT.java:4441)
26-Jun-2018 16:55:13         at org.eclipse.swt.SWT.error(SWT.java:4356)
26-Jun-2018 16:55:13         at org.eclipse.swt.SWT.error(SWT.java:4327)
26-Jun-2018 16:55:13         at org.eclipse.swt.widgets.Widget.error(Widget.java:476)
26-Jun-2018 16:55:13         at org.eclipse.swt.widgets.Widget.checkWidget(Widget.java:413)
26-Jun-2018 16:55:13         at org.eclipse.swt.widgets.Shell.getSize(Shell.java:1111)
26-Jun-2018 16:55:13         at org.eclipse.ui.internal.quickaccess.SearchField.storeDialog(SearchField.java:580)
26-Jun-2018 16:55:13         at org.eclipse.ui.internal.quickaccess.SearchField.dispose(SearchField.java:557)
26-Jun-2018 16:55:13         at sun.reflect.NativeMethodAccessorImpl.invoke0(Native Method)
26-Jun-2018 16:55:13         at sun.reflect.NativeMethodAccessorImpl.invoke(NativeMethodAccessorImpl.java:57)
26-Jun-2018 16:55:13         at sun.reflect.DelegatingMethodAccessorImpl.invoke(DelegatingMethodAccessorImpl.java:43)
26-Jun-2018 16:55:13         at java.lang.reflect.Method.invoke(Method.java:606)
26-Jun-2018 16:55:13         at org.eclipse.e4.core.internal.di.MethodRequestor.execute(MethodRequestor.java:55)
26-Jun-2018 16:55:13         ... 45 more
26-Jun-2018 16:55:13
26-Jun-2018 16:55:13 !ENTRY org.eclipse.e4.ui.workbench 4 0 2018-06-26 16:55:13.698
26-Jun-2018 16:55:13 !MESSAGE Exception occurred while unrendering: org.eclipse.e4.ui.model.application.ui.basic.impl.TrimmedWindowImpl@57d9ea59 (elementId: IDEWindow, tags: [topLevel], contributorURI: platform:/plugin/org.eclipse.ui.workbench) (widget: null, renderer: null, toBeRendered: true, onTop: false, visible: true, containerData: null, accessibilityPhrase: null) (label: %trimmedwindow.label.eclipseSDK, iconURI: null, tooltip: null, context: null, variables: [], x: 0, y: 0, width: 1024, height: 768)
26-Jun-2018 16:55:13 !STACK 0
26-Jun-2018 16:55:13 org.eclipse.e4.core.di.InjectionException: org.eclipse.swt.SWTException: Widget is disposed
26-Jun-2018 16:55:13         at org.eclipse.e4.core.internal.di.MethodRequestor.execute(MethodRequestor.java:62)
26-Jun-2018 16:55:13         at org.eclipse.e4.core.internal.di.InjectorImpl.processAnnotated(InjectorImpl.java:888)
26-Jun-2018 16:55:13         at org.eclipse.e4.core.internal.di.InjectorImpl.disposed(InjectorImpl.java:390)
26-Jun-2018 16:55:13         at org.eclipse.e4.core.internal.di.Requestor.disposed(Requestor.java:143)
26-Jun-2018 16:55:13         at org.eclipse.e4.core.internal.contexts.ContextObjectSupplier$ContextInjectionListener.update(ContextObjectSupplier.java:76)
26-Jun-2018 16:55:13         at org.eclipse.e4.core.internal.contexts.TrackableComputationExt.update(TrackableComputationExt.java:107)
26-Jun-2018 16:55:13         at org.eclipse.e4.core.internal.contexts.TrackableComputationExt.handleInvalid(TrackableComputationExt.java:70)
26-Jun-2018 16:55:13         at org.eclipse.e4.core.internal.contexts.EclipseContext.dispose(EclipseContext.java:175)
26-Jun-2018 16:55:13         at org.eclipse.e4.ui.internal.workbench.swt.PartRenderingEngine.clearContext(PartRenderingEngine.java:974)
26-Jun-2018 16:55:13         at org.eclipse.e4.ui.internal.workbench.swt.PartRenderingEngine.safeRemoveGui(PartRenderingEngine.java:954)
26-Jun-2018 16:55:13         at org.eclipse.e4.ui.internal.workbench.swt.PartRenderingEngine.access$3(PartRenderingEngine.java:862)
26-Jun-2018 16:55:13         at org.eclipse.e4.ui.internal.workbench.swt.PartRenderingEngine$8.run(PartRenderingEngine.java:857)
26-Jun-2018 16:55:13         at org.eclipse.core.runtime.SafeRunner.run(SafeRunner.java:42)
26-Jun-2018 16:55:13         at org.eclipse.e4.ui.internal.workbench.swt.PartRenderingEngine.removeGui(PartRenderingEngine.java:841)
26-Jun-2018 16:55:13         at org.eclipse.e4.ui.internal.workbench.swt.PartRenderingEngine.stop(PartRenderingEngine.java:1220)
26-Jun-2018 16:55:13         at org.eclipse.e4.ui.internal.workbench.E4Workbench.close(E4Workbench.java:184)
26-Jun-2018 16:55:13         at org.eclipse.e4.ui.internal.workbench.swt.E4Testable$2.run(E4Testable.java:130)
26-Jun-2018 16:55:13         at org.eclipse.swt.widgets.RunnableLock.run(RunnableLock.java:35)
26-Jun-2018 16:55:13         at org.eclipse.swt.widgets.Synchronizer.runAsyncMessages(Synchronizer.java:136)
26-Jun-2018 16:55:13         at org.eclipse.swt.widgets.Display.runAsyncMessages(Display.java:3774)
26-Jun-2018 16:55:13         at org.eclipse.swt.widgets.Display.readAndDispatch(Display.java:3412)
26-Jun-2018 16:55:13         at org.eclipse.e4.ui.internal.workbench.swt.PartRenderingEngine$9.run(PartRenderingEngine.java:1151)
26-Jun-2018 16:55:13         at org.eclipse.core.databinding.observable.Realm.runWithDefault(Realm.java:332)
26-Jun-2018 16:55:13         at org.eclipse.e4.ui.internal.workbench.swt.PartRenderingEngine.run(PartRenderingEngine.java:1032)
26-Jun-2018 16:55:13         at org.eclipse.e4.ui.internal.workbench.E4Workbench.createAndRunUI(E4Workbench.java:148)
26-Jun-2018 16:55:13         at org.eclipse.ui.internal.Workbench$5.run(Workbench.java:636)
26-Jun-2018 16:55:13         at org.eclipse.core.databinding.observable.Realm.runWithDefault(Realm.java:332)
26-Jun-2018 16:55:13         at org.eclipse.ui.internal.Workbench.createAndRunWorkbench(Workbench.java:579)
26-Jun-2018 16:55:13         at org.eclipse.ui.PlatformUI.createAndRunWorkbench(PlatformUI.java:150)
26-Jun-2018 16:55:13         at org.eclipse.ui.internal.ide.application.IDEApplication.start(IDEApplication.java:135)
26-Jun-2018 16:55:13         at org.eclipse.tycho.surefire.osgibooter.UITestApplication.runApplication(UITestApplication.java:31)
26-Jun-2018 16:55:13         at org.eclipse.tycho.surefire.osgibooter.AbstractUITestApplication.run(AbstractUITestApplication.java:120)
26-Jun-2018 16:55:13         at org.eclipse.tycho.surefire.osgibooter.UITestApplication.start(UITestApplication.java:37)
26-Jun-2018 16:55:13         at org.eclipse.equinox.internal.app.EclipseAppHandle.run(EclipseAppHandle.java:196)
26-Jun-2018 16:55:13         at org.eclipse.core.runtime.internal.adaptor.EclipseAppLauncher.runApplication(EclipseAppLauncher.java:134)
26-Jun-2018 16:55:13         at org.eclipse.core.runtime.internal.adaptor.EclipseAppLauncher.start(EclipseAppLauncher.java:104)
26-Jun-2018 16:55:13         at org.eclipse.core.runtime.adaptor.EclipseStarter.run(EclipseStarter.java:380)
26-Jun-2018 16:55:13         at org.eclipse.core.runtime.adaptor.EclipseStarter.run(EclipseStarter.java:235)
26-Jun-2018 16:55:13         at sun.reflect.NativeMethodAccessorImpl.invoke0(Native Method)
26-Jun-2018 16:55:13         at sun.reflect.NativeMethodAccessorImpl.invoke(NativeMethodAccessorImpl.java:57)
26-Jun-2018 16:55:13         at sun.reflect.DelegatingMethodAccessorImpl.invoke(DelegatingMethodAccessorImpl.java:43)
26-Jun-2018 16:55:13         at java.lang.reflect.Method.invoke(Method.java:606)
26-Jun-2018 16:55:13         at org.eclipse.equinox.launcher.Main.invokeFramework(Main.java:648)
26-Jun-2018 16:55:13         at org.eclipse.equinox.launcher.Main.basicRun(Main.java:603)
26-Jun-2018 16:55:13         at org.eclipse.equinox.launcher.Main.run(Main.java:1465)
26-Jun-2018 16:55:13         at org.eclipse.equinox.launcher.Main.main(Main.java:1438)
26-Jun-2018 16:55:13 Caused by: org.eclipse.swt.SWTException: Widget is disposed
26-Jun-2018 16:55:13         at org.eclipse.swt.SWT.error(SWT.java:4441)
26-Jun-2018 16:55:13         at org.eclipse.swt.SWT.error(SWT.java:4356)
26-Jun-2018 16:55:13         at org.eclipse.swt.SWT.error(SWT.java:4327)
26-Jun-2018 16:55:13         at org.eclipse.swt.widgets.Widget.error(Widget.java:476)
26-Jun-2018 16:55:13         at org.eclipse.swt.widgets.Widget.checkWidget(Widget.java:413)
26-Jun-2018 16:55:13         at org.eclipse.swt.widgets.Shell.getSize(Shell.java:1111)
26-Jun-2018 16:55:13         at org.eclipse.ui.internal.quickaccess.SearchField.storeDialog(SearchField.java:580)
26-Jun-2018 16:55:13         at org.eclipse.ui.internal.quickaccess.SearchField.dispose(SearchField.java:557)
26-Jun-2018 16:55:13         at sun.reflect.NativeMethodAccessorImpl.invoke0(Native Method)
26-Jun-2018 16:55:13         at sun.reflect.NativeMethodAccessorImpl.invoke(NativeMethodAccessorImpl.java:57)
26-Jun-2018 16:55:13         at sun.reflect.DelegatingMethodAccessorImpl.invoke(DelegatingMethodAccessorImpl.java:43)
26-Jun-2018 16:55:13         at java.lang.reflect.Method.invoke(Method.java:606)
26-Jun-2018 16:55:13         at org.eclipse.e4.core.internal.di.MethodRequestor.execute(MethodRequestor.java:55)
26-Jun-2018 16:55:13         ... 45 more
26-Jun-2018 16:55:15 [INFO] All tests passed!
26-Jun-2018 16:55:15 [INFO]
26-Jun-2018 16:55:15 [INFO] --- maven-install-plugin:2.3.1:install (default-install) @ org.codehaus.groovy.alltests ---
26-Jun-2018 16:55:15 [INFO] Installing /opt/bamboo-home/xml-data/build-dir/GRECLIPSE-E44TP-JOB1/ide-test/org.codehaus.groovy.alltests/target/org.codehaus.groovy.alltests-2.9.3-SNAPSHOT.jar to /home/bamboo/.m2/repository/org/codehaus/groovy/eclipse/org.codehaus.groovy.alltests/2.9.3-SNAPSHOT/org.codehaus.groovy.alltests-2.9.3-SNAPSHOT.jar
26-Jun-2018 16:55:15 [INFO] Installing /opt/bamboo-home/xml-data/build-dir/GRECLIPSE-E44TP-JOB1/ide-test/org.codehaus.groovy.alltests/pom.xml to /home/bamboo/.m2/repository/org/codehaus/groovy/eclipse/org.codehaus.groovy.alltests/2.9.3-SNAPSHOT/org.codehaus.groovy.alltests-2.9.3-SNAPSHOT.pom
26-Jun-2018 16:55:15 [INFO] Installing /opt/bamboo-home/xml-data/build-dir/GRECLIPSE-E44TP-JOB1/ide-test/org.codehaus.groovy.alltests/target/org.codehaus.groovy.alltests-2.9.3-SNAPSHOT-sources.jar to /home/bamboo/.m2/repository/org/codehaus/groovy/eclipse/org.codehaus.groovy.alltests/2.9.3-SNAPSHOT/org.codehaus.groovy.alltests-2.9.3-SNAPSHOT-sources.jar
26-Jun-2018 16:55:15 [INFO] Installing /opt/bamboo-home/xml-data/build-dir/GRECLIPSE-E44TP-JOB1/ide-test/org.codehaus.groovy.alltests/target/p2content.xml to /home/bamboo/.m2/repository/org/codehaus/groovy/eclipse/org.codehaus.groovy.alltests/2.9.3-SNAPSHOT/org.codehaus.groovy.alltests-2.9.3-SNAPSHOT-p2metadata.xml
26-Jun-2018 16:55:15 [INFO] Installing /opt/bamboo-home/xml-data/build-dir/GRECLIPSE-E44TP-JOB1/ide-test/org.codehaus.groovy.alltests/target/p2artifacts.xml to /home/bamboo/.m2/repository/org/codehaus/groovy/eclipse/org.codehaus.groovy.alltests/2.9.3-SNAPSHOT/org.codehaus.groovy.alltests-2.9.3-SNAPSHOT-p2artifacts.xml
26-Jun-2018 16:55:15 [INFO]
26-Jun-2018 16:55:15 [INFO] --- tycho-p2-plugin:0.24.0:update-local-index (default-update-local-index) @ org.codehaus.groovy.alltests ---
26-Jun-2018 16:55:15 [INFO]
26-Jun-2018 16:55:15 [INFO] --- maven-deploy-plugin:2.5:deploy (default-deploy) @ org.codehaus.groovy.alltests ---
26-Jun-2018 16:55:15 [INFO] Skipping artifact deployment
26-Jun-2018 16:55:15 [INFO]                                                                         
26-Jun-2018 16:55:15 [INFO] ------------------------------------------------------------------------
26-Jun-2018 16:55:15 [INFO] Building org.codehaus.groovy.alltests.feature 2.9.3-SNAPSHOT
26-Jun-2018 16:55:15 [INFO] ------------------------------------------------------------------------
26-Jun-2018 16:55:16 [INFO]
26-Jun-2018 16:55:16 [INFO] --- maven-clean-plugin:2.5:clean (default-clean) @ org.codehaus.groovy.alltests.feature ---
26-Jun-2018 16:55:16 [INFO] Deleting /opt/bamboo-home/xml-data/build-dir/GRECLIPSE-E44TP-JOB1/ide-test/Feature-org.codehaus.groovy.alltests.feature/target
26-Jun-2018 16:55:16 [INFO]
26-Jun-2018 16:55:16 [INFO] --- tycho-packaging-plugin:0.24.0:build-qualifier-aggregator (default-build-qualifier-aggregator) @ org.codehaus.groovy.alltests.feature ---
26-Jun-2018 16:55:16 [INFO] The project's OSGi version is 2.9.3.xx-201806261523-e44
26-Jun-2018 16:55:16 [INFO]
26-Jun-2018 16:55:16 [INFO] --- tycho-packaging-plugin:0.24.0:validate-id (default-validate-id) @ org.codehaus.groovy.alltests.feature ---
26-Jun-2018 16:55:16 [INFO]
26-Jun-2018 16:55:16 [INFO] --- tycho-packaging-plugin:0.24.0:validate-version (default-validate-version) @ org.codehaus.groovy.alltests.feature ---
26-Jun-2018 16:55:16 [INFO]
26-Jun-2018 16:55:16 [INFO] --- properties-maven-plugin:1.0-alpha-2:read-project-properties (default) @ org.codehaus.groovy.alltests.feature ---
26-Jun-2018 16:55:16 [INFO]
26-Jun-2018 16:55:16 [INFO] --- tycho-source-plugin:0.24.0:plugin-source (plugin-source) @ org.codehaus.groovy.alltests.feature ---
26-Jun-2018 16:55:16 [INFO]
26-Jun-2018 16:55:16 [INFO] --- target-platform-configuration:0.24.0:target-platform (default-target-platform) @ org.codehaus.groovy.alltests.feature ---
26-Jun-2018 16:55:16 [INFO]
26-Jun-2018 16:55:16 [INFO] --- tycho-packaging-plugin:0.24.0:package-feature (default-package-feature) @ org.codehaus.groovy.alltests.feature ---
26-Jun-2018 16:55:16 [INFO] Building jar: /opt/bamboo-home/xml-data/build-dir/GRECLIPSE-E44TP-JOB1/ide-test/Feature-org.codehaus.groovy.alltests.feature/target/org.codehaus.groovy.alltests.feature-2.9.3-SNAPSHOT.jar
26-Jun-2018 16:55:16 [INFO]
26-Jun-2018 16:55:16 [INFO] --- tycho-p2-plugin:0.24.0:p2-metadata-default (default-p2-metadata-default) @ org.codehaus.groovy.alltests.feature ---
26-Jun-2018 16:55:16 [INFO]
26-Jun-2018 16:55:16 [INFO] --- tycho-p2-plugin:0.24.0:feature-p2-metadata (default-feature-p2-metadata) @ org.codehaus.groovy.alltests.feature ---
26-Jun-2018 16:55:16 [INFO]
26-Jun-2018 16:55:16 [INFO] --- maven-jarsigner-plugin:1.2:sign (sign) @ org.codehaus.groovy.alltests.feature ---
26-Jun-2018 16:55:17 [INFO] 1 archive(s) processed
26-Jun-2018 16:55:17 [INFO]
26-Jun-2018 16:55:17 [INFO] --- tycho-source-feature-plugin:0.24.0:source-feature (source-feature) @ org.codehaus.groovy.alltests.feature ---
26-Jun-2018 16:55:17 [INFO] Building jar: /opt/bamboo-home/xml-data/build-dir/GRECLIPSE-E44TP-JOB1/ide-test/Feature-org.codehaus.groovy.alltests.feature/target/org.codehaus.groovy.alltests.feature-2.9.3-SNAPSHOT-sources-feature.jar
26-Jun-2018 16:55:17 [INFO]
26-Jun-2018 16:55:17 [INFO] --- tycho-p2-plugin:0.24.0:p2-metadata (attach-p2-metadata) @ org.codehaus.groovy.alltests.feature ---
26-Jun-2018 16:55:17 [INFO]
26-Jun-2018 16:55:17 [INFO] --- maven-install-plugin:2.3.1:install (default-install) @ org.codehaus.groovy.alltests.feature ---
26-Jun-2018 16:55:17 [INFO] Installing /opt/bamboo-home/xml-data/build-dir/GRECLIPSE-E44TP-JOB1/ide-test/Feature-org.codehaus.groovy.alltests.feature/target/org.codehaus.groovy.alltests.feature-2.9.3-SNAPSHOT.jar to /home/bamboo/.m2/repository/org/codehaus/groovy/eclipse/org.codehaus.groovy.alltests.feature/2.9.3-SNAPSHOT/org.codehaus.groovy.alltests.feature-2.9.3-SNAPSHOT.jar
26-Jun-2018 16:55:17 [INFO] Installing /opt/bamboo-home/xml-data/build-dir/GRECLIPSE-E44TP-JOB1/ide-test/Feature-org.codehaus.groovy.alltests.feature/pom.xml to /home/bamboo/.m2/repository/org/codehaus/groovy/eclipse/org.codehaus.groovy.alltests.feature/2.9.3-SNAPSHOT/org.codehaus.groovy.alltests.feature-2.9.3-SNAPSHOT.pom
26-Jun-2018 16:55:17 [INFO] Installing /opt/bamboo-home/xml-data/build-dir/GRECLIPSE-E44TP-JOB1/ide-test/Feature-org.codehaus.groovy.alltests.feature/target/p2content.xml to /home/bamboo/.m2/repository/org/codehaus/groovy/eclipse/org.codehaus.groovy.alltests.feature/2.9.3-SNAPSHOT/org.codehaus.groovy.alltests.feature-2.9.3-SNAPSHOT-p2metadata.xml
26-Jun-2018 16:55:17 [INFO] Installing /opt/bamboo-home/xml-data/build-dir/GRECLIPSE-E44TP-JOB1/ide-test/Feature-org.codehaus.groovy.alltests.feature/target/p2artifacts.xml to /home/bamboo/.m2/repository/org/codehaus/groovy/eclipse/org.codehaus.groovy.alltests.feature/2.9.3-SNAPSHOT/org.codehaus.groovy.alltests.feature-2.9.3-SNAPSHOT-p2artifacts.xml
26-Jun-2018 16:55:17 [INFO] Installing /opt/bamboo-home/xml-data/build-dir/GRECLIPSE-E44TP-JOB1/ide-test/Feature-org.codehaus.groovy.alltests.feature/target/org.codehaus.groovy.alltests.feature-2.9.3-SNAPSHOT-sources-feature.jar to /home/bamboo/.m2/repository/org/codehaus/groovy/eclipse/org.codehaus.groovy.alltests.feature/2.9.3-SNAPSHOT/org.codehaus.groovy.alltests.feature-2.9.3-SNAPSHOT-sources-feature.jar
26-Jun-2018 16:55:17 [INFO]
26-Jun-2018 16:55:17 [INFO] --- tycho-p2-plugin:0.24.0:update-local-index (default-update-local-index) @ org.codehaus.groovy.alltests.feature ---
26-Jun-2018 16:55:17 [INFO]
26-Jun-2018 16:55:17 [INFO] --- maven-deploy-plugin:2.5:deploy (default-deploy) @ org.codehaus.groovy.alltests.feature ---
26-Jun-2018 16:55:17 [INFO] Skipping artifact deployment
26-Jun-2018 16:55:17 [INFO]                                                                         
26-Jun-2018 16:55:17 [INFO] ------------------------------------------------------------------------
26-Jun-2018 16:55:17 [INFO] Building org.codehaus.groovy.m2eclipse 2.9.3-SNAPSHOT
26-Jun-2018 16:55:17 [INFO] ------------------------------------------------------------------------
26-Jun-2018 16:55:18 [INFO]
26-Jun-2018 16:55:18 [INFO] --- maven-clean-plugin:2.5:clean (default-clean) @ org.codehaus.groovy.m2eclipse ---
26-Jun-2018 16:55:18 [INFO]
26-Jun-2018 16:55:18 [INFO] --- tycho-packaging-plugin:0.24.0:build-qualifier (default-build-qualifier) @ org.codehaus.groovy.m2eclipse ---
26-Jun-2018 16:55:18 [INFO] The project's OSGi version is 2.9.3.xx-201806261523-e44
26-Jun-2018 16:55:18 [INFO]
26-Jun-2018 16:55:18 [INFO] --- tycho-packaging-plugin:0.24.0:validate-id (default-validate-id) @ org.codehaus.groovy.m2eclipse ---
26-Jun-2018 16:55:18 [INFO]
26-Jun-2018 16:55:18 [INFO] --- tycho-packaging-plugin:0.24.0:validate-version (default-validate-version) @ org.codehaus.groovy.m2eclipse ---
26-Jun-2018 16:55:18 [INFO]
26-Jun-2018 16:55:18 [INFO] --- properties-maven-plugin:1.0-alpha-2:read-project-properties (default) @ org.codehaus.groovy.m2eclipse ---
26-Jun-2018 16:55:18 [INFO]
26-Jun-2018 16:55:18 [INFO] --- maven-resources-plugin:2.4.3:resources (default-resources) @ org.codehaus.groovy.m2eclipse ---
26-Jun-2018 16:55:18 [WARNING] Using platform encoding (UTF-8 actually) to copy filtered resources, i.e. build is platform dependent!
26-Jun-2018 16:55:18 [INFO] skip non existing resourceDirectory /opt/bamboo-home/xml-data/build-dir/GRECLIPSE-E44TP-JOB1/extras/org.codehaus.groovy.m2eclipse/src/main/resources
26-Jun-2018 16:55:18 [INFO]
26-Jun-2018 16:55:18 [INFO] --- tycho-compiler-plugin:0.24.0:compile (default-compile) @ org.codehaus.groovy.m2eclipse ---
26-Jun-2018 16:55:18 [INFO] Compiling 2 source files to /opt/bamboo-home/xml-data/build-dir/GRECLIPSE-E44TP-JOB1/extras/org.codehaus.groovy.m2eclipse/target/classes
26-Jun-2018 16:55:19 [INFO]
26-Jun-2018 16:55:19 [INFO] --- maven-resources-plugin:2.4.3:testResources (default-testResources) @ org.codehaus.groovy.m2eclipse ---
26-Jun-2018 16:55:19 [WARNING] Using platform encoding (UTF-8 actually) to copy filtered resources, i.e. build is platform dependent!
26-Jun-2018 16:55:19 [INFO] skip non existing resourceDirectory /opt/bamboo-home/xml-data/build-dir/GRECLIPSE-E44TP-JOB1/extras/org.codehaus.groovy.m2eclipse/src/test/resources
26-Jun-2018 16:55:19 [INFO]
26-Jun-2018 16:55:19 [INFO] --- tycho-source-plugin:0.24.0:plugin-source (plugin-source) @ org.codehaus.groovy.m2eclipse ---
26-Jun-2018 16:55:19 [WARNING] bundle localization file /opt/bamboo-home/xml-data/build-dir/GRECLIPSE-E44TP-JOB1/extras/org.codehaus.groovy.m2eclipse/plugin.properties not found
26-Jun-2018 16:55:19 [INFO] Building jar: /opt/bamboo-home/xml-data/build-dir/GRECLIPSE-E44TP-JOB1/extras/org.codehaus.groovy.m2eclipse/target/org.codehaus.groovy.m2eclipse-2.9.3-SNAPSHOT-sources.jar
26-Jun-2018 16:55:19 [INFO]
26-Jun-2018 16:55:19 [INFO] --- target-platform-configuration:0.24.0:target-platform (default-target-platform) @ org.codehaus.groovy.m2eclipse ---
26-Jun-2018 16:55:19 [INFO]
26-Jun-2018 16:55:19 [INFO] --- tycho-packaging-plugin:0.24.0:package-plugin (default-package-plugin) @ org.codehaus.groovy.m2eclipse ---
26-Jun-2018 16:55:19 [INFO] Building jar: /opt/bamboo-home/xml-data/build-dir/GRECLIPSE-E44TP-JOB1/extras/org.codehaus.groovy.m2eclipse/target/org.codehaus.groovy.m2eclipse-2.9.3-SNAPSHOT.jar
26-Jun-2018 16:55:19 [INFO]
26-Jun-2018 16:55:19 [INFO] --- tycho-p2-plugin:0.24.0:p2-metadata-default (default-p2-metadata-default) @ org.codehaus.groovy.m2eclipse ---
26-Jun-2018 16:55:19 [INFO]
26-Jun-2018 16:55:19 [INFO] --- maven-jarsigner-plugin:1.2:sign (sign) @ org.codehaus.groovy.m2eclipse ---
26-Jun-2018 16:55:20 [INFO] 2 archive(s) processed
26-Jun-2018 16:55:20 [INFO]
26-Jun-2018 16:55:20 [INFO] --- tycho-source-feature-plugin:0.24.0:source-feature (source-feature) @ org.codehaus.groovy.m2eclipse ---
26-Jun-2018 16:55:20 [INFO]
26-Jun-2018 16:55:20 [INFO] --- tycho-p2-plugin:0.24.0:p2-metadata (attach-p2-metadata) @ org.codehaus.groovy.m2eclipse ---
26-Jun-2018 16:55:20 [INFO]
26-Jun-2018 16:55:20 [INFO] --- maven-install-plugin:2.3.1:install (default-install) @ org.codehaus.groovy.m2eclipse ---
26-Jun-2018 16:55:20 [INFO] Installing /opt/bamboo-home/xml-data/build-dir/GRECLIPSE-E44TP-JOB1/extras/org.codehaus.groovy.m2eclipse/target/org.codehaus.groovy.m2eclipse-2.9.3-SNAPSHOT.jar to /home/bamboo/.m2/repository/org/codehaus/groovy/eclipse/org.codehaus.groovy.m2eclipse/2.9.3-SNAPSHOT/org.codehaus.groovy.m2eclipse-2.9.3-SNAPSHOT.jar
26-Jun-2018 16:55:20 [INFO] Installing /opt/bamboo-home/xml-data/build-dir/GRECLIPSE-E44TP-JOB1/extras/org.codehaus.groovy.m2eclipse/pom.xml to /home/bamboo/.m2/repository/org/codehaus/groovy/eclipse/org.codehaus.groovy.m2eclipse/2.9.3-SNAPSHOT/org.codehaus.groovy.m2eclipse-2.9.3-SNAPSHOT.pom
26-Jun-2018 16:55:20 [INFO] Installing /opt/bamboo-home/xml-data/build-dir/GRECLIPSE-E44TP-JOB1/extras/org.codehaus.groovy.m2eclipse/target/org.codehaus.groovy.m2eclipse-2.9.3-SNAPSHOT-sources.jar to /home/bamboo/.m2/repository/org/codehaus/groovy/eclipse/org.codehaus.groovy.m2eclipse/2.9.3-SNAPSHOT/org.codehaus.groovy.m2eclipse-2.9.3-SNAPSHOT-sources.jar
26-Jun-2018 16:55:20 [INFO] Installing /opt/bamboo-home/xml-data/build-dir/GRECLIPSE-E44TP-JOB1/extras/org.codehaus.groovy.m2eclipse/target/p2content.xml to /home/bamboo/.m2/repository/org/codehaus/groovy/eclipse/org.codehaus.groovy.m2eclipse/2.9.3-SNAPSHOT/org.codehaus.groovy.m2eclipse-2.9.3-SNAPSHOT-p2metadata.xml
26-Jun-2018 16:55:20 [INFO] Installing /opt/bamboo-home/xml-data/build-dir/GRECLIPSE-E44TP-JOB1/extras/org.codehaus.groovy.m2eclipse/target/p2artifacts.xml to /home/bamboo/.m2/repository/org/codehaus/groovy/eclipse/org.codehaus.groovy.m2eclipse/2.9.3-SNAPSHOT/org.codehaus.groovy.m2eclipse-2.9.3-SNAPSHOT-p2artifacts.xml
26-Jun-2018 16:55:20 [INFO]
26-Jun-2018 16:55:20 [INFO] --- tycho-p2-plugin:0.24.0:update-local-index (default-update-local-index) @ org.codehaus.groovy.m2eclipse ---
26-Jun-2018 16:55:20 [INFO]
26-Jun-2018 16:55:20 [INFO] --- maven-deploy-plugin:2.5:deploy (default-deploy) @ org.codehaus.groovy.m2eclipse ---
26-Jun-2018 16:55:20 [INFO] Skipping artifact deployment
26-Jun-2018 16:55:20 [INFO]                                                                         
26-Jun-2018 16:55:20 [INFO] ------------------------------------------------------------------------
26-Jun-2018 16:55:20 [INFO] Building org.codehaus.groovy.m2eclipse.feature 2.9.3-SNAPSHOT
26-Jun-2018 16:55:20 [INFO] ------------------------------------------------------------------------
26-Jun-2018 16:55:20 [INFO]
26-Jun-2018 16:55:20 [INFO] --- maven-clean-plugin:2.5:clean (default-clean) @ org.codehaus.groovy.m2eclipse.feature ---
26-Jun-2018 16:55:20 [INFO] Deleting /opt/bamboo-home/xml-data/build-dir/GRECLIPSE-E44TP-JOB1/extras/Feature-org.codehaus.groovy.m2eclipse/target
26-Jun-2018 16:55:20 [INFO]
26-Jun-2018 16:55:20 [INFO] --- tycho-packaging-plugin:0.24.0:build-qualifier-aggregator (default-build-qualifier-aggregator) @ org.codehaus.groovy.m2eclipse.feature ---
26-Jun-2018 16:55:20 [INFO] The project's OSGi version is 2.9.3.xx-201806261523-e44
26-Jun-2018 16:55:20 [INFO]
26-Jun-2018 16:55:20 [INFO] --- tycho-packaging-plugin:0.24.0:validate-id (default-validate-id) @ org.codehaus.groovy.m2eclipse.feature ---
26-Jun-2018 16:55:20 [INFO]
26-Jun-2018 16:55:20 [INFO] --- tycho-packaging-plugin:0.24.0:validate-version (default-validate-version) @ org.codehaus.groovy.m2eclipse.feature ---
26-Jun-2018 16:55:20 [INFO]
26-Jun-2018 16:55:20 [INFO] --- properties-maven-plugin:1.0-alpha-2:read-project-properties (default) @ org.codehaus.groovy.m2eclipse.feature ---
26-Jun-2018 16:55:20 [INFO]
26-Jun-2018 16:55:20 [INFO] --- tycho-source-plugin:0.24.0:plugin-source (plugin-source) @ org.codehaus.groovy.m2eclipse.feature ---
26-Jun-2018 16:55:20 [INFO]
26-Jun-2018 16:55:20 [INFO] --- target-platform-configuration:0.24.0:target-platform (default-target-platform) @ org.codehaus.groovy.m2eclipse.feature ---
26-Jun-2018 16:55:20 [INFO]
26-Jun-2018 16:55:20 [INFO] --- tycho-packaging-plugin:0.24.0:package-feature (default-package-feature) @ org.codehaus.groovy.m2eclipse.feature ---
26-Jun-2018 16:55:20 [INFO] Building jar: /opt/bamboo-home/xml-data/build-dir/GRECLIPSE-E44TP-JOB1/extras/Feature-org.codehaus.groovy.m2eclipse/target/org.codehaus.groovy.m2eclipse.feature-2.9.3-SNAPSHOT.jar
26-Jun-2018 16:55:20 [INFO]
26-Jun-2018 16:55:20 [INFO] --- tycho-p2-plugin:0.24.0:p2-metadata-default (default-p2-metadata-default) @ org.codehaus.groovy.m2eclipse.feature ---
26-Jun-2018 16:55:20 [INFO]
26-Jun-2018 16:55:20 [INFO] --- tycho-p2-plugin:0.24.0:feature-p2-metadata (default-feature-p2-metadata) @ org.codehaus.groovy.m2eclipse.feature ---
26-Jun-2018 16:55:20 [INFO]
26-Jun-2018 16:55:20 [INFO] --- maven-jarsigner-plugin:1.2:sign (sign) @ org.codehaus.groovy.m2eclipse.feature ---
26-Jun-2018 16:55:20 [INFO] 1 archive(s) processed
26-Jun-2018 16:55:20 [INFO]
26-Jun-2018 16:55:20 [INFO] --- tycho-source-feature-plugin:0.24.0:source-feature (source-feature) @ org.codehaus.groovy.m2eclipse.feature ---
26-Jun-2018 16:55:21 [INFO] Building jar: /opt/bamboo-home/xml-data/build-dir/GRECLIPSE-E44TP-JOB1/extras/Feature-org.codehaus.groovy.m2eclipse/target/org.codehaus.groovy.m2eclipse.feature-2.9.3-SNAPSHOT-sources-feature.jar
26-Jun-2018 16:55:21 [INFO]
26-Jun-2018 16:55:21 [INFO] --- tycho-p2-plugin:0.24.0:p2-metadata (attach-p2-metadata) @ org.codehaus.groovy.m2eclipse.feature ---
26-Jun-2018 16:55:21 [INFO]
26-Jun-2018 16:55:21 [INFO] --- maven-install-plugin:2.3.1:install (default-install) @ org.codehaus.groovy.m2eclipse.feature ---
26-Jun-2018 16:55:21 [INFO] Installing /opt/bamboo-home/xml-data/build-dir/GRECLIPSE-E44TP-JOB1/extras/Feature-org.codehaus.groovy.m2eclipse/target/org.codehaus.groovy.m2eclipse.feature-2.9.3-SNAPSHOT.jar to /home/bamboo/.m2/repository/org/codehaus/groovy/eclipse/org.codehaus.groovy.m2eclipse.feature/2.9.3-SNAPSHOT/org.codehaus.groovy.m2eclipse.feature-2.9.3-SNAPSHOT.jar
26-Jun-2018 16:55:21 [INFO] Installing /opt/bamboo-home/xml-data/build-dir/GRECLIPSE-E44TP-JOB1/extras/Feature-org.codehaus.groovy.m2eclipse/pom.xml to /home/bamboo/.m2/repository/org/codehaus/groovy/eclipse/org.codehaus.groovy.m2eclipse.feature/2.9.3-SNAPSHOT/org.codehaus.groovy.m2eclipse.feature-2.9.3-SNAPSHOT.pom
26-Jun-2018 16:55:21 [INFO] Installing /opt/bamboo-home/xml-data/build-dir/GRECLIPSE-E44TP-JOB1/extras/Feature-org.codehaus.groovy.m2eclipse/target/p2content.xml to /home/bamboo/.m2/repository/org/codehaus/groovy/eclipse/org.codehaus.groovy.m2eclipse.feature/2.9.3-SNAPSHOT/org.codehaus.groovy.m2eclipse.feature-2.9.3-SNAPSHOT-p2metadata.xml
26-Jun-2018 16:55:21 [INFO] Installing /opt/bamboo-home/xml-data/build-dir/GRECLIPSE-E44TP-JOB1/extras/Feature-org.codehaus.groovy.m2eclipse/target/p2artifacts.xml to /home/bamboo/.m2/repository/org/codehaus/groovy/eclipse/org.codehaus.groovy.m2eclipse.feature/2.9.3-SNAPSHOT/org.codehaus.groovy.m2eclipse.feature-2.9.3-SNAPSHOT-p2artifacts.xml
26-Jun-2018 16:55:21 [INFO] Installing /opt/bamboo-home/xml-data/build-dir/GRECLIPSE-E44TP-JOB1/extras/Feature-org.codehaus.groovy.m2eclipse/target/org.codehaus.groovy.m2eclipse.feature-2.9.3-SNAPSHOT-sources-feature.jar to /home/bamboo/.m2/repository/org/codehaus/groovy/eclipse/org.codehaus.groovy.m2eclipse.feature/2.9.3-SNAPSHOT/org.codehaus.groovy.m2eclipse.feature-2.9.3-SNAPSHOT-sources-feature.jar
26-Jun-2018 16:55:21 [INFO]
26-Jun-2018 16:55:21 [INFO] --- tycho-p2-plugin:0.24.0:update-local-index (default-update-local-index) @ org.codehaus.groovy.m2eclipse.feature ---
26-Jun-2018 16:55:21 [INFO]
26-Jun-2018 16:55:21 [INFO] --- maven-deploy-plugin:2.5:deploy (default-deploy) @ org.codehaus.groovy.m2eclipse.feature ---
26-Jun-2018 16:55:21 [INFO] Skipping artifact deployment
26-Jun-2018 16:55:21 [INFO]                                                                         
26-Jun-2018 16:55:21 [INFO] ------------------------------------------------------------------------
26-Jun-2018 16:55:21 [INFO] Building org.codehaus.groovy.eclipse.site 2.9.3-SNAPSHOT
26-Jun-2018 16:55:21 [INFO] ------------------------------------------------------------------------
26-Jun-2018 16:55:21 [INFO]
26-Jun-2018 16:55:21 [INFO] --- maven-clean-plugin:2.5:clean (default-clean) @ org.codehaus.groovy.eclipse.site ---
26-Jun-2018 16:55:21 [INFO]
26-Jun-2018 16:55:21 [INFO] --- tycho-packaging-plugin:0.24.0:build-qualifier (default-build-qualifier) @ org.codehaus.groovy.eclipse.site ---
26-Jun-2018 16:55:21 [INFO] The project's OSGi version is 2.9.3.xx-201806261523-e44
26-Jun-2018 16:55:21 [INFO]
26-Jun-2018 16:55:21 [INFO] --- properties-maven-plugin:1.0-alpha-2:read-project-properties (default) @ org.codehaus.groovy.eclipse.site ---
26-Jun-2018 16:55:21 [INFO]
26-Jun-2018 16:55:21 [INFO] --- tycho-source-plugin:0.24.0:plugin-source (plugin-source) @ org.codehaus.groovy.eclipse.site ---
26-Jun-2018 16:55:21 [INFO]
26-Jun-2018 16:55:21 [INFO] --- tycho-packaging-plugin:0.24.0:update-site (default-update-site) @ org.codehaus.groovy.eclipse.site ---
26-Jun-2018 16:55:22 [INFO]
26-Jun-2018 16:55:22 [INFO] --- tycho-p2-plugin:0.24.0:update-site-p2-metadata (default-update-site-p2-metadata) @ org.codehaus.groovy.eclipse.site ---
26-Jun-2018 16:55:23 [INFO] Command line:
26-Jun-2018 16:55:23         [/opt/jdk1.7.0_80/jre/bin/java, -jar, /opt/users/bamboo/.m2/repository/org/eclipse/tycho/tycho-bundles-external/0.24.0/eclipse/plugins/org.eclipse.equinox.launcher_1.3.100.v20150511-1540.jar, -configuration, /tmp/GRECLIPSE-E44TP-JOB1/tycho-p2-runtime9173724344292251038.tmp/configuration, -nosplash, -application, org.eclipse.equinox.p2.publisher.UpdateSitePublisher, -source, /opt/bamboo-home/xml-data/build-dir/GRECLIPSE-E44TP-JOB1/Site-org.codehaus.groovy.eclipse/target/site, -metadataRepository, file:/opt/bamboo-home/xml-data/build-dir/GRECLIPSE-E44TP-JOB1/Site-org.codehaus.groovy.eclipse/target/site/, -metadataRepositoryName, org.codehaus.groovy.eclipse.site, -artifactRepository, file:/opt/bamboo-home/xml-data/build-dir/GRECLIPSE-E44TP-JOB1/Site-org.codehaus.groovy.eclipse/target/site/, -artifactRepositoryName, org.codehaus.groovy.eclipse.site Artifacts, -noDefaultIUs, -compress]
26-Jun-2018 16:55:25 Generating metadata for ..
26-Jun-2018 16:55:25 Generation completed with success [0 seconds].
26-Jun-2018 16:55:26 [INFO]
26-Jun-2018 16:55:26 [INFO] --- tycho-packaging-plugin:0.24.0:update-site-packaging (default-update-site-packaging) @ org.codehaus.groovy.eclipse.site ---
26-Jun-2018 16:55:26 [INFO] Building zip: /opt/bamboo-home/xml-data/build-dir/GRECLIPSE-E44TP-JOB1/Site-org.codehaus.groovy.eclipse/target/site.zip
26-Jun-2018 16:55:26 [INFO]
26-Jun-2018 16:55:26 [INFO] --- maven-jarsigner-plugin:1.2:sign (sign) @ org.codehaus.groovy.eclipse.site ---
26-Jun-2018 16:55:26 [INFO] 1 archive(s) processed
26-Jun-2018 16:55:26 [INFO]
26-Jun-2018 16:55:26 [INFO] --- tycho-source-feature-plugin:0.24.0:source-feature (source-feature) @ org.codehaus.groovy.eclipse.site ---
26-Jun-2018 16:55:26 [INFO]
26-Jun-2018 16:55:26 [INFO] --- tycho-p2-plugin:0.24.0:p2-metadata (attach-p2-metadata) @ org.codehaus.groovy.eclipse.site ---
26-Jun-2018 16:55:26 [INFO]
26-Jun-2018 16:55:26 [INFO] --- maven-install-plugin:2.3.1:install (default-install) @ org.codehaus.groovy.eclipse.site ---
26-Jun-2018 16:55:26 [INFO] Installing /opt/bamboo-home/xml-data/build-dir/GRECLIPSE-E44TP-JOB1/Site-org.codehaus.groovy.eclipse/target/site.zip to /home/bamboo/.m2/repository/org/codehaus/groovy/eclipse/org.codehaus.groovy.eclipse.site/2.9.3-SNAPSHOT/org.codehaus.groovy.eclipse.site-2.9.3-SNAPSHOT.zip
26-Jun-2018 16:55:26 [INFO] Installing /opt/bamboo-home/xml-data/build-dir/GRECLIPSE-E44TP-JOB1/Site-org.codehaus.groovy.eclipse/pom.xml to /home/bamboo/.m2/repository/org/codehaus/groovy/eclipse/org.codehaus.groovy.eclipse.site/2.9.3-SNAPSHOT/org.codehaus.groovy.eclipse.site-2.9.3-SNAPSHOT.pom
26-Jun-2018 16:55:26 [INFO]
26-Jun-2018 16:55:26 [INFO] --- maven-deploy-plugin:2.5:deploy (default-deploy) @ org.codehaus.groovy.eclipse.site ---
26-Jun-2018 16:55:26 [INFO] Skipping artifact deployment
26-Jun-2018 16:55:26 [INFO]
26-Jun-2018 16:55:26 [INFO] --- maven-antrun-plugin:1.6:run (upload-dist) @ org.codehaus.groovy.eclipse.site ---
26-Jun-2018 16:55:27 [INFO] Executing tasks
26-Jun-2018 16:55:27
26-Jun-2018 16:55:27 main:
26-Jun-2018 16:55:27      [echo] Uploading main update site to s3..."
26-Jun-2018 16:55:27      [echo] ==== dist props are set so we can deploy? ===
26-Jun-2018 16:55:27      [echo] bamboo.s3.properties=${bamboo.s3.properties}
26-Jun-2018 16:55:27      [echo] dist_properties=/home/bamboo/tools/s3.properties
26-Jun-2018 16:55:27      [echo] env.bamboo_s3_properties_rel=/home/bamboo/tools/s3.properties
26-Jun-2018 16:55:27      [echo] dist.accessKey=AKIAJKUKWKYLMXOFIFDA
26-Jun-2018 16:55:27      [echo] accessKey=AKIAIBYM5QE7XBKC6JJQ
26-Jun-2018 16:55:27      [echo] site.target.dir=/opt/bamboo-home/xml-data/build-dir/GRECLIPSE-E44TP-JOB1/Site-org.codehaus.groovy.eclipse/target
26-Jun-2018 16:55:27      [echo] unqualifiedVersion=2.9.3
26-Jun-2018 16:55:27      [echo] buildQualifier=xx-201806261523-e44
26-Jun-2018 16:55:27      [echo] dist.full.version=2.9.3.xx-201806261523-e44
26-Jun-2018 16:55:27      [echo] dist.file.name=org.codehaus.groovy-2.9.3.xx-201806261523-e44-updatesite.zip
26-Jun-2018 16:55:27       [zip] Building zip: /opt/bamboo-home/xml-data/build-dir/GRECLIPSE-E44TP-JOB1/Site-org.codehaus.groovy.eclipse/target/site/org.codehaus.groovy-2.9.3.xx-201806261523-e44-updatesite.zip
26-Jun-2018 16:55:34      [echo] Preparing for upload... This will happen:
26-Jun-2018 16:55:34      [echo] Will Delete:
26-Jun-2018 16:55:34      [echo] dist.bucket=dist.springsource.org
26-Jun-2018 16:55:34      [echo] dist.path=snapshot/GRECLIPSE/e4.4
26-Jun-2018 16:55:34      [echo] Will Upload:
26-Jun-2018 16:55:34      [echo] dist.bucket=dist.springsource.org
26-Jun-2018 16:55:34      [echo] toDir=snapshot/GRECLIPSE/e4.4
26-Jun-2018 16:55:34      [echo] fromDir=/opt/bamboo-home/xml-data/build-dir/GRECLIPSE-E44TP-JOB1/Site-org.codehaus.groovy.eclipse/target/site
26-Jun-2018 16:55:34      [echo] Will Upload:
26-Jun-2018 16:55:34      [echo] dist.bucket=dist.springsource.org
26-Jun-2018 16:55:34      [echo] toFile=snapshot/GRECLIPSE/e4.4/org.codehaus.groovy-2.9.3.xx-201806261523-e44-updatesite.zip
26-Jun-2018 16:55:34      [echo] fromFile=snapshot/GRECLIPSE/e4.4/org.codehaus.groovy-2.9.3.xx-201806261523-e44-updatesite.zip
26-Jun-2018 16:55:34      [echo] metadata project.name=Groovy Eclipse
26-Jun-2018 16:55:34      [echo] metadata release.type=snapshot
26-Jun-2018 16:55:34      [echo] metadata bundle.version=2.9.3.xx-201806261523-e44
26-Jun-2018 16:55:34      [echo] metadata package.file.name=org.codehaus.groovy-2.9.3.xx-201806261523-e44-updatesite.zip
26-Jun-2018 16:55:37 Deleted s3://dist.springsource.org/snapshot/GRECLIPSE/e4.4/artifacts.jar
26-Jun-2018 16:55:37 Deleted s3://dist.springsource.org/snapshot/GRECLIPSE/e4.4/content.jar
26-Jun-2018 16:55:37 Deleted s3://dist.springsource.org/snapshot/GRECLIPSE/e4.4/features/
26-Jun-2018 16:55:37 Deleted s3://dist.springsource.org/snapshot/GRECLIPSE/e4.4/features/org.codehaus.groovy.compilerless.feature_2.9.3.xx-201805141725-e44.jar
26-Jun-2018 16:55:37 Deleted s3://dist.springsource.org/snapshot/GRECLIPSE/e4.4/features/org.codehaus.groovy.eclipse.feature_2.9.3.xx-201805141725-e44.jar
26-Jun-2018 16:55:37 Deleted s3://dist.springsource.org/snapshot/GRECLIPSE/e4.4/features/org.codehaus.groovy.headless.feature_2.9.3.xx-201805141725-e44.jar
26-Jun-2018 16:55:37 Deleted s3://dist.springsource.org/snapshot/GRECLIPSE/e4.4/features/org.codehaus.groovy.jdt.patch_2.9.3.xx-201805141725-e44.jar
26-Jun-2018 16:55:38 Deleted s3://dist.springsource.org/snapshot/GRECLIPSE/e4.4/features/org.codehaus.groovy.m2eclipse.feature_2.9.3.xx-201805141725-e44.jar
26-Jun-2018 16:55:38 Deleted s3://dist.springsource.org/snapshot/GRECLIPSE/e4.4/features/org.codehaus.groovy18.feature_2.9.3.xx-201805141725-e44.jar
26-Jun-2018 16:55:38 Deleted s3://dist.springsource.org/snapshot/GRECLIPSE/e4.4/features/org.codehaus.groovy20.feature_2.9.3.xx-201805141725-e44.jar
26-Jun-2018 16:55:38 Deleted s3://dist.springsource.org/snapshot/GRECLIPSE/e4.4/features/org.codehaus.groovy21.feature_2.9.3.xx-201805141725-e44.jar
26-Jun-2018 16:55:38 Deleted s3://dist.springsource.org/snapshot/GRECLIPSE/e4.4/features/org.codehaus.groovy22.feature_2.9.3.xx-201805141725-e44.jar
26-Jun-2018 16:55:38 Deleted s3://dist.springsource.org/snapshot/GRECLIPSE/e4.4/features/org.codehaus.groovy23.feature_2.9.3.xx-201805141725-e44.jar
26-Jun-2018 16:55:38 Deleted s3://dist.springsource.org/snapshot/GRECLIPSE/e4.4/features/org.codehaus.groovy24.feature_2.9.3.xx-201805141725-e44.jar
26-Jun-2018 16:55:38 Deleted s3://dist.springsource.org/snapshot/GRECLIPSE/e4.4/features/org.codehaus.groovy25.feature_2.9.3.xx-201805141725-e44.jar
26-Jun-2018 16:55:38 Deleted s3://dist.springsource.org/snapshot/GRECLIPSE/e4.4/plugins/
26-Jun-2018 16:55:38 Deleted s3://dist.springsource.org/snapshot/GRECLIPSE/e4.4/plugins/org.codehaus.groovy.eclipse.ant_2.9.3.xx-201805141725-e44.jar
26-Jun-2018 16:55:39 Deleted s3://dist.springsource.org/snapshot/GRECLIPSE/e4.4/plugins/org.codehaus.groovy.eclipse.astviews_2.9.3.xx-201805141725-e44.jar
26-Jun-2018 16:55:39 Deleted s3://dist.springsource.org/snapshot/GRECLIPSE/e4.4/plugins/org.codehaus.groovy.eclipse.codeassist.completion_2.9.3.xx-201805141725-e44.jar
26-Jun-2018 16:55:39 Deleted s3://dist.springsource.org/snapshot/GRECLIPSE/e4.4/plugins/org.codehaus.groovy.eclipse.codebrowsing_2.9.3.xx-201805141725-e44.jar
26-Jun-2018 16:55:39 Deleted s3://dist.springsource.org/snapshot/GRECLIPSE/e4.4/plugins/org.codehaus.groovy.eclipse.compilerResolver_2.9.3.xx-201805141725-e44.jar
26-Jun-2018 16:55:39 Deleted s3://dist.springsource.org/snapshot/GRECLIPSE/e4.4/plugins/org.codehaus.groovy.eclipse.core_2.9.3.xx-201805141725-e44.jar
26-Jun-2018 16:55:39 Deleted s3://dist.springsource.org/snapshot/GRECLIPSE/e4.4/plugins/org.codehaus.groovy.eclipse.dsl_2.9.3.xx-201805141725-e44.jar
26-Jun-2018 16:55:39 Deleted s3://dist.springsource.org/snapshot/GRECLIPSE/e4.4/plugins/org.codehaus.groovy.eclipse.quickfix_2.9.3.xx-201805141725-e44.jar
26-Jun-2018 16:55:39 Deleted s3://dist.springsource.org/snapshot/GRECLIPSE/e4.4/plugins/org.codehaus.groovy.eclipse.refactoring_2.9.3.xx-201805141725-e44.jar
26-Jun-2018 16:55:39 Deleted s3://dist.springsource.org/snapshot/GRECLIPSE/e4.4/plugins/org.codehaus.groovy.eclipse.ui_2.9.3.xx-201805141725-e44.jar
26-Jun-2018 16:55:40 Deleted s3://dist.springsource.org/snapshot/GRECLIPSE/e4.4/plugins/org.codehaus.groovy.eclipse_2.9.3.xx-201805141725-e44.jar
26-Jun-2018 16:55:40 Deleted s3://dist.springsource.org/snapshot/GRECLIPSE/e4.4/plugins/org.codehaus.groovy.m2eclipse_2.9.3.xx-201805141725-e44.jar
26-Jun-2018 16:55:40 Deleted s3://dist.springsource.org/snapshot/GRECLIPSE/e4.4/plugins/org.codehaus.groovy_1.8.9.xx-201805141725-e44.jar
26-Jun-2018 16:55:40 Deleted s3://dist.springsource.org/snapshot/GRECLIPSE/e4.4/plugins/org.codehaus.groovy_2.0.8.xx-201805141725-e44.jar
26-Jun-2018 16:55:40 Deleted s3://dist.springsource.org/snapshot/GRECLIPSE/e4.4/plugins/org.codehaus.groovy_2.1.9.xx-201805141725-e44.jar
26-Jun-2018 16:55:40 Deleted s3://dist.springsource.org/snapshot/GRECLIPSE/e4.4/plugins/org.codehaus.groovy_2.2.2.xx-201805141725-e44.jar
26-Jun-2018 16:55:40 Deleted s3://dist.springsource.org/snapshot/GRECLIPSE/e4.4/plugins/org.codehaus.groovy_2.3.11.xx-201805141725-e44.jar
26-Jun-2018 16:55:40 Deleted s3://dist.springsource.org/snapshot/GRECLIPSE/e4.4/plugins/org.codehaus.groovy_2.4.13.xx-201805141725-e44.jar
26-Jun-2018 16:55:40 Deleted s3://dist.springsource.org/snapshot/GRECLIPSE/e4.4/plugins/org.codehaus.groovy_2.5.0.xx-201805141725-e44.jar
26-Jun-2018 16:55:40 Deleted s3://dist.springsource.org/snapshot/GRECLIPSE/e4.4/plugins/org.eclipse.jdt.core_3.10.2.xx-201805141725-e44.jar
26-Jun-2018 16:55:40 Deleted s3://dist.springsource.org/snapshot/GRECLIPSE/e4.4/plugins/org.eclipse.jdt.groovy.core_2.9.3.xx-201805141725-e44.jar
26-Jun-2018 16:55:41 Deleted s3://dist.springsource.org/snapshot/GRECLIPSE/e4.4/site.xml
26-Jun-2018 16:55:41 Uploading /opt/bamboo-home/xml-data/build-dir/GRECLIPSE-E44TP-JOB1/Site-org.codehaus.groovy.eclipse/target/site/artifacts.jar (1.9 KB) to s3://dist.springsource.org/snapshot/GRECLIPSE/e4.4/artifacts.jar
26-Jun-2018 16:55:41 Transfer Time: .2 s - Transfer Rate: 11.0 KB/s
26-Jun-2018 16:55:41 Uploading /opt/bamboo-home/xml-data/build-dir/GRECLIPSE-E44TP-JOB1/Site-org.codehaus.groovy.eclipse/target/site/content.jar (15.9 KB) to s3://dist.springsource.org/snapshot/GRECLIPSE/e4.4/content.jar
26-Jun-2018 16:55:42 Transfer Time: .3 s - Transfer Rate: 59.8 KB/s
26-Jun-2018 16:55:42 Uploading /opt/bamboo-home/xml-data/build-dir/GRECLIPSE-E44TP-JOB1/Site-org.codehaus.groovy.eclipse/target/site/features/org.codehaus.groovy.compilerless.feature_2.9.3.xx-201806261523-e44.jar (15.5 KB) to s3://dist.springsource.org/snapshot/GRECLIPSE/e4.4/features/org.codehaus.groovy.compilerless.feature_2.9.3.xx-201806261523-e44.jar
26-Jun-2018 16:55:42 Transfer Time: .2 s - Transfer Rate: 93.9 KB/s
26-Jun-2018 16:55:42 Uploading /opt/bamboo-home/xml-data/build-dir/GRECLIPSE-E44TP-JOB1/Site-org.codehaus.groovy.eclipse/target/site/features/org.codehaus.groovy.eclipse.feature_2.9.3.xx-201806261523-e44.jar (15.0 KB) to s3://dist.springsource.org/snapshot/GRECLIPSE/e4.4/features/org.codehaus.groovy.eclipse.feature_2.9.3.xx-201806261523-e44.jar
26-Jun-2018 16:55:43 Transfer Time: .2 s - Transfer Rate: 77.5 KB/s
26-Jun-2018 16:55:43 Uploading /opt/bamboo-home/xml-data/build-dir/GRECLIPSE-E44TP-JOB1/Site-org.codehaus.groovy.eclipse/target/site/features/org.codehaus.groovy.headless.feature_2.9.3.xx-201806261523-e44.jar (15.3 KB) to s3://dist.springsource.org/snapshot/GRECLIPSE/e4.4/features/org.codehaus.groovy.headless.feature_2.9.3.xx-201806261523-e44.jar
26-Jun-2018 16:55:43 Transfer Time: .2 s - Transfer Rate: 82.5 KB/s
26-Jun-2018 16:55:44 Uploading /opt/bamboo-home/xml-data/build-dir/GRECLIPSE-E44TP-JOB1/Site-org.codehaus.groovy.eclipse/target/site/features/org.codehaus.groovy.jdt.patch_2.9.3.xx-201806261523-e44.jar (9.4 KB) to s3://dist.springsource.org/snapshot/GRECLIPSE/e4.4/features/org.codehaus.groovy.jdt.patch_2.9.3.xx-201806261523-e44.jar
26-Jun-2018 16:55:44 Transfer Time: .2 s - Transfer Rate: 54.9 KB/s
26-Jun-2018 16:55:45 Uploading /opt/bamboo-home/xml-data/build-dir/GRECLIPSE-E44TP-JOB1/Site-org.codehaus.groovy.eclipse/target/site/features/org.codehaus.groovy.m2eclipse.feature_2.9.3.xx-201806261523-e44.jar (15.0 KB) to s3://dist.springsource.org/snapshot/GRECLIPSE/e4.4/features/org.codehaus.groovy.m2eclipse.feature_2.9.3.xx-201806261523-e44.jar
26-Jun-2018 16:55:45 Transfer Time: .2 s - Transfer Rate: 65.9 KB/s
26-Jun-2018 16:55:45 Uploading /opt/bamboo-home/xml-data/build-dir/GRECLIPSE-E44TP-JOB1/Site-org.codehaus.groovy.eclipse/target/site/features/org.codehaus.groovy18.feature_2.9.3.xx-201806261523-e44.jar (15.1 KB) to s3://dist.springsource.org/snapshot/GRECLIPSE/e4.4/features/org.codehaus.groovy18.feature_2.9.3.xx-201806261523-e44.jar
26-Jun-2018 16:55:45 Transfer Time: .2 s - Transfer Rate: 89.4 KB/s
26-Jun-2018 16:55:46 Uploading /opt/bamboo-home/xml-data/build-dir/GRECLIPSE-E44TP-JOB1/Site-org.codehaus.groovy.eclipse/target/site/features/org.codehaus.groovy20.feature_2.9.3.xx-201806261523-e44.jar (15.1 KB) to s3://dist.springsource.org/snapshot/GRECLIPSE/e4.4/features/org.codehaus.groovy20.feature_2.9.3.xx-201806261523-e44.jar
26-Jun-2018 16:55:46 Transfer Time: .2 s - Transfer Rate: 85.3 KB/s
26-Jun-2018 16:55:47 Uploading /opt/bamboo-home/xml-data/build-dir/GRECLIPSE-E44TP-JOB1/Site-org.codehaus.groovy.eclipse/target/site/features/org.codehaus.groovy21.feature_2.9.3.xx-201806261523-e44.jar (15.1 KB) to s3://dist.springsource.org/snapshot/GRECLIPSE/e4.4/features/org.codehaus.groovy21.feature_2.9.3.xx-201806261523-e44.jar
26-Jun-2018 16:55:47 Transfer Time: .2 s - Transfer Rate: 88.8 KB/s
26-Jun-2018 16:55:47 Uploading /opt/bamboo-home/xml-data/build-dir/GRECLIPSE-E44TP-JOB1/Site-org.codehaus.groovy.eclipse/target/site/features/org.codehaus.groovy22.feature_2.9.3.xx-201806261523-e44.jar (15.1 KB) to s3://dist.springsource.org/snapshot/GRECLIPSE/e4.4/features/org.codehaus.groovy22.feature_2.9.3.xx-201806261523-e44.jar
26-Jun-2018 16:55:47 Transfer Time: .2 s - Transfer Rate: 75.1 KB/s
26-Jun-2018 16:55:48 Uploading /opt/bamboo-home/xml-data/build-dir/GRECLIPSE-E44TP-JOB1/Site-org.codehaus.groovy.eclipse/target/site/features/org.codehaus.groovy23.feature_2.9.3.xx-201806261523-e44.jar (15.1 KB) to s3://dist.springsource.org/snapshot/GRECLIPSE/e4.4/features/org.codehaus.groovy23.feature_2.9.3.xx-201806261523-e44.jar
26-Jun-2018 16:55:48 Transfer Time: .2 s - Transfer Rate: 60.9 KB/s
26-Jun-2018 16:55:49 Uploading /opt/bamboo-home/xml-data/build-dir/GRECLIPSE-E44TP-JOB1/Site-org.codehaus.groovy.eclipse/target/site/features/org.codehaus.groovy24.feature_2.9.3.xx-201806261523-e44.jar (14.9 KB) to s3://dist.springsource.org/snapshot/GRECLIPSE/e4.4/features/org.codehaus.groovy24.feature_2.9.3.xx-201806261523-e44.jar
26-Jun-2018 16:55:49 Transfer Time: .3 s - Transfer Rate: 58.5 KB/s
26-Jun-2018 16:55:49 Uploading /opt/bamboo-home/xml-data/build-dir/GRECLIPSE-E44TP-JOB1/Site-org.codehaus.groovy.eclipse/target/site/features/org.codehaus.groovy25.feature_2.9.3.xx-201806261523-e44.jar (14.9 KB) to s3://dist.springsource.org/snapshot/GRECLIPSE/e4.4/features/org.codehaus.groovy25.feature_2.9.3.xx-201806261523-e44.jar
26-Jun-2018 16:55:49 Transfer Time: .2 s - Transfer Rate: 85.3 KB/s
26-Jun-2018 16:55:50 Uploading /opt/bamboo-home/xml-data/build-dir/GRECLIPSE-E44TP-JOB1/Site-org.codehaus.groovy.eclipse/target/site/org.codehaus.groovy-2.9.3.xx-201806261523-e44-updatesite.zip.md5 (.0 KB) to s3://dist.springsource.org/snapshot/GRECLIPSE/e4.4/org.codehaus.groovy-2.9.3.xx-201806261523-e44-updatesite.zip.md5
26-Jun-2018 16:55:50 Transfer Time: .2 s - Transfer Rate: .2 KB/s
26-Jun-2018 16:55:50 Uploading /opt/bamboo-home/xml-data/build-dir/GRECLIPSE-E44TP-JOB1/Site-org.codehaus.groovy.eclipse/target/site/org.codehaus.groovy-2.9.3.xx-201806261523-e44-updatesite.zip.sha1 (.0 KB) to s3://dist.springsource.org/snapshot/GRECLIPSE/e4.4/org.codehaus.groovy-2.9.3.xx-201806261523-e44-updatesite.zip.sha1
26-Jun-2018 16:55:50 Transfer Time: .2 s - Transfer Rate: .2 KB/s
26-Jun-2018 16:55:51 Uploading /opt/bamboo-home/xml-data/build-dir/GRECLIPSE-E44TP-JOB1/Site-org.codehaus.groovy.eclipse/target/site/plugins/org.codehaus.groovy.eclipse.ant_2.9.3.xx-201806261523-e44.jar (11.1 KB) to s3://dist.springsource.org/snapshot/GRECLIPSE/e4.4/plugins/org.codehaus.groovy.eclipse.ant_2.9.3.xx-201806261523-e44.jar
26-Jun-2018 16:55:51 Transfer Time: .2 s - Transfer Rate: 60.8 KB/s
26-Jun-2018 16:55:51 Uploading /opt/bamboo-home/xml-data/build-dir/GRECLIPSE-E44TP-JOB1/Site-org.codehaus.groovy.eclipse/target/site/plugins/org.codehaus.groovy.eclipse.astviews_2.9.3.xx-201806261523-e44.jar (68.9 KB) to s3://dist.springsource.org/snapshot/GRECLIPSE/e4.4/plugins/org.codehaus.groovy.eclipse.astviews_2.9.3.xx-201806261523-e44.jar
26-Jun-2018 16:55:51 Transfer Time: .3 s - Transfer Rate: 274.6 KB/s
26-Jun-2018 16:55:52 Uploading /opt/bamboo-home/xml-data/build-dir/GRECLIPSE-E44TP-JOB1/Site-org.codehaus.groovy.eclipse/target/site/plugins/org.codehaus.groovy.eclipse.codeassist.completion_2.9.3.xx-201806261523-e44.jar (234.4 KB) to s3://dist.springsource.org/snapshot/GRECLIPSE/e4.4/plugins/org.codehaus.groovy.eclipse.codeassist.completion_2.9.3.xx-201806261523-e44.jar
26-Jun-2018 16:55:52 Transfer Time: .3 s - Transfer Rate: 697.6 KB/s
26-Jun-2018 16:55:52 Uploading /opt/bamboo-home/xml-data/build-dir/GRECLIPSE-E44TP-JOB1/Site-org.codehaus.groovy.eclipse/target/site/plugins/org.codehaus.groovy.eclipse.codebrowsing_2.9.3.xx-201806261523-e44.jar (82.1 KB) to s3://dist.springsource.org/snapshot/GRECLIPSE/e4.4/plugins/org.codehaus.groovy.eclipse.codebrowsing_2.9.3.xx-201806261523-e44.jar
26-Jun-2018 16:55:53 Transfer Time: .2 s - Transfer Rate: 461.4 KB/s
26-Jun-2018 16:55:53 Uploading /opt/bamboo-home/xml-data/build-dir/GRECLIPSE-E44TP-JOB1/Site-org.codehaus.groovy.eclipse/target/site/plugins/org.codehaus.groovy.eclipse.compilerResolver_2.9.3.xx-201806261523-e44.jar (17.9 KB) to s3://dist.springsource.org/snapshot/GRECLIPSE/e4.4/plugins/org.codehaus.groovy.eclipse.compilerResolver_2.9.3.xx-201806261523-e44.jar
26-Jun-2018 16:55:53 Transfer Time: .2 s - Transfer Rate: 86.4 KB/s
26-Jun-2018 16:55:54 Uploading /opt/bamboo-home/xml-data/build-dir/GRECLIPSE-E44TP-JOB1/Site-org.codehaus.groovy.eclipse/target/site/plugins/org.codehaus.groovy.eclipse.core_2.9.3.xx-201806261523-e44.jar (92.3 KB) to s3://dist.springsource.org/snapshot/GRECLIPSE/e4.4/plugins/org.codehaus.groovy.eclipse.core_2.9.3.xx-201806261523-e44.jar
26-Jun-2018 16:55:54 Transfer Time: .2 s - Transfer Rate: 507.0 KB/s
26-Jun-2018 16:55:54 Uploading /opt/bamboo-home/xml-data/build-dir/GRECLIPSE-E44TP-JOB1/Site-org.codehaus.groovy.eclipse/target/site/plugins/org.codehaus.groovy.eclipse.dsl_2.9.3.xx-201806261523-e44.jar (373.4 KB) to s3://dist.springsource.org/snapshot/GRECLIPSE/e4.4/plugins/org.codehaus.groovy.eclipse.dsl_2.9.3.xx-201806261523-e44.jar
26-Jun-2018 16:55:54 Transfer Time: .3 s - Transfer Rate: 1.2 MB/s
26-Jun-2018 16:55:55 Uploading /opt/bamboo-home/xml-data/build-dir/GRECLIPSE-E44TP-JOB1/Site-org.codehaus.groovy.eclipse/target/site/plugins/org.codehaus.groovy.eclipse.quickfix_2.9.3.xx-201806261523-e44.jar (99.7 KB) to s3://dist.springsource.org/snapshot/GRECLIPSE/e4.4/plugins/org.codehaus.groovy.eclipse.quickfix_2.9.3.xx-201806261523-e44.jar
26-Jun-2018 16:55:55 Transfer Time: .2 s - Transfer Rate: 468.3 KB/s
26-Jun-2018 16:55:55 Uploading /opt/bamboo-home/xml-data/build-dir/GRECLIPSE-E44TP-JOB1/Site-org.codehaus.groovy.eclipse/target/site/plugins/org.codehaus.groovy.eclipse.refactoring_2.9.3.xx-201806261523-e44.jar (251.6 KB) to s3://dist.springsource.org/snapshot/GRECLIPSE/e4.4/plugins/org.codehaus.groovy.eclipse.refactoring_2.9.3.xx-201806261523-e44.jar
26-Jun-2018 16:55:56 Transfer Time: .2 s - Transfer Rate: 1.4 MB/s
26-Jun-2018 16:55:56 Uploading /opt/bamboo-home/xml-data/build-dir/GRECLIPSE-E44TP-JOB1/Site-org.codehaus.groovy.eclipse/target/site/plugins/org.codehaus.groovy.eclipse.ui_2.9.3.xx-201806261523-e44.jar (520.2 KB) to s3://dist.springsource.org/snapshot/GRECLIPSE/e4.4/plugins/org.codehaus.groovy.eclipse.ui_2.9.3.xx-201806261523-e44.jar
26-Jun-2018 16:55:56 Transfer Time: .3 s - Transfer Rate: 1.6 MB/s
26-Jun-2018 16:55:57 Uploading /opt/bamboo-home/xml-data/build-dir/GRECLIPSE-E44TP-JOB1/Site-org.codehaus.groovy.eclipse/target/site/plugins/org.codehaus.groovy.eclipse_2.9.3.xx-201806261523-e44.jar (16.5 KB) to s3://dist.springsource.org/snapshot/GRECLIPSE/e4.4/plugins/org.codehaus.groovy.eclipse_2.9.3.xx-201806261523-e44.jar
26-Jun-2018 16:55:57 Transfer Time: .2 s - Transfer Rate: 92.4 KB/s
26-Jun-2018 16:55:57 Uploading /opt/bamboo-home/xml-data/build-dir/GRECLIPSE-E44TP-JOB1/Site-org.codehaus.groovy.eclipse/target/site/plugins/org.codehaus.groovy.m2eclipse_2.9.3.xx-201806261523-e44.jar (14.1 KB) to s3://dist.springsource.org/snapshot/GRECLIPSE/e4.4/plugins/org.codehaus.groovy.m2eclipse_2.9.3.xx-201806261523-e44.jar
26-Jun-2018 16:55:57 Transfer Time: .2 s - Transfer Rate: 57.9 KB/s
26-Jun-2018 16:55:58 Uploading /opt/bamboo-home/xml-data/build-dir/GRECLIPSE-E44TP-JOB1/Site-org.codehaus.groovy.eclipse/target/site/plugins/org.codehaus.groovy_1.8.9.xx-201806261523-e44.jar (9.7 MB) to s3://dist.springsource.org/snapshot/GRECLIPSE/e4.4/plugins/org.codehaus.groovy_1.8.9.xx-201806261523-e44.jar
26-Jun-2018 16:55:59 Transfer Time: 1.4 s - Transfer Rate: 6.8 MB/s
26-Jun-2018 16:56:00 Uploading /opt/bamboo-home/xml-data/build-dir/GRECLIPSE-E44TP-JOB1/Site-org.codehaus.groovy.eclipse/target/site/plugins/org.codehaus.groovy_2.0.8.xx-201806261523-e44.jar (10.0 MB) to s3://dist.springsource.org/snapshot/GRECLIPSE/e4.4/plugins/org.codehaus.groovy_2.0.8.xx-201806261523-e44.jar
26-Jun-2018 16:56:01 Transfer Time: 1.7 s - Transfer Rate: 6.0 MB/s
26-Jun-2018 16:56:02 Uploading /opt/bamboo-home/xml-data/build-dir/GRECLIPSE-E44TP-JOB1/Site-org.codehaus.groovy.eclipse/target/site/plugins/org.codehaus.groovy_2.1.9.xx-201806261523-e44.jar (10.1 MB) to s3://dist.springsource.org/snapshot/GRECLIPSE/e4.4/plugins/org.codehaus.groovy_2.1.9.xx-201806261523-e44.jar
26-Jun-2018 16:56:03 Transfer Time: 1.8 s - Transfer Rate: 5.7 MB/s
26-Jun-2018 16:56:04 Uploading /opt/bamboo-home/xml-data/build-dir/GRECLIPSE-E44TP-JOB1/Site-org.codehaus.groovy.eclipse/target/site/plugins/org.codehaus.groovy_2.2.2.xx-201806261523-e44.jar (10.7 MB) to s3://dist.springsource.org/snapshot/GRECLIPSE/e4.4/plugins/org.codehaus.groovy_2.2.2.xx-201806261523-e44.jar
26-Jun-2018 16:56:06 Transfer Time: 1.7 s - Transfer Rate: 6.2 MB/s
26-Jun-2018 16:56:06 Uploading /opt/bamboo-home/xml-data/build-dir/GRECLIPSE-E44TP-JOB1/Site-org.codehaus.groovy.eclipse/target/site/plugins/org.codehaus.groovy_2.3.11.xx-201806261523-e44.jar (11.7 MB) to s3://dist.springsource.org/snapshot/GRECLIPSE/e4.4/plugins/org.codehaus.groovy_2.3.11.xx-201806261523-e44.jar
26-Jun-2018 16:56:09 Transfer Time: 2.9 s - Transfer Rate: 4.0 MB/s
26-Jun-2018 16:56:09 Uploading /opt/bamboo-home/xml-data/build-dir/GRECLIPSE-E44TP-JOB1/Site-org.codehaus.groovy.eclipse/target/site/plugins/org.codehaus.groovy_2.4.13.xx-201806261523-e44.jar (11.7 MB) to s3://dist.springsource.org/snapshot/GRECLIPSE/e4.4/plugins/org.codehaus.groovy_2.4.13.xx-201806261523-e44.jar
26-Jun-2018 16:56:11 Transfer Time: 2.1 s - Transfer Rate: 5.6 MB/s
26-Jun-2018 16:56:12 Uploading /opt/bamboo-home/xml-data/build-dir/GRECLIPSE-E44TP-JOB1/Site-org.codehaus.groovy.eclipse/target/site/plugins/org.codehaus.groovy_2.5.0.xx-201806261523-e44.jar (19.7 MB) to s3://dist.springsource.org/snapshot/GRECLIPSE/e4.4/plugins/org.codehaus.groovy_2.5.0.xx-201806261523-e44.jar
26-Jun-2018 16:56:15 Transfer Time: 3.5 s - Transfer Rate: 5.6 MB/s
26-Jun-2018 16:56:16 Uploading /opt/bamboo-home/xml-data/build-dir/GRECLIPSE-E44TP-JOB1/Site-org.codehaus.groovy.eclipse/target/site/plugins/org.eclipse.jdt.core_3.10.2.xx-201806261523-e44.jar (5.4 MB) to s3://dist.springsource.org/snapshot/GRECLIPSE/e4.4/plugins/org.eclipse.jdt.core_3.10.2.xx-201806261523-e44.jar
26-Jun-2018 16:56:17 Transfer Time: 1.1 s - Transfer Rate: 4.9 MB/s
26-Jun-2018 16:56:17 Uploading /opt/bamboo-home/xml-data/build-dir/GRECLIPSE-E44TP-JOB1/Site-org.codehaus.groovy.eclipse/target/site/plugins/org.eclipse.jdt.groovy.core_2.9.3.xx-201806261523-e44.jar (408.4 KB) to s3://dist.springsource.org/snapshot/GRECLIPSE/e4.4/plugins/org.eclipse.jdt.groovy.core_2.9.3.xx-201806261523-e44.jar
26-Jun-2018 16:56:17 Transfer Time: .2 s - Transfer Rate: 1.6 MB/s
26-Jun-2018 16:56:18 Uploading /opt/bamboo-home/xml-data/build-dir/GRECLIPSE-E44TP-JOB1/Site-org.codehaus.groovy.eclipse/target/site/site.xml (3.8 KB) to s3://dist.springsource.org/snapshot/GRECLIPSE/e4.4/site.xml
26-Jun-2018 16:56:18 Transfer Time: .2 s - Transfer Rate: 17.1 KB/s
26-Jun-2018 16:56:18 Uploading /opt/bamboo-home/xml-data/build-dir/GRECLIPSE-E44TP-JOB1/Site-org.codehaus.groovy.eclipse/target/site/org.codehaus.groovy-2.9.3.xx-201806261523-e44-updatesite.zip (90.8 MB) to s3://dist.springsource.org/snapshot/GRECLIPSE/e4.4/org.codehaus.groovy-2.9.3.xx-201806261523-e44-updatesite.zip
26-Jun-2018 16:56:35 Transfer Time: 17.1 s - Transfer Rate: 5.3 MB/s
26-Jun-2018 16:56:35 [INFO] Executed tasks
26-Jun-2018 16:56:35 [INFO] ------------------------------------------------------------------------
26-Jun-2018 16:56:35 [INFO] Reactor Summary:
26-Jun-2018 16:56:35 [INFO]
26-Jun-2018 16:56:35 [INFO] org.codehaus.groovy.eclipse.parent ................ SUCCESS [0.271s]
26-Jun-2018 16:56:35 [INFO] org.codehaus.groovy ............................... SUCCESS [8.856s]
26-Jun-2018 16:56:35 [INFO] org.codehaus.groovy ............................... SUCCESS [5.527s]
26-Jun-2018 16:56:35 [INFO] org.codehaus.groovy ............................... SUCCESS [4.756s]
26-Jun-2018 16:56:35 [INFO] org.codehaus.groovy ............................... SUCCESS [4.822s]
26-Jun-2018 16:56:35 [INFO] org.codehaus.groovy ............................... SUCCESS [5.331s]
26-Jun-2018 16:56:35 [INFO] org.codehaus.groovy ............................... SUCCESS [4.778s]
26-Jun-2018 16:56:35 [INFO] org.codehaus.groovy ............................... SUCCESS [6.110s]
26-Jun-2018 16:56:35 [INFO] org.codehaus.groovy.eclipse.compilerResolver ...... SUCCESS [1.155s]
26-Jun-2018 16:56:35 [INFO] org.eclipse.jdt.core .............................. SUCCESS [19.242s]
26-Jun-2018 16:56:35 [INFO] org.eclipse.jdt.groovy.core ....................... SUCCESS [2.603s]
26-Jun-2018 16:56:35 [INFO] org.codehaus.groovy.eclipse ....................... SUCCESS [0.557s]
26-Jun-2018 16:56:35 [INFO] org.codehaus.groovy.eclipse.core .................. SUCCESS [1.564s]
26-Jun-2018 16:56:35 [INFO] org.codehaus.groovy.eclipse.ant ................... SUCCESS [1.156s]
26-Jun-2018 16:56:35 [INFO] org.codehaus.groovy.eclipse.codebrowsing .......... SUCCESS [1.453s]
26-Jun-2018 16:56:35 [INFO] org.codehaus.groovy.eclipse.refactoring ........... SUCCESS [2.093s]
26-Jun-2018 16:56:35 [INFO] org.codehaus.groovy.eclipse.ui .................... SUCCESS [2.896s]
26-Jun-2018 16:56:35 [INFO] org.codehaus.groovy.eclipse.astviews .............. SUCCESS [3.121s]
26-Jun-2018 16:56:35 [INFO] org.codehaus.groovy.eclipse.codeassist.completion . SUCCESS [2.043s]
26-Jun-2018 16:56:35 [INFO] org.codehaus.groovy.eclipse.dsl ................... SUCCESS [2.615s]
26-Jun-2018 16:56:35 [INFO] org.codehaus.groovy.eclipse.quickfix .............. SUCCESS [1.667s]
26-Jun-2018 16:56:35 [INFO] org.codehaus.groovy18.feature ..................... SUCCESS [0.742s]
26-Jun-2018 16:56:35 [INFO] org.codehaus.groovy20.feature ..................... SUCCESS [0.631s]
26-Jun-2018 16:56:35 [INFO] org.codehaus.groovy21.feature ..................... SUCCESS [0.625s]
26-Jun-2018 16:56:35 [INFO] org.codehaus.groovy22.feature ..................... SUCCESS [0.631s]
26-Jun-2018 16:56:35 [INFO] org.codehaus.groovy23.feature ..................... SUCCESS [0.639s]
26-Jun-2018 16:56:35 [INFO] org.codehaus.groovy24.feature ..................... SUCCESS [0.636s]
26-Jun-2018 16:56:35 [INFO] org.codehaus.groovy25.feature ..................... SUCCESS [0.627s]
26-Jun-2018 16:56:35 [INFO] org.codehaus.groovy.jdt.patch ..................... SUCCESS [0.591s]
26-Jun-2018 16:56:35 [INFO] org.codehaus.groovy.headless.feature .............. SUCCESS [0.787s]
26-Jun-2018 16:56:35 [INFO] org.codehaus.groovy.compilerless.feature .......... SUCCESS [0.913s]
26-Jun-2018 16:56:35 [INFO] org.codehaus.groovy.eclipse.feature ............... SUCCESS [0.735s]
26-Jun-2018 16:56:35 [INFO] org.eclipse.jdt.core.tests.compiler ............... SUCCESS [7.703s]
26-Jun-2018 16:56:35 [INFO] org.eclipse.jdt.core.tests.builder ................ SUCCESS [1.629s]
26-Jun-2018 16:56:35 [INFO] org.eclipse.jdt.groovy.core.tests.compiler ........ SUCCESS [1.328s]
26-Jun-2018 16:56:35 [INFO] org.eclipse.jdt.groovy.core.tests.builder ......... SUCCESS [1.920s]
26-Jun-2018 16:56:35 [INFO] org.codehaus.groovy.eclipse.tests ................. SUCCESS [6.577s]
26-Jun-2018 16:56:35 [INFO] org.codehaus.groovy.eclipse.codeassist.completion.test  SUCCESS [2.893s]
26-Jun-2018 16:56:35 [INFO] org.codehaus.groovy.eclipse.codebrowsing.test ..... SUCCESS [2.185s]
26-Jun-2018 16:56:35 [INFO] org.codehaus.groovy.eclipse.core.test ............. SUCCESS [1.561s]
26-Jun-2018 16:56:35 [INFO] org.codehaus.groovy.eclipse.dsl.tests ............. SUCCESS [2.283s]
26-Jun-2018 16:56:35 [INFO] org.codehaus.groovy.eclipse.junit.test ............ SUCCESS [1.492s]
26-Jun-2018 16:56:35 [INFO] org.codehaus.groovy.eclipse.refactoring.test ...... SUCCESS [3.784s]
26-Jun-2018 16:56:35 [INFO] org.codehaus.groovy.eclipse.quickfix.test ......... SUCCESS [1.787s]
26-Jun-2018 16:56:35 [INFO] org.codehaus.groovy.alltests ...................... SUCCESS [1:30:04.540s]
26-Jun-2018 16:56:35 [INFO] org.codehaus.groovy.alltests.feature .............. SUCCESS [2.207s]
26-Jun-2018 16:56:35 [INFO] org.codehaus.groovy.m2eclipse ..................... SUCCESS [2.202s]
26-Jun-2018 16:56:35 [INFO] org.codehaus.groovy.m2eclipse.feature ............. SUCCESS [0.867s]
26-Jun-2018 16:56:35 [INFO] org.codehaus.groovy.eclipse.site .................. SUCCESS [1:14.760s]
26-Jun-2018 16:56:35 [INFO] ------------------------------------------------------------------------
26-Jun-2018 16:56:35 [INFO] BUILD SUCCESS
26-Jun-2018 16:56:35 [INFO] ------------------------------------------------------------------------
26-Jun-2018 16:56:35 [INFO] Total time: 1:37:45.199s
26-Jun-2018 16:56:35 [INFO] Finished at: Tue Jun 26 16:56:35 UTC 2018
26-Jun-2018 16:56:37 [INFO] Final Memory: 290M/1044M
26-Jun-2018 16:56:37 [INFO] ------------------------------------------------------------------------
26-Jun-2018 16:56:38 Parsing test results under /opt/bamboo-home/xml-data/build-dir/GRECLIPSE-E44TP-JOB1...
26-Jun-2018 16:56:41 Finished task 'Maven 3.x' with result: Success
26-Jun-2018 16:56:41 Running post build plugin 'Docker Container Cleanup'
26-Jun-2018 16:56:41 Running post build plugin 'NCover Results Collector'
26-Jun-2018 16:56:41 Running post build plugin 'Artifactory Release Management Staging'
26-Jun-2018 16:56:41 Running post build plugin 'Artifactory Build Info Copier'
26-Jun-2018 16:56:41 Running post build plugin 'Artifactory Gradle Properties Info Copier'
26-Jun-2018 16:56:41 Running post build plugin 'Clover Results Collector'
26-Jun-2018 16:56:41 Running post build plugin 'npm Cache Cleanup'
26-Jun-2018 16:56:41 Running post build plugin 'Artifact Copier'
26-Jun-2018 16:56:41 Publishing an artifact: Zipped Update Site
26-Jun-2018 16:56:47 Finished publishing of artifact Job artifact: [Zipped Update Site], pattern: [**/*updatesite.zip] anchored at: [Site-org.codehaus.groovy.eclipse/target/site] in 5.805 s
26-Jun-2018 16:56:47 Publishing an artifact: surefire-reports
26-Jun-2018 16:56:49 Finished publishing of artifact Job artifact: [surefire-reports], pattern: [**/target/TEST-*.xml] in 1.799 s
26-Jun-2018 16:56:50 Successfully removed working directory at '/opt/bamboo-home/xml-data/build-dir/GRECLIPSE-E44TP-JOB1'
26-Jun-2018 16:56:50 Finalising the build...
26-Jun-2018 16:56:50 Stopping timer.
26-Jun-2018 16:56:50 Build GRECLIPSE-E44TP-JOB1-806 completed.
26-Jun-2018 16:56:50 Running on server: post build plugin 'NCover Results Collector'
26-Jun-2018 16:56:50 Running on server: post build plugin 'Build Hanging Detection Configuration'
26-Jun-2018 16:56:50 Running on server: post build plugin 'Clover Delta Calculator'
26-Jun-2018 16:56:50 Running on server: post build plugin 'Maven Dependencies Postprocessor'
26-Jun-2018 16:56:50 All post build plugins have finished
26-Jun-2018 16:56:50 Generating build results summary...
26-Jun-2018 16:56:51 Saving build results to disk...
26-Jun-2018 16:56:52 Logging substituted variables...
26-Jun-2018 16:56:52 Indexing build results...
26-Jun-2018 16:56:52 Finished building GRECLIPSE-E44TP-JOB1-806.