Build and publish master for Eclipse 4.7

Build result summary

Details

Completed
Duration
108 minutes
Labels
None
Agent
bamboo-02.af.pivotal.io
Revision
6aaf292e06d40ef5f2aa482c415eebe7b0f0c325 6aaf292e06d40ef5f2aa482c415eebe7b0f0c325
Total tests
5463
Fixed in
#287 (Changes by Eric Milles <eric.milles@thomsonreuters.com>)

Responsible

No one has taken responsibility for this failure

Code commits

Author Commit Message Commit date
Eric Milles <eric.milles@thomsonreuters.com> Eric Milles <eric.milles@thomsonreuters.com> 6aaf292e06d40ef5f2aa482c415eebe7b0f0c325 6aaf292e06d40ef5f2aa482c415eebe7b0f0c325 Fix for #670: Call setCurrentScope then setPrimaryNode in DSLDTypeLookup

Tests

New test failures 9
Status Test View job Duration
Collapse Failed SyntheticAccessorRenamingTests testSingleFileRename1 History
Default Job 1 sec
java.lang.AssertionError: Refactoring produced unexpected results:
-----EXPECTING-----
package p
class First {
  boolean flar
  def run() {
    flar
    getFlar()
(45 more lines...)
Collapse Failed SyntheticAccessorRenamingTests testMultiFileRename1 History
Default Job 1 sec
java.lang.AssertionError: Refactoring produced unexpected results:
-----EXPECTING-----
package q
def f = new p.First()
f.flar
f.getFlar()
f.setFlar()
f.isFlar()
(29 more lines...)
Collapse Failed SyntheticAccessorRenamingTests testIsserOnly History
Default Job 2 secs
org.eclipse.core.runtime.AssertionFailedException: assertion failed: Search for method declaration did not find original element: java.lang.Object isFoo() [in First [in First.groovy [in p [in src [in TestProject]]]]]
	at org.codehaus.groovy.eclipse.refactoring.test.rename.SyntheticAccessorRenamingTests.performRefactoringAndUndo(SyntheticAccessorRenamingTests.groovy:48)
	at org.codehaus.groovy.eclipse.refactoring.test.rename.SyntheticAccessorRenamingTests.testIsserOnly(SyntheticAccessorRenamingTests.groovy:410)
Collapse Failed SyntheticAccessorRenamingTests testMultiFileRename2 History
Default Job 1 sec
java.lang.AssertionError: Refactoring produced unexpected results:
-----EXPECTING-----
package q
def f = new p.First()
f.flar
f.getFoo()
f.setFoo()
f.isFoo()
(29 more lines...)
Collapse Failed SyntheticAccessorRenamingTests testSingleFileRename2 History
Default Job 1 sec
java.lang.AssertionError: Refactoring produced unexpected results:
-----EXPECTING-----
package p
class First {
  def flar
  def getFoo() { }
  def setFoo() { }
  def isFoo() { }
(57 more lines...)
Collapse Failed SyntheticAccessorRenamingTests testGetterOnly History
Default Job 1 sec
org.eclipse.core.runtime.AssertionFailedException: assertion failed: Search for method declaration did not find original element: java.lang.Object getFoo() [in First [in First.groovy [in p [in src [in TestProject]]]]]
	at org.codehaus.groovy.eclipse.refactoring.test.rename.SyntheticAccessorRenamingTests.performRefactoringAndUndo(SyntheticAccessorRenamingTests.groovy:48)
	at org.codehaus.groovy.eclipse.refactoring.test.rename.SyntheticAccessorRenamingTests.testGetterOnly(SyntheticAccessorRenamingTests.groovy:355)
Collapse Failed SyntheticAccessorRenamingTests testJavaRename2 History
Default Job 1 sec
java.lang.AssertionError: Refactoring produced unexpected results:
-----EXPECTING-----
package q;
class Java {
  void l() {
    p.First f = new p.First();
    f.flar = null;
    f.getFoo();
(45 more lines...)
Collapse Failed SyntheticAccessorRenamingTests testJavaRename1 History
Default Job 1 sec
java.lang.AssertionError: Refactoring produced unexpected results:
-----EXPECTING-----
package q;
class Java {
  void l() {
    p.First f = new p.First();
    f.flar = null;
    f.getFlar();
(45 more lines...)
Collapse Failed SyntheticAccessorRenamingTests testSetterOnly History
Default Job 10 secs
org.eclipse.core.runtime.AssertionFailedException: assertion failed: Search for method declaration did not find original element: java.lang.Object setFoo() [in First [in First.groovy [in p [in src [in TestProject]]]]]
	at org.codehaus.groovy.eclipse.refactoring.test.rename.SyntheticAccessorRenamingTests.performRefactoringAndUndo(SyntheticAccessorRenamingTests.groovy:48)
	at org.codehaus.groovy.eclipse.refactoring.test.rename.SyntheticAccessorRenamingTests.testSetterOnly(SyntheticAccessorRenamingTests.groovy:465)