Eclipse Oxygen

Build: #285 failed Changes by Eric Milles

Test results

  • 5,463 tests in total
  • 9 tests failed
  • 9 failures are new
  • 136 tests were quarantined / skipped
  • 99 minutes taken in total.
New test failures 9
Status Test View job Duration
Collapse Failed SyntheticAccessorRenamingTests testSingleFileRename1 History
Default Job 1 sec
java.lang.AssertionError: Refactoring produced unexpected results:
-----EXPECTING-----
package p
class First {
  boolean flar
  def run() {
    flar
    getFlar()
(45 more lines...)
Collapse Failed SyntheticAccessorRenamingTests testMultiFileRename1 History
Default Job 1 sec
java.lang.AssertionError: Refactoring produced unexpected results:
-----EXPECTING-----
package q
def f = new p.First()
f.flar
f.getFlar()
f.setFlar()
f.isFlar()
(29 more lines...)
Collapse Failed SyntheticAccessorRenamingTests testIsserOnly History
Default Job 2 secs
org.eclipse.core.runtime.AssertionFailedException: assertion failed: Search for method declaration did not find original element: java.lang.Object isFoo() [in First [in First.groovy [in p [in src [in TestProject]]]]]
	at org.codehaus.groovy.eclipse.refactoring.test.rename.SyntheticAccessorRenamingTests.performRefactoringAndUndo(SyntheticAccessorRenamingTests.groovy:48)
	at org.codehaus.groovy.eclipse.refactoring.test.rename.SyntheticAccessorRenamingTests.testIsserOnly(SyntheticAccessorRenamingTests.groovy:410)
Collapse Failed SyntheticAccessorRenamingTests testMultiFileRename2 History
Default Job 1 sec
java.lang.AssertionError: Refactoring produced unexpected results:
-----EXPECTING-----
package q
def f = new p.First()
f.flar
f.getFoo()
f.setFoo()
f.isFoo()
(29 more lines...)
Collapse Failed SyntheticAccessorRenamingTests testSingleFileRename2 History
Default Job 1 sec
java.lang.AssertionError: Refactoring produced unexpected results:
-----EXPECTING-----
package p
class First {
  def flar
  def getFoo() { }
  def setFoo() { }
  def isFoo() { }
(57 more lines...)
Collapse Failed SyntheticAccessorRenamingTests testGetterOnly History
Default Job 1 sec
org.eclipse.core.runtime.AssertionFailedException: assertion failed: Search for method declaration did not find original element: java.lang.Object getFoo() [in First [in First.groovy [in p [in src [in TestProject]]]]]
	at org.codehaus.groovy.eclipse.refactoring.test.rename.SyntheticAccessorRenamingTests.performRefactoringAndUndo(SyntheticAccessorRenamingTests.groovy:48)
	at org.codehaus.groovy.eclipse.refactoring.test.rename.SyntheticAccessorRenamingTests.testGetterOnly(SyntheticAccessorRenamingTests.groovy:355)
Collapse Failed SyntheticAccessorRenamingTests testJavaRename2 History
Default Job 1 sec
java.lang.AssertionError: Refactoring produced unexpected results:
-----EXPECTING-----
package q;
class Java {
  void l() {
    p.First f = new p.First();
    f.flar = null;
    f.getFoo();
(45 more lines...)
Collapse Failed SyntheticAccessorRenamingTests testJavaRename1 History
Default Job 1 sec
java.lang.AssertionError: Refactoring produced unexpected results:
-----EXPECTING-----
package q;
class Java {
  void l() {
    p.First f = new p.First();
    f.flar = null;
    f.getFlar();
(45 more lines...)
Collapse Failed SyntheticAccessorRenamingTests testSetterOnly History
Default Job 10 secs
org.eclipse.core.runtime.AssertionFailedException: assertion failed: Search for method declaration did not find original element: java.lang.Object setFoo() [in First [in First.groovy [in p [in src [in TestProject]]]]]
	at org.codehaus.groovy.eclipse.refactoring.test.rename.SyntheticAccessorRenamingTests.performRefactoringAndUndo(SyntheticAccessorRenamingTests.groovy:48)
	at org.codehaus.groovy.eclipse.refactoring.test.rename.SyntheticAccessorRenamingTests.testSetterOnly(SyntheticAccessorRenamingTests.groovy:465)
Skipped tests 100
Status Test Failing since View job
Skipped ConstructorCompletionTests testNamedArgumentTrigger2 History
Default Job
Skipped DefaultGroovyMethodCompletionTests testDateGM History
Default Job
Skipped MethodCompletionTests testMethodPointer2a History
Default Job
Skipped MethodCompletionTests testMethodPointer1a History
Default Job
Skipped MethodCompletionTests testMethodPointer4a History
Default Job
Skipped MethodCompletionTests testMethodPointer3a History
Default Job
Skipped RelevanceTests testNewMethodThenModifier History
Default Job
Skipped CodeSelectTypesTests testSelectPackageOnFullyQualifiedName7a History
Default Job
Skipped CodeSelectTypesTests testSelectPackageOnFullyQualifiedName7 History
Default Job
Skipped CodeSelectTypesTests testSelectPackageOnFullyQualifiedName7b History
Default Job
Skipped BuiltInDSLInferencingTests testSwingBuilder1 History
Default Job
Skipped BuiltInDSLInferencingTests testSwingBuilder2 History
Default Job
Skipped DSLContentAssistTests testSwingBuilder1 History
Default Job
Skipped DSLContentAssistTests testSwingBuilder2 History
Default Job
Skipped DSLContentAssistTests testSwingBuilder3 History
Default Job
Skipped MoveCURefactoringTests testInnerMove1 History
Default Job
Skipped MoveCURefactoringTests testInnerMove4 History
Default Job
Skipped MoveCURefactoringTests testInnerMove3 History
Default Job
Skipped MoveCURefactoringTests testInnerMove2 History
Default Job
Skipped RenameMethodTests testDelegate1 History
Default Job
Skipped RenameMethodTests testDelegate2 History
Default Job
Skipped ExpressionFinderTests testNoExpression1 History
Default Job
Skipped ExpressionFinderTests testComplex4 History
Default Job
Skipped SemanticHighlightingTests testVarKeyword4 History
Default Job
Skipped SemanticHighlightingTests testVarKeyword5 History
Default Job
Skipped SemanticHighlightingTests testVarKeyword6 History
Default Job
Skipped SemanticHighlightingTests testAnnoElems2 History
Default Job
Skipped SemanticHighlightingTests testForParams2 History
Default Job
Skipped SemanticHighlightingTests testForParams3 History
Default Job
Skipped SemanticHighlightingTests testForParams History
Default Job
Skipped SemanticHighlightingTests testVarKeyword7 History
Default Job
Skipped SemanticHighlightingTests testTailCallMethods History
Default Job
Skipped SemanticHighlightingTests testVarKeyword3 History
Default Job
Skipped BasicGroovyBuildTests testUpdateProjectPreferences History
Default Job
Skipped BasicGroovyBuildTests testScriptSupport History
Default Job
Skipped BasicGroovyBuildTests testBuildClash History
Default Job
Skipped BasicGroovyBuildTests testCompileStatic_1505 History
Default Job
Skipped BasicGroovyBuildTests testCompileStatic_1506 History
Default Job
Skipped BasicGroovyBuildTests testUpdateWkspPreferences History
Default Job
Skipped ASTNodeSourceLocationsTests testMapExpression4 History
Default Job
Skipped SourceLocationsTests testErrorPositionForUnsupportedOperation History
Default Job
Skipped GroovyCompilationUnitTests testAnonymousInner6 History
Default Job
Skipped GroovyCompilationUnitTests testAnonymousInner4 History
Default Job
Skipped GroovyCompilationUnitTests testAnonymousInner5 History
Default Job
Skipped GroovyCompilationUnitTests testAnonymousInner3 History
Default Job
Skipped GroovyCompilationUnitTests testAnonymousInner2 History
Default Job
Skipped GroovyCompilationUnitTests testAnonymousInner1 History
Default Job
Skipped GroovyPartialModelTests testFieldInitializerIsNotMoved2 History
Default Job
Skipped GroovyPartialModelTests testFieldInitializerIsNotMoved1 History
Default Job
Skipped DGMInferencingTests testDGM10 History
Default Job
Skipped DGMInferencingTests testDGSMDeclaring1 History
Default Job
Skipped DGMInferencingTests testDGM43 History
Default Job
Skipped GenericInferencingTests testJira1718 History
Default Job
Skipped GenericInferencingTests testStaticMethod8 History
Default Job
Skipped AnnotationsTests testWildcards10[Java 1.8] History
Default Job
Skipped AnnotationsTests testWildcards12[Java 1.8] History
Default Job
Skipped AnnotationsTests testWildcards10[Java 1.6] History
Default Job
Skipped AnnotationsTests testWildcards12[Java 1.7] History
Default Job
Skipped AnnotationsTests testWildcards10[Java 1.7] History
Default Job
Skipped AnnotationsTests testWildcards12[Java 1.6] History
Default Job
Skipped ErrorRecoveryTests testUnrecoverableErrors_GRE949[Java 1.6] History
Default Job
Skipped ErrorRecoveryTests testParsingNewRecoveryImports3_GRE538[Java 1.8] History
Default Job
Skipped ErrorRecoveryTests testParsingMissingCurlyRecovery1_GRE468[Java 1.7] History
Default Job
Skipped ErrorRecoveryTests testUnrecoverableErrors_GRE949[Java 1.7] History
Default Job
Skipped ErrorRecoveryTests testParsingNewRecoveryImports4_GRE538[Java 1.8] History
Default Job
Skipped ErrorRecoveryTests testParsingMissingCurlyRecovery1_GRE468[Java 1.6] History
Default Job
Skipped ErrorRecoveryTests testParsingNewRecoveryImports5_GRE538[Java 1.6] History
Default Job
Skipped ErrorRecoveryTests testUnrecoverableErrors_GRE949[Java 1.8] History
Default Job
Skipped ErrorRecoveryTests testParsingNewRecoveryImports1_GRE538[Java 1.8] History
Default Job
Skipped ErrorRecoveryTests testParsingMissingCurlyRecovery2_GRE468[Java 1.8] History
Default Job
Skipped ErrorRecoveryTests testParsingNewRecoveryImports3_GRE538[Java 1.6] History
Default Job
Skipped ErrorRecoveryTests testParsingNewRecoveryImports1_GRE538[Java 1.7] History
Default Job
Skipped ErrorRecoveryTests testParsingNewRecoveryImports5_GRE538[Java 1.8] History
Default Job
Skipped ErrorRecoveryTests testParsingNewRecoveryImports1_GRE538[Java 1.6] History
Default Job
Skipped ErrorRecoveryTests testParsingNewRecoveryImports2_GRE538[Java 1.8] History
Default Job
Skipped ErrorRecoveryTests testParsingMissingCurlyRecovery2_GRE468[Java 1.6] History
Default Job
Skipped ErrorRecoveryTests testParsingNewRecoveryImports5_GRE538[Java 1.7] History
Default Job
Skipped ErrorRecoveryTests testParsingMissingCurlyRecovery2_GRE468[Java 1.7] History
Default Job
Skipped ErrorRecoveryTests testParsingNewRecoveryImports2_GRE538[Java 1.6] History
Default Job
Skipped ErrorRecoveryTests testParsingNewRecoveryImports4_GRE538[Java 1.7] History
Default Job
Skipped ErrorRecoveryTests testParsingNewRecoveryImports2_GRE538[Java 1.7] History
Default Job
Skipped ErrorRecoveryTests testParsingNewRecoveryImports4_GRE538[Java 1.6] History
Default Job
Skipped ErrorRecoveryTests testParsingMissingCurlyRecovery1_GRE468[Java 1.8] History
Default Job
Skipped ErrorRecoveryTests testParsingNewRecoveryImports3_GRE538[Java 1.7] History
Default Job
Skipped GenericsTests testExtendingGenerics_GroovyExtendsJava4[Java 1.8] History
Default Job
Skipped GenericsTests testGenericsPositions_6_GRE267[Java 1.7] History
Default Job
Skipped GenericsTests testGenericsPositions_6_GRE267[Java 1.6] History
Default Job
Skipped GenericsTests testDisablingGenericsWarnings[Java 1.6] History
Default Job
Skipped GenericsTests testExtendingGenerics_GroovyExtendsJava5[Java 1.8] History
Default Job
Skipped GenericsTests testExtendingGenerics_GroovyExtendsJava5a[Java 1.8] History
Default Job
Skipped GenericsTests testJava7_3[Java 1.7] History
Default Job
Skipped GenericsTests testGenericsPositions_6_GRE267[Java 1.8] History
Default Job
Skipped GenericsTests testJava7_3[Java 1.8] History
Default Job
Skipped GenericsTests testJava7_2[Java 1.7] History
Default Job
Skipped GenericsTests testDisablingGenericsWarnings[Java 1.8] History
Default Job
Skipped GenericsTests testJava7_2[Java 1.8] History
Default Job
Skipped GenericsTests testDisablingGenericsWarnings[Java 1.7] History
Default Job
Skipped GenericsTests testJava7[Java 1.6] History
Default Job
Skipped GroovySimpleTests testCrashingOnBadCode_GRE290[Java 1.8] History
Default Job
Skipped GroovySimpleTests testClash_GRE1076_2[Java 1.8] History
Default Job