Eclipse Oxygen

Build: #366 failed Changes by Eric Milles

Build result summary

Details

Completed
Duration
114 minutes
Labels
None
Agent
bamboo-07.af.pivotal.io
Revision
105ce55230fa81faa79fdce6c262f89274158c0b 105ce55230fa81faa79fdce6c262f89274158c0b
Total tests
5638
Fixed in
#371 (Changes by Eric Milles)

Responsible

No one has taken responsibility for this failure

Code commits

Author Commit Message Commit date
Eric Milles Eric Milles 105ce55230fa81faa79fdce6c262f89274158c0b 105ce55230fa81faa79fdce6c262f89274158c0b Minor fix-ups

Tests

New test failures 2
Status Test View job Duration
Collapse Failed BasicGroovyBuildTests testNoDoubleResolve History
Default Job < 1 sec
java.lang.AssertionError
	at org.eclipse.jdt.core.groovy.tests.builder.BasicGroovyBuildTests.testNoDoubleResolve(BasicGroovyBuildTests.java:2639)
Collapse Failed ClosureInferencingTests testWithAndClosure3 History
Default Job < 1 sec
java.lang.AssertionError: Expected type not found.
Expected: java.lang.Void
Found: java.lang.String
Declaring type: null
ASTNode: org.codehaus.groovy.ast.expr.VariableExpression@116144[variable: foo]
Confidence: UNKNOWN

java.lang.AssertionError: 
(8 more lines...)