Eclipse Oxygen

Build: #404 failed Changes by Eric Milles

Build result summary

Details

Completed
Duration
110 minutes
Labels
None
Agent
bamboo-01.af.pivotal.io
Revision
726c1528f5a94c597b0ba25f5dce04bfdfb15dc5 726c1528f5a94c597b0ba25f5dce04bfdfb15dc5
Total tests
5123
Failing since
#402 (Changes by Eric Milles)
Fixed in
#405 (Changes by Eric Milles)

Responsible

Code commits

Author Commit Message Commit date
Eric Milles Eric Milles 726c1528f5a94c597b0ba25f5dce04bfdfb15dc5 726c1528f5a94c597b0ba25f5dce04bfdfb15dc5 Fix for #761: prevent visitation exception

Tests

New test failures 2
Status Test View job Duration
Collapse Failed DGMInferencingTests testEachOnNonIterables1 History
Default Job < 1 sec
org.eclipse.core.runtime.AssertionFailedException: assertion failed: Current builder: org.eclipse.jdt.internal.core.builder.JavaBuilder, new builder: org.eclipse.jdt.internal.core.builder.JavaBuilder, configuration: Project; []
Collapse Failed InferencingTests testStaticMethodCall7 History
Default Job < 1 sec
java.lang.AssertionError: Expected type not found.
Expected: java.util.Collection
Found: java.lang.Object
Declaring type: Search
ASTNode: org.codehaus.groovy.ast.expr.MethodCallExpression@eedbb[object: org.codehaus.groovy.ast.expr.VariableExpression@d9f41[variable: this] method: ConstantExpression[meth] arguments: org.codehaus.groovy.ast.expr.ArgumentListExpression@f007f[org.codehaus.groovy.ast.expr.ListExpression@f007f[]]]
Confidence: EXACT

java.lang.AssertionError: 
(8 more lines...)
Fixed tests 1
Status Test Failing since View job Duration
Successful BasicGroovyBuildTests testProjectBasedirAsOutputLocation History
Failing since build #403 (Changes by Eric Milles) Default Job < 1 sec