Eclipse Oxygen

Build: #487 failed Changes by Eric Milles

Build result summary

Details

Completed
Duration
102 minutes
Labels
None
Agent
bamboo-12.af.pivotal.io
Revision
cc907441e78da42e3ffcbb5815c664d6960030ee cc907441e78da42e3ffcbb5815c664d6960030ee
Total tests
5434
Failing since
#481 (Changes by Eric Milles)
Fixed in
#496 (Changes by Eric Milles)

Responsible

Code commits

Author Commit Message Commit date
Eric Milles Eric Milles cc907441e78da42e3ffcbb5815c664d6960030ee cc907441e78da42e3ffcbb5815c664d6960030ee fix for test
Eric Milles Eric Milles 36590e8f95b6fb75324c665eb4c5ea5df24ec31c 36590e8f95b6fb75324c665eb4c5ea5df24ec31c Fix for #797: index potential constructor refs from "type" method calls

Tests

New test failures 3
Status Test View job Duration
Collapse Failed BasicGroovyBuildTests testProjectCompilerConfigScript History
Default Job < 1 sec
org.junit.ComparisonFailure: unexpected recompiled units. lenExpected=1 lenActual=2 expected:<{foo.Bar[]}> but was:<{foo.Bar[,foo.Bar]}>
	at org.eclipse.jdt.core.groovy.tests.builder.BasicGroovyBuildTests.testProjectCompilerConfigScript(BasicGroovyBuildTests.java:275)
Collapse Failed BasicGroovyBuildTests testNPEAnno_1398 History
Default Job < 1 sec
org.eclipse.core.runtime.AssertionFailedException: assertion failed: Current builder: org.eclipse.jdt.internal.core.builder.JavaBuilder, new builder: org.eclipse.jdt.internal.core.builder.JavaBuilder, configuration: Project; []
	at org.eclipse.jdt.core.groovy.tests.builder.BasicGroovyBuildTests.createSimpleProject(BasicGroovyBuildTests.java:84)
	at org.eclipse.jdt.core.groovy.tests.builder.BasicGroovyBuildTests.testNPEAnno_1398(BasicGroovyBuildTests.java:336)
Collapse Failed DGMInferencingTests testDGMClosure21 History
Default Job < 1 sec
java.lang.AssertionError: Expected type not found.
Expected: java.lang.Float
Found: java.lang.Object
Declaring type: Search
ASTNode: org.codehaus.groovy.ast.expr.VariableExpression@f4424[variable: key]
Confidence: INFERRED

java.lang.AssertionError: 
(9 more lines...)
Fixed tests 3
Status Test Failing since View job Duration
Successful ClosureInferencingTests testClosure29 History
Failing since build #486 (Changes by Eric Milles) Default Job < 1 sec
Successful GenericInferencingTests testSet8 History
Failing since build #486 (Changes by Eric Milles) Default Job < 1 sec
Successful MethodReferenceSearchTests testOverloadedMethodReferences5 History
Failing since build #481 (Changes by Eric Milles) Default Job 1 sec