Eclipse Oxygen

Build: #587 failed Changes by Eric Milles

Build result summary

Details

Completed
Duration
104 minutes
Labels
None
Agent
bamboo-13.af.pivotal.io
Revision
220bb7805757431d6b5e00ea0640a298117ecd44 220bb7805757431d6b5e00ea0640a298117ecd44
Total tests
5555
Failing since
#584 (Changes by Eric Milles)

Responsible

Code commits

Author Commit Message Commit date
Eric Milles Eric Milles 220bb7805757431d6b5e00ea0640a298117ecd44 220bb7805757431d6b5e00ea0640a298117ecd44 Missed patch

Tests

New test failures 2
Status Test View job Duration
Collapse Failed BasicGroovyBuildTests testCompileStatic_ArrayArray History
Default Job < 1 sec
org.eclipse.core.runtime.AssertionFailedException: assertion failed: Current builder: org.eclipse.jdt.internal.core.builder.JavaBuilder, new builder: org.eclipse.jdt.internal.core.builder.JavaBuilder, configuration: Project; []
	at org.eclipse.jdt.core.groovy.tests.builder.BasicGroovyBuildTests.createSimpleProject(BasicGroovyBuildTests.java:85)
	at org.eclipse.jdt.core.groovy.tests.builder.BasicGroovyBuildTests.testCompileStatic_ArrayArray(BasicGroovyBuildTests.java:662)
Collapse Failed BinarySearchTests testClassDecl2 History
Default Job 1 sec
java.lang.AssertionError: Expecting 4 matches, but found 0

java.lang.AssertionError: 
Expecting 4 matches, but found 0

	at org.eclipse.jdt.core.groovy.tests.search.BinarySearchTests.assertMatches(BinarySearchTests.java:135)
	at org.eclipse.jdt.core.groovy.tests.search.BinarySearchTests.testClassDecl2(BinarySearchTests.java:168)
Existing test failures 1
Status Test Failing since View job Duration
junit.framework.ComparisonFailure: 
----------- Expected ------------

------------ but was ------------
Problem : Groovy:Groovy compiler error: exception in phase 'instruction selection' in source unit '/opt/bamboo-home/xml-data/build-dir/GRECLIPSE-E47M-JOB1/ide-test/org.codehaus.groovy.alltests/target/work/data/Project/src/p/Main.groovy' unexpected NullpointerException @ line 1, column 0. [ resource : </Project/src/p/Main.groovy> range : <0,1> category : <60> severity : <2>]

--------- Difference is ----------
 expected:<[]> but was:<[Problem : Groovy:Groovy compiler error: exception in phase 'instruction selection' in source unit '/opt/bamboo-home/xml-data/build-dir/GRECLIPSE-E47M-JOB1/ide-test/org.codehaus.groovy.alltests/target/work/data/Project/src/p/Main.groovy' unexpected NullpointerException @ line 1, column 0. [ resource : </Project/src/p/Main.groovy> range : <0,1> category : <60> severity : <2>]
(12 more lines...)
Fixed tests 1
Status Test Failing since View job Duration
Successful ClosureInferencingTests testNestedClosure11 History
Failing since build #586 (Changes by Eric Milles) Default Job < 1 sec