Eclipse Oxygen

Build: #684 failed Changes by Eric Milles

Build result summary

Details

Completed
Duration
104 minutes
Labels
None
Agent
bamboo-18.af.pivotal.io
Revision
092b4aa80e650d0ba2e570e8ca9d863011b3f404 092b4aa80e650d0ba2e570e8ca9d863011b3f404
Total tests
5785
Failing since
#681 (Changes by Eric Milles)

Responsible

Code commits

Author Commit Message Commit date
Eric Milles Eric Milles 092b4aa80e650d0ba2e570e8ca9d863011b3f404 092b4aa80e650d0ba2e570e8ca9d863011b3f404 increment versions

Configuration changes

Plan configuration has changed since the last successful build. See the plan audit log for more details.

Tests

New test failures 2
Status Test View job Duration
Collapse Failed DGMInferencingTests testDGMClosure16 History
Default Job < 1 sec
java.lang.AssertionError: Expected type not found.
Expected: java.util.Date
Found: java.lang.Object
Declaring type: Search
ASTNode: org.codehaus.groovy.ast.expr.VariableExpression@f0f88[variable: val]
Confidence: INFERRED

java.lang.AssertionError: 
(9 more lines...)
Collapse Failed InferencingTests testLocalMethod5 History
Default Job < 1 sec
java.lang.NoClassDefFoundError: org/codehaus/groovy/runtime/DefaultGroovyMethodsSupport
	at org.eclipse.jdt.core.groovy.tests.search.InferencingTests.testLocalMethod5(InferencingTests.java:536)
Caused by: java.lang.ClassNotFoundException: org.codehaus.groovy.runtime.DefaultGroovyMethodsSupport
	at org.eclipse.jdt.core.groovy.tests.search.InferencingTests.testLocalMethod5(InferencingTests.java:536)
Fixed tests 1
Status Test Failing since View job Duration
Successful BuildAccessRulesTests testAccessForExtendsGenerics History
Failing since build #682 (Changes by Eric Milles) Default Job < 1 sec