Eclipse Oxygen

Build: #285 failed

Job: Default Job failed

Stages & jobs

  1. Default Stage

Job result summary

Completed
Duration
108 minutes
Agent
bamboo-02.af.pivotal.io
Revision
6aaf292e06d40ef5f2aa482c415eebe7b0f0c325 6aaf292e06d40ef5f2aa482c415eebe7b0f0c325
Total tests
5463
Fixed in
#287 (Code changes detected)

Tests

  • 5,463 tests in total
  • 9 tests failed
  • 9 failures are new
  • 136 tests were quarantined / skipped
  • 99 minutes taken in total.
New test failures 9
Status Test Duration
Collapse Failed SyntheticAccessorRenamingTests testGetterOnly History
1 sec
org.eclipse.core.runtime.AssertionFailedException: assertion failed: Search for method declaration did not find original element: java.lang.Object getFoo() [in First [in First.groovy [in p [in src [in TestProject]]]]]
	at org.codehaus.groovy.eclipse.refactoring.test.rename.SyntheticAccessorRenamingTests.performRefactoringAndUndo(SyntheticAccessorRenamingTests.groovy:48)
	at org.codehaus.groovy.eclipse.refactoring.test.rename.SyntheticAccessorRenamingTests.testGetterOnly(SyntheticAccessorRenamingTests.groovy:355)
Collapse Failed SyntheticAccessorRenamingTests testIsserOnly History
2 secs
org.eclipse.core.runtime.AssertionFailedException: assertion failed: Search for method declaration did not find original element: java.lang.Object isFoo() [in First [in First.groovy [in p [in src [in TestProject]]]]]
	at org.codehaus.groovy.eclipse.refactoring.test.rename.SyntheticAccessorRenamingTests.performRefactoringAndUndo(SyntheticAccessorRenamingTests.groovy:48)
	at org.codehaus.groovy.eclipse.refactoring.test.rename.SyntheticAccessorRenamingTests.testIsserOnly(SyntheticAccessorRenamingTests.groovy:410)
Collapse Failed SyntheticAccessorRenamingTests testJavaRename1 History
1 sec
java.lang.AssertionError: Refactoring produced unexpected results:
-----EXPECTING-----
package q;
class Java {
  void l() {
    p.First f = new p.First();
    f.flar = null;
    f.getFlar();
(45 more lines...)
Collapse Failed SyntheticAccessorRenamingTests testJavaRename2 History
1 sec
java.lang.AssertionError: Refactoring produced unexpected results:
-----EXPECTING-----
package q;
class Java {
  void l() {
    p.First f = new p.First();
    f.flar = null;
    f.getFoo();
(45 more lines...)
Collapse Failed SyntheticAccessorRenamingTests testMultiFileRename1 History
1 sec
java.lang.AssertionError: Refactoring produced unexpected results:
-----EXPECTING-----
package q
def f = new p.First()
f.flar
f.getFlar()
f.setFlar()
f.isFlar()
(29 more lines...)
Collapse Failed SyntheticAccessorRenamingTests testMultiFileRename2 History
1 sec
java.lang.AssertionError: Refactoring produced unexpected results:
-----EXPECTING-----
package q
def f = new p.First()
f.flar
f.getFoo()
f.setFoo()
f.isFoo()
(29 more lines...)
Collapse Failed SyntheticAccessorRenamingTests testSetterOnly History
10 secs
org.eclipse.core.runtime.AssertionFailedException: assertion failed: Search for method declaration did not find original element: java.lang.Object setFoo() [in First [in First.groovy [in p [in src [in TestProject]]]]]
	at org.codehaus.groovy.eclipse.refactoring.test.rename.SyntheticAccessorRenamingTests.performRefactoringAndUndo(SyntheticAccessorRenamingTests.groovy:48)
	at org.codehaus.groovy.eclipse.refactoring.test.rename.SyntheticAccessorRenamingTests.testSetterOnly(SyntheticAccessorRenamingTests.groovy:465)
Collapse Failed SyntheticAccessorRenamingTests testSingleFileRename1 History
1 sec
java.lang.AssertionError: Refactoring produced unexpected results:
-----EXPECTING-----
package p
class First {
  boolean flar
  def run() {
    flar
    getFlar()
(45 more lines...)
Collapse Failed SyntheticAccessorRenamingTests testSingleFileRename2 History
1 sec
java.lang.AssertionError: Refactoring produced unexpected results:
-----EXPECTING-----
package p
class First {
  def flar
  def getFoo() { }
  def setFoo() { }
  def isFoo() { }
(57 more lines...)

Error summary

The build generated some errors. See the full build log for more details.

*** BUG ***
In pixman_region32_init_rect: Invalid rectangle passed
Set a breakpoint on '_pixman_log_error' to debug

*** BUG ***
In pixman_region32_init_rect: Invalid rectangle passed
Set a breakpoint on '_pixman_log_error' to debug

*** BUG ***
In pixman_region32_init_rect: Invalid rectangle passed
Set a breakpoint on '_pixman_log_error' to debug

*** BUG ***
In pixman_region32_init_rect: Invalid rectangle passed
Set a breakpoint on '_pixman_log_error' to debug

*** BUG ***
In pixman_region32_init_rect: Invalid rectangle passed
Set a breakpoint on '_pixman_log_error' to debug

TypeInferencingVisitorWithRequestor.findMethodNode: no match found for Main.main([Qjava.lang.String;)
TypeInferencingVisitorWithRequestor.findMethodNode: no match found for Main.main([Qjava.lang.String;)
CodeSelectRequestor: Could not proceed due to null declaring type for org.codehaus.groovy.ast.expr.BinaryExpression@ecbea[org.codehaus.groovy.ast.expr.VariableExpression@ecbe3[variable: it]("in" at 1:20:  "in" )org.codehaus.groovy.ast.expr.ListExpression@ee270[]]
CodeSelectRequestor: Could not proceed due to null declaring type for org.codehaus.groovy.ast.expr.RangeExpression@ec09d
CodeSelectRequestor: Could not proceed due to null declaring type for org.codehaus.groovy.ast.expr.RangeExpression@ec09e
TypeInferencingVisitorWithRequestor.findMethodNode: no match found for Type.x(QList<Qjava.util.Date;>;)
TypeInferencingVisitorWithRequestor.findMethodNode: no match found for Type.x(QList<Qjava.lang.Number;>;)
TypeInferencingVisitorWithRequestor.findMethodNode: no match found for Type.x(QList<Qjava.util.Date;>;)
TypeInferencingVisitorWithRequestor.findMethodNode: no match found for Type.x(QList<Qjava.lang.Number;>;)
CodeSelectRequestor: Could not proceed due to null declaring type for ConstantExpression[fff]
CodeSelectRequestor: Could not proceed due to null declaring type for ConstantExpression[fff]
CodeSelectRequestor: Could not proceed due to null declaring type for ConstantExpression[fff]
augment: type Foo having GroovyObject methods added

augment: type Foo having GroovyObject methods added

augment: type Foo having GroovyObject methods added

augment: type Foo having GroovyObject methods added

augment: type Foo having GroovyObject methods added

augment: type Foo having GroovyObject methods added

Waiting for: Java indexing... 4 files to index (/Project)
Waiting for: Java indexing... 4 files to index (/opt/bamboo-home/xml-data/build-dir/GRECLIPSE-E47M-JOB1/ide-test/org.codehaus.groovy.alltests/target/work/plugins/org.eclipse.jdt.groovy.core.tests.builder_3.1.0.xx-201808081857-e47/lib/binGroovySearch.jar)
Waiting for: Java indexing... 4 files to index (/opt/bamboo-home/xml-data/build-dir/GRECLIPSE-E47M-JOB1/ide-test/org.codehaus.groovy.alltests/target/work/plugins/org.eclipse.jdt.groovy.core.tests.builder_3.1.0.xx-201808081857-e47/lib/binGroovySearch.jar)
Waiting for: Java indexing... 4 files to index (/opt/bamboo-home/xml-data/build-dir/GRECLIPSE-E47M-JOB1/ide-test/org.codehaus.groovy.alltests/target/work/plugins/org.eclipse.jdt.groovy.core.tests.builder_3.1.0.xx-201808081857-e47/lib/binGroovySearch.jar)
Waiting for: Java indexing... 24 files to index (/Project)
Waiting for: Java indexing... 4 files to index (/opt/bamboo-home/xml-data/build-dir/GRECLIPSE-E47M-JOB1/ide-test/org.codehaus.groovy.alltests/target/work/plugins/org.eclipse.jdt.groovy.core.tests.builder_3.1.0.xx-201808081857-e47/lib/binGroovySearch.jar)
Waiting for: Java indexing... 24 files to index (/Project)
Waiting for: Java indexing... 23 files to index (/Project)
Waiting for: Java indexing... 8 files to index (/Project)
Waiting for: Java indexing... 6 files to index (/Project)
Waiting for: Flushing content description cache.
Waiting for: Java indexing... 7 files to index (/Project)