Eclipse Oxygen

Build: #684 failed

Job: Default Job failed

Stages & jobs

  1. Default Stage

Job result summary

Completed
Duration
104 minutes
Agent
bamboo-18.af.pivotal.io
Revision
092b4aa80e650d0ba2e570e8ca9d863011b3f404 092b4aa80e650d0ba2e570e8ca9d863011b3f404
Total tests
5785
Failing since
#681 (Code changes detected – )

Tests

  • 5,785 tests in total
  • 2 tests failed
  • 2 failures are new
  • 1 test was fixed
  • 103 tests were quarantined / skipped
  • 99 minutes taken in total.
New test failures 2
Status Test Duration
Collapse Failed DGMInferencingTests testDGMClosure16 History
< 1 sec
java.lang.AssertionError: Expected type not found.
Expected: java.util.Date
Found: java.lang.Object
Declaring type: Search
ASTNode: org.codehaus.groovy.ast.expr.VariableExpression@f0f88[variable: val]
Confidence: INFERRED

java.lang.AssertionError: 
(9 more lines...)
Collapse Failed InferencingTests testLocalMethod5 History
< 1 sec
java.lang.NoClassDefFoundError: org/codehaus/groovy/runtime/DefaultGroovyMethodsSupport
	at org.eclipse.jdt.core.groovy.tests.search.InferencingTests.testLocalMethod5(InferencingTests.java:536)
Caused by: java.lang.ClassNotFoundException: org.codehaus.groovy.runtime.DefaultGroovyMethodsSupport
	at org.eclipse.jdt.core.groovy.tests.search.InferencingTests.testLocalMethod5(InferencingTests.java:536)
Fixed tests 1
Status Test Failing since Duration
Successful BuildAccessRulesTests testAccessForExtendsGenerics History
Failing since build #682 (Code changes detected) < 1 sec

Error summary

The build generated some errors. See the full build log for more details.


(SWT:23595): Gtk-WARNING **: 17:21:30.871: gtk_widget_size_allocate(): attempt to allocate widget with width -3 and height -3

(SWT:23595): Gtk-CRITICAL **: 17:21:33.321: gtk_box_gadget_distribute: assertion 'size >= 0' failed in GtkScrollbar

(SWT:23595): Gtk-WARNING **: 17:21:33.372: Negative content width -1 (allocation 1, extents 1x1) while allocating gadget (node trough, owner GtkProgressBar)

(SWT:23595): Gtk-WARNING **: 17:21:33.372: Negative content width -1 (allocation 1, extents 1x1) while allocating gadget (node trough, owner GtkProgressBar)
TypeInferencingVisitorWithRequestor.findMethodNode: no match found for Foo(QMap.Entry;, Qjava.lang.Object;)
TypeInferencingVisitorWithRequestor.findMethodNode: no match found for Foo(QMap.Entry;)
TypeInferencingVisitorWithRequestor.findMethodNode: no match found for TestUnit53678.y(QOuter.Inner;)
TypeInferencingVisitorWithRequestor.findMethodNode: no match found for TestUnit53678.y(QOuter.Inner;)
TypeInferencingVisitorWithRequestor.findMethodNode: no match found for TestUnit813629.y(QOuter.Inner;)
TypeInferencingVisitorWithRequestor.findMethodNode: no match found for TestUnit813629.y(QOuter.Inner;)
TypeInferencingVisitorWithRequestor.findMethodNode: no match found for Main.main([Qjava.lang.String;)
TypeInferencingVisitorWithRequestor.findMethodNode: no match found for Main.main([Qjava.lang.String;)
CodeSelectRequestor: Could not proceed due to null declaring type for org.codehaus.groovy.ast.expr.BinaryExpression@ecbea[org.codehaus.groovy.ast.expr.VariableExpression@ecbe3[variable: it]("in" at 1:20:  "in" )org.codehaus.groovy.ast.expr.ListExpression@ee270[]]
CodeSelectRequestor: Could not proceed due to null declaring type for org.codehaus.groovy.ast.expr.RangeExpression@ebcdd
CodeSelectRequestor: Could not proceed due to null declaring type for org.codehaus.groovy.ast.expr.RangeExpression@ebcde
TypeInferencingVisitorWithRequestor.findMethodNode: no match found for Type.x(QList<Qjava.util.Date;>;)
TypeInferencingVisitorWithRequestor.findMethodNode: no match found for Type.x(QList<Qjava.lang.Number;>;)
TypeInferencingVisitorWithRequestor.findMethodNode: no match found for Type.x(QList<Qjava.util.Date;>;)
TypeInferencingVisitorWithRequestor.findMethodNode: no match found for Type.x(QList<Qjava.lang.Number;>;)

(SWT:23595): Gtk-WARNING **: 18:30:32.386: Negative content width -1 (allocation 1, extents 1x1) while allocating gadget (node trough, owner GtkProgressBar)

(SWT:23595): Gtk-WARNING **: 18:30:32.386: Negative content width -1 (allocation 1, extents 1x1) while allocating gadget (node trough, owner GtkProgressBar)
CodeSelectRequestor: Could not proceed due to null declaring type for org.codehaus.groovy.ast.expr.ConstantExpression@e8fc6[fff]
CodeSelectRequestor: Could not proceed due to null declaring type for org.codehaus.groovy.ast.expr.ConstantExpression@e8fca[fff]
CodeSelectRequestor: Could not proceed due to null declaring type for org.codehaus.groovy.ast.expr.ConstantExpression@e8fca[fff]

(SWT:23595): Gtk-WARNING **: 18:57:00.558: Negative content width -1 (allocation 1, extents 1x1) while allocating gadget (node trough, owner GtkProgressBar)
Waiting for: Java indexing... 18 files to index (/opt/jdk8u212-b03/jre/lib/rt.jar)
Waiting for: Java indexing... 22 files to index (/Project)
Waiting for: Java indexing... 22 files to index (/Project)
Waiting for: Java indexing... 22 files to index (/Project)
Waiting for: Java indexing... 22 files to index (/Project)
Waiting for: Java indexing... 22 files to index (/Project)
Waiting for: Java indexing... 22 files to index (/Project)

(SWT:23595): Gtk-WARNING **: 19:02:17.220: Negative content width -1 (allocation 1, extents 1x1) while allocating gadget (node trough, owner GtkProgressBar)
Waiting for: Java indexing... 3 files to index (/Project)
Waiting for: Java indexing... 21 files to index (/Project)
Waiting for: Java indexing... 21 files to index (/Project)
Waiting for: Java indexing... 16 files to index (/opt/jdk8u212-b03/jre/lib/rt.jar)