Eclipse Oxygen

Build: #441 failed Changes by Eric Milles

Build result summary

Details

Completed
Duration
102 minutes
Labels
None
Agent
bamboo-03.af.pivotal.io
Revision
337f7d8fe709d0c7d469202425153b6ed1bbfd0c 337f7d8fe709d0c7d469202425153b6ed1bbfd0c
Total tests
5387
Failing since
#440 (Changes by Eric Milles)

Responsible

Code commits

Author Commit Message Commit date
Eric Milles Eric Milles 337f7d8fe709d0c7d469202425153b6ed1bbfd0c 337f7d8fe709d0c7d469202425153b6ed1bbfd0c Fix for #439: de-duplicate variables

Tests

New test failures 6
Status Test View job Duration
Collapse Failed ArrayInferencingTests testArrayProperty7 History
Default Job < 1 sec
org.eclipse.core.runtime.AssertionFailedException: assertion failed: Current builder: org.eclipse.jdt.internal.core.builder.JavaBuilder, new builder: org.eclipse.jdt.internal.core.builder.JavaBuilder, configuration: Project; []
Collapse Failed ClosureInferencingTests testClosure22 History
Default Job < 1 sec
org.eclipse.core.runtime.AssertionFailedException: assertion failed: Current builder: org.eclipse.jdt.internal.core.builder.JavaBuilder, new builder: org.eclipse.jdt.internal.core.builder.JavaBuilder, configuration: Project; []
Collapse Failed DGMInferencingTests testDGM47 History
Default Job < 1 sec
org.eclipse.core.runtime.AssertionFailedException: assertion failed: Current builder: org.eclipse.jdt.internal.core.builder.JavaBuilder, new builder: org.eclipse.jdt.internal.core.builder.JavaBuilder, configuration: Project; []
Collapse Failed DGMInferencingTests testDGMClosure15 History
Default Job < 1 sec
java.lang.AssertionError: Expected type not found.
Expected: java.util.Date
Found: java.lang.Object
Declaring type: Search
ASTNode: org.codehaus.groovy.ast.expr.VariableExpression@f0f88[variable: val]
Confidence: INFERRED

java.lang.AssertionError: 
(9 more lines...)
Collapse Failed DeclarationInferencingTests testGetterAndField13 History
Default Job < 1 sec
org.eclipse.core.runtime.AssertionFailedException: assertion failed: Current builder: org.eclipse.jdt.internal.core.builder.JavaBuilder, new builder: org.eclipse.jdt.internal.core.builder.JavaBuilder, configuration: Project; []
Collapse Failed TypeReferenceSearchTests testFindClassDeclarationWithPattern History
Default Job < 1 sec
java.lang.AssertionError: Number of results found expected:<2> but was:<0>
	at org.eclipse.jdt.core.groovy.tests.search.TypeReferenceSearchTests.testFindClassDeclarationWithPattern(TypeReferenceSearchTests.java:220)
Fixed tests 1
Status Test Failing since View job Duration
Successful MethodReferenceSearchTests testMethodReferencesInClass2 History
Failing since build #440 (Changes by Eric Milles) Default Job 1 sec