Eclipse Photon

Build: #440 failed Changes by Eric Milles

Build result summary

Details

Completed
Duration
96 minutes
Labels
None
Agent
bamboo-13.af.pivotal.io
Revision
263b3c8ba6adc38c9f83b33bed0202486b841a66 263b3c8ba6adc38c9f83b33bed0202486b841a66
Total tests
5236
Fixed in
#442 (Changes by Eric Milles)

Responsible

Code commits

Author Commit Message Commit date
Eric Milles Eric Milles 263b3c8ba6adc38c9f83b33bed0202486b841a66 263b3c8ba6adc38c9f83b33bed0202486b841a66 Fix for #770: propose constructor completions for prefixes of this/super

Tests

New test failures 3
Status Test View job Duration
Collapse Failed BasicGroovyBuildTests testNoDoubleResolve History
Default Job < 1 sec
java.lang.AssertionError
	at org.eclipse.jdt.core.groovy.tests.builder.BasicGroovyBuildTests.testNoDoubleResolve(BasicGroovyBuildTests.java:2648)
Collapse Failed BuildAccessRulesTests testAccessForMethodParameter History
Default Job < 1 sec
junit.framework.ComparisonFailure: 
----------- Expected ------------
Problem : Access restriction: The type 'BeanInfo' is not API (restriction on required library '##') [ resource : </Project/src/Foo.groovy> range : <43,51> category : <150> severity : <2>]

------------ but was ------------

--------- Difference is ----------
 expected:<[Problem : Access restriction: The type 'BeanInfo' is not API (restriction on required library '##') [ resource : </Project/src/Foo.groovy> range : <43,51> category : <150> severity : <2>]
(13 more lines...)
Collapse Failed OperatorOverloadingInferencingTests testLongExpr2 History
Default Job < 1 sec
java.lang.AssertionError: Expected type not found.
Expected: Foo
Found: java.util.List<Foo>
Declaring type: Search
ASTNode: org.codehaus.groovy.ast.expr.VariableExpression@1061bc[variable: xxx]
Confidence: INFERRED

java.lang.AssertionError: 
(8 more lines...)