Eclipse Photon

Build: #704 failed Changes by Eric Milles

Build result summary

Details

Completed
Duration
103 minutes
Labels
None
Agent
bamboo-19.af.pivotal.io
Revision
aa050514e34591f950f1ac177bff87db15354ee0 aa050514e34591f950f1ac177bff87db15354ee0
Total tests
5848
Failing since
#703 (Changes by Eric Milles)
Fixed in
#707 (Changes by Eric Milles)

Responsible

Code commits

Author Commit Message Commit date
Eric Milles Eric Milles aa050514e34591f950f1ac177bff87db15354ee0 aa050514e34591f950f1ac177bff87db15354ee0 Update the Groovy plug-in to 3.0.0-beta-2
#925

Configuration changes

Plan configuration has changed since the last successful build. See the plan audit log for more details.

Tests

New test failures 5
Status Test View job Duration
Collapse Failed SyntheticMemberSearchTests testSearchInGroovy1 History
Default Job 1 sec
java.lang.AssertionError: Wrong number of matches found in:
 expected:<3> but was:<0>
java.lang.AssertionError: 
Wrong number of matches found in:
 expected:<3> but was:<0>
	at org.codehaus.groovy.eclipse.core.test.SyntheticMemberSearchTests.assertNumMatch(SyntheticMemberSearchTests.groovy:291)
	at org.codehaus.groovy.eclipse.core.test.SyntheticMemberSearchTests.testSearchInGroovy1(SyntheticMemberSearchTests.groovy:72)
Collapse Failed SyntheticMemberSearchTests testSearchInJava4 History
Default Job 1 sec
java.lang.AssertionError: Wrong number of matches found in:
 expected:<1> but was:<0>
java.lang.AssertionError: 
Wrong number of matches found in:
 expected:<1> but was:<0>
	at org.codehaus.groovy.eclipse.core.test.SyntheticMemberSearchTests.assertNumMatch(SyntheticMemberSearchTests.groovy:291)
	at org.codehaus.groovy.eclipse.core.test.SyntheticMemberSearchTests.testSearchInJava4(SyntheticMemberSearchTests.groovy:237)
Collapse Failed SyntheticMemberSearchTests testSearchInJava3 History
Default Job 1 sec
java.lang.AssertionError: Wrong number of matches found in:
 expected:<1> but was:<0>
java.lang.AssertionError: 
Wrong number of matches found in:
 expected:<1> but was:<0>
	at org.codehaus.groovy.eclipse.core.test.SyntheticMemberSearchTests.assertNumMatch(SyntheticMemberSearchTests.groovy:291)
	at org.codehaus.groovy.eclipse.core.test.SyntheticMemberSearchTests.testSearchInJava3(SyntheticMemberSearchTests.groovy:215)
Collapse Failed SyntheticMemberSearchTests testSearchInJava2 History
Default Job 1 sec
java.lang.AssertionError: Wrong number of matches found in:
 expected:<1> but was:<0>
java.lang.AssertionError: 
Wrong number of matches found in:
 expected:<1> but was:<0>
	at org.codehaus.groovy.eclipse.core.test.SyntheticMemberSearchTests.assertNumMatch(SyntheticMemberSearchTests.groovy:291)
	at org.codehaus.groovy.eclipse.core.test.SyntheticMemberSearchTests.testSearchInJava2(SyntheticMemberSearchTests.groovy:193)
Collapse Failed SyntheticMemberSearchTests testSearchInJava1 History
Default Job 4 secs
java.lang.AssertionError: Wrong number of matches found in:
 expected:<3> but was:<0>
java.lang.AssertionError: 
Wrong number of matches found in:
 expected:<3> but was:<0>
	at org.codehaus.groovy.eclipse.core.test.SyntheticMemberSearchTests.assertNumMatch(SyntheticMemberSearchTests.groovy:291)
	at org.codehaus.groovy.eclipse.core.test.SyntheticMemberSearchTests.testSearchInJava1(SyntheticMemberSearchTests.groovy:171)
Fixed tests 2
Status Test Failing since View job Duration
Successful BasicGroovyBuildTests testFieldInitializerFromOtherFile History
Failing since build #703 (Changes by Eric Milles) Default Job < 1 sec
Successful BuildAccessRulesTests testAccessForMethodReturnTypeGenerics History
Failing since build #703 (Changes by Eric Milles) Default Job < 1 sec