Eclipse Photon

Build: #648 failed

Job: Default Job failed

Stages & jobs

  1. Default Stage

Build log

The build generated 186 lines of output. Download or view full build log

26-May-2019 16:17:35 Build Groovy-Eclipse - E48 build and publish - Default Job #648 (GRECLIPSE-E48M-JOB1-648) started building on agent bamboo-18.af.pivotal.io
26-May-2019 16:17:35 Remote agent on host bamboo-18.af.pivotal.io
26-May-2019 16:17:35 Build working directory is /opt/bamboo-home/xml-data/build-dir/GRECLIPSE-E48M-JOB1
26-May-2019 16:17:35 Executing build Groovy-Eclipse - E48 build and publish - Default Job #648 (GRECLIPSE-E48M-JOB1-648)
26-May-2019 16:17:35 Starting task 'Checkout Default Repository' of type 'com.atlassian.bamboo.plugins.vcs:task.vcs.checkout'
26-May-2019 16:17:35 Checking out into /opt/bamboo-home/xml-data/build-dir/GRECLIPSE-E48M-JOB1
26-May-2019 16:17:35 Updating source code to revision: c6c421e420a84181b9d400f63f277d71bd7b58a1
26-May-2019 16:17:35 Creating local git repository in '/opt/bamboo-home/xml-data/build-dir/GRECLIPSE-E48M-JOB1/.git'.
26-May-2019 16:17:35 Initialized empty Git repository in /opt/bamboo-home/xml-data/build-dir/GRECLIPSE-E48M-JOB1/.git/
26-May-2019 16:17:36 Fetching 'refs/heads/master' from 'https://github.com/groovy/groovy-eclipse.git'. Will try to do a shallow fetch.
26-May-2019 16:17:53 From https://github.com/groovy/groovy-eclipse
26-May-2019 16:17:53 * [new branch]      master     -> master
26-May-2019 16:17:53 Checking out revision c6c421e420a84181b9d400f63f277d71bd7b58a1.
26-May-2019 16:17:54 Already on 'master'
26-May-2019 16:17:54 Updated source code to revision: c6c421e420a84181b9d400f63f277d71bd7b58a1
26-May-2019 16:17:54 Finished task 'Checkout Default Repository' with result: Success
26-May-2019 16:17:54 Running pre-build action: Artifactory Release Staging
26-May-2019 16:17:54 Running pre-build action: VCS Version Collector
26-May-2019 16:17:54
Substituting variable: ${bamboo.release} with -Psnapshot
26-May-2019 16:17:54
Substituting variable: ${bamboo.s3.properties} with /home/bamboo/tools/s3.properties
26-May-2019 16:17:54 Starting task 'Maven 3.x' of type 'com.atlassian.bamboo.plugins.maven:task.builder.mvn3'
26-May-2019 16:17:54
Beginning to execute external process for build 'Groovy-Eclipse - E48 build and publish - Default Job #648 (GRECLIPSE-E48M-JOB1-648)'
... running command line:
/opt/maven-3.3/bin/mvn --batch-mode -Djava.io.tmpdir=/tmp/GRECLIPSE-E48M-JOB1 -Pe48 clean deploy -Psnapshot
... in: /opt/bamboo-home/xml-data/build-dir/GRECLIPSE-E48M-JOB1
... using extra environment variables:
bamboo_planRepository_1_branch=master
bamboo_********_username_password=********
bamboo_signing_store_password=********
bamboo_capability_system_builder_ant_Ant_1_9=/opt/ant-1.9
bamboo_repository_259751960_git_username=
bamboo_capability_system_builder_ant_Ant_1_8=/opt/ant-1.8
bamboo_planRepository_1_branchDisplayName=master
bamboo_repository_revision_number=c6c421e420a84181b9d400f63f277d71bd7b58a1
MAVEN2_HOME=/opt/maven-3.3
bamboo_RIAK_BIN=/usr/sbin/riak
bamboo_buildKey=GRECLIPSE-E48M-JOB1
bamboo_repository_259751960_revision_number=c6c421e420a84181b9d400f63f277d71bd7b58a1
bamboo_bintray_password=********
bamboo_sonar_token_password=********
bamboo_shortJobName=Default Job
bamboo_capability_system_builder_gradle___gradlew=./gradlew
bamboo_buildResultsUrl=https://build.spring.io/browse/GRECLIPSE-E48M-JOB1-648
bamboo_capability_system_builder_mvn3_Maven_3_3=/opt/maven-3.3
bamboo_capability_system_builder_mvn3_Maven_3_2=/opt/maven-3.2
bamboo_capability_system_builder_mvn3_Maven_3_1=/opt/maven-3.1
bamboo_planRepository_repositoryUrl=https://github.com/groovy/groovy-eclipse.git
bamboo_capability_system_builder_mvn3_Maven_3_6=/opt/maven-3.6
bamboo_agentId=286195716
bamboo_capability_system_builder_mvn3_Maven_3_5=/opt/maven-3.5
bamboo_capability_system_builder_mvn3_Maven_3_0=/opt/maven-3.0
bamboo_repository_259751960_branch_name=master
bamboo_planRepository_revision=c6c421e420a84181b9d400f63f277d71bd7b58a1
bamboo_planRepository_previousRevision=d8d53d2497ae77f8afad2a6905ecb033cc6171d1
bamboo_capability_remote_build=true
bamboo_repository_branch_name=master
bamboo_sonatype_token_password=********
bamboo_scdf_acceptance_tests_password=********
JAVA_HOME=/opt/jdk-8
bamboo_planRepository_branch=master
bamboo_planRepository_1_type=gitv2
bamboo_planRepository_branchName=master
bamboo_capability_system_jdk_JDK_12=/opt/jdk-12
bamboo_capability_system_builder_ant_Ant_1_10=/opt/ant-1.10
bamboo_repository_259751960_git_branch=master
bamboo_repository_259751960_git_repositoryUrl=https://github.com/groovy/groovy-eclipse.git
bamboo_sonar_password=********
bamboo_hg_cache_directory=/opt/bamboo-home/xml-data/build-dir/_hg-repositories-cache
bamboo_planRepository_1_username=
bamboo_planRepository_type=gitv2
bamboo_release=-Psnapshot
bamboo_git_cache_directory=/opt/bamboo-home/xml-data/build-dir/_git-repositories-cache
useMavenReturnCode=false
bamboo_artifactory_username=buildmaster
bamboo_tmp_directory=/opt/bamboo-home/temp
bamboo_planKey=GRECLIPSE-E48M
bamboo_planRepository_username=
bamboo_JDK8_HOME=/opt/jdk-8
bamboo_planRepository_1_branchName=master
bamboo_sonar_version=5.6.3
bamboo_capability_system_jdk_JDK_1_11=/opt/jdk-11
bamboo_resultsUrl=https://build.spring.io/browse/GRECLIPSE-E48M-JOB1-648
bamboo_capability_system_jdk_JDK_1_10=/opt/jdk-10
bamboo_build_working_directory=/opt/bamboo-home/xml-data/build-dir/GRECLIPSE-E48M-JOB1
bamboo_planRepository_1_name=Git
bamboo_capability_system_os=ubuntu1804
bamboo_repository_259751960_name=Git
bamboo_nexusPush_stagingProfile=buildmaster
bamboo_shortPlanName=E48 build and publish
bamboo_planRepository_name=Git
bamboo_buildNumber=648
bamboo_planName=Groovy-Eclipse - E48 build and publish
bamboo_JDK7_HOME=/opt/jdk-7
bamboo_shortPlanKey=E48M
bamboo_shortJobKey=JOB1
bamboo_artifactory_password=********
bamboo_buildTimeStamp=2019-05-26T16:17:35.596Z
bamboo_repository_previous_revision_number=d8d53d2497ae77f8afad2a6905ecb033cc6171d1
bamboo_sonar_username=buildmaster
bamboo_********_password=********
M2_HOME=/opt/maven-3.3
bamboo_repository_git_branch=master
bamboo_buildResultKey=GRECLIPSE-E48M-JOB1-648
bamboo_nexusPush_close=true
bamboo_buildPlanName=Groovy-Eclipse - E48 build and publish - Default Job
bamboo_planRepository_1_revision=c6c421e420a84181b9d400f63f277d71bd7b58a1
bamboo_repository_name=Git
bamboo_signing_key_password=********
bamboo_capability_system_builder_groovy_Groovy_2_5=/opt/groovy-2.5
bamboo_buildFailed=false
bamboo_capability_system_docker_executable=/usr/bin/docker
DISPLAY=:0
bamboo_capability_system_jdk_OpenJDK_7=/opt/jdk-7
bamboo_capability_system_builder_groovy_Groovy_2_4=/opt/groovy-2.4
bamboo_capability_system_builder_command_Bash=/bin/bash
bamboo_agentWorkingDirectory=/opt/bamboo-home/xml-data/build-dir
bamboo_capability_system_git_executable=/usr/bin/git
bamboo_repository_git_username=
bamboo_planRepository_1_previousRevision=d8d53d2497ae77f8afad2a6905ecb033cc6171d1
bamboo_capability_os_family=unix
bamboo_planRepository_branchDisplayName=master
dist_properties=/home/bamboo/tools/s3.properties
bamboo_capability_system_builder_maven_Artifactory_Maven_3_6=/opt/maven-3.6
bamboo_capability_system_builder_maven_Artifactory_Maven_3_5=/opt/maven-3.5
bamboo_capability_system_builder_maven_Artifactory_Maven_3_3=/opt/maven-3.3
bamboo_capability_system_builder_maven_Artifactory_Maven_3_2=/opt/maven-3.2
bamboo_s3_properties=/home/bamboo/tools/s3.properties
bamboo_capability_system_builder_maven_Artifactory_Maven_3_1=/opt/maven-3.1
bamboo_capability_system_builder_maven_Artifactory_Maven_3_0=/opt/maven-3.0
bamboo_plan_storageTag=plan-259555375
bamboo_bintray_username_password=********
bamboo_repository_git_repositoryUrl=https://github.com/groovy/groovy-eclipse.git
bamboo_working_directory=/opt/bamboo-home/xml-data/build-dir/GRECLIPSE-E48M-JOB1
bamboo_repository_259751960_previous_revision_number=d8d53d2497ae77f8afad2a6905ecb033cc6171d1
bamboo_planRepository_1_repositoryUrl=https://github.com/groovy/groovy-eclipse.git
bamboo_capability_system_jdk_JDK_1_8=/opt/jdk-8
bamboo_capability_system_jdk_JDK_1_9=/opt/jdk-9
bamboo_capability_system_jdk_JDK_1_6=/opt/jdk-6
bamboo_sonatype_password=********
bamboo_capability_system_jdk_JDK_1_7=/opt/jdk-7
bamboo_sonar_ip=10.194.6.9
PATH=/opt/jdk-8/bin:/bin:/home/bamboo/bin:/usr/local/sbin:/usr/local/bin:/usr/sbin:/usr/bin:/sbin:/bin:/usr/games:/usr/local/games:/snap/bin:/home/bamboo/bin:/usr/local/bin
26-May-2019 16:17:55 [INFO] Scanning for projects...
26-May-2019 16:17:58 [INFO] Computing target platform for MavenProject: org.codehaus.groovy.eclipse:org.codehaus.groovy:2.4.17-SNAPSHOT @ /opt/bamboo-home/xml-data/build-dir/GRECLIPSE-E48M-JOB1/base/org.codehaus.groovy24/pom.xml
26-May-2019 16:17:59 [INFO] Fetching p2.index from https://download.eclipse.org/releases/photon/
26-May-2019 16:17:59 [INFO] Adding repository https://download.eclipse.org/releases/photon
26-May-2019 16:18:00 [INFO] Fetching compositeContent.jar from https://download.eclipse.org/releases/photon/ (490B)
26-May-2019 16:18:00 [INFO] Fetching compositeContent.jar from https://download.eclipse.org/releases/photon/ (490B)
26-May-2019 16:18:00 May 26, 2019 4:18:00 PM org.apache.http.impl.client.DefaultRequestDirector tryExecute
26-May-2019 16:18:00 INFO: I/O exception (java.net.SocketException) caught when processing request to {}->http://download.eclipse.org:80: Connection reset
26-May-2019 16:18:00 May 26, 2019 4:18:00 PM org.apache.http.impl.client.DefaultRequestDirector tryExecute
26-May-2019 16:18:00 INFO: Retrying request to {}->http://download.eclipse.org:80
26-May-2019 16:18:00 May 26, 2019 4:18:00 PM org.apache.http.impl.client.DefaultRequestDirector tryExecute
26-May-2019 16:18:00 INFO: I/O exception (java.net.SocketException) caught when processing request to {}->http://download.eclipse.org:80: Connection reset
26-May-2019 16:18:00 May 26, 2019 4:18:00 PM org.apache.http.impl.client.DefaultRequestDirector tryExecute
26-May-2019 16:18:00 INFO: Retrying request to {}->http://download.eclipse.org:80
26-May-2019 16:18:00 May 26, 2019 4:18:00 PM org.apache.http.impl.client.DefaultRequestDirector tryExecute
26-May-2019 16:18:00 INFO: I/O exception (java.net.SocketException) caught when processing request to {}->http://download.eclipse.org:80: Connection reset
26-May-2019 16:18:00 May 26, 2019 4:18:00 PM org.apache.http.impl.client.DefaultRequestDirector tryExecute
26-May-2019 16:18:00 INFO: Retrying request to {}->http://download.eclipse.org:80
26-May-2019 16:18:01 May 26, 2019 4:18:01 PM org.apache.http.impl.client.DefaultRequestDirector tryExecute
26-May-2019 16:18:01 INFO: I/O exception (java.net.SocketException) caught when processing request to {}->http://download.eclipse.org:80: Connection reset
26-May-2019 16:18:01 May 26, 2019 4:18:01 PM org.apache.http.impl.client.DefaultRequestDirector tryExecute
26-May-2019 16:18:01 INFO: Retrying request to {}->http://download.eclipse.org:80
26-May-2019 16:18:01 May 26, 2019 4:18:01 PM org.apache.http.impl.client.DefaultRequestDirector tryExecute
26-May-2019 16:18:01 INFO: I/O exception (java.net.SocketException) caught when processing request to {}->http://download.eclipse.org:80: Connection reset
26-May-2019 16:18:01 May 26, 2019 4:18:01 PM org.apache.http.impl.client.DefaultRequestDirector tryExecute
26-May-2019 16:18:01 INFO: Retrying request to {}->http://download.eclipse.org:80
26-May-2019 16:18:01 May 26, 2019 4:18:01 PM org.apache.http.impl.client.DefaultRequestDirector tryExecute
26-May-2019 16:18:01 INFO: I/O exception (java.net.SocketException) caught when processing request to {}->http://download.eclipse.org:80: Connection reset
26-May-2019 16:18:01 May 26, 2019 4:18:01 PM org.apache.http.impl.client.DefaultRequestDirector tryExecute
26-May-2019 16:18:01 INFO: Retrying request to {}->http://download.eclipse.org:80
26-May-2019 16:18:02 May 26, 2019 4:18:02 PM org.apache.http.impl.client.DefaultRequestDirector tryExecute
26-May-2019 16:18:02 INFO: I/O exception (java.net.SocketException) caught when processing request to {}->http://download.eclipse.org:80: Connection reset
26-May-2019 16:18:02 May 26, 2019 4:18:02 PM org.apache.http.impl.client.DefaultRequestDirector tryExecute
26-May-2019 16:18:02 INFO: Retrying request to {}->http://download.eclipse.org:80
26-May-2019 16:18:02 May 26, 2019 4:18:02 PM org.apache.http.impl.client.DefaultRequestDirector tryExecute
26-May-2019 16:18:02 INFO: I/O exception (java.net.SocketException) caught when processing request to {}->http://download.eclipse.org:80: Connection reset
26-May-2019 16:18:02 May 26, 2019 4:18:02 PM org.apache.http.impl.client.DefaultRequestDirector tryExecute
26-May-2019 16:18:02 INFO: Retrying request to {}->http://download.eclipse.org:80
26-May-2019 16:18:02 May 26, 2019 4:18:02 PM org.apache.http.impl.client.DefaultRequestDirector tryExecute
26-May-2019 16:18:02 INFO: I/O exception (java.net.SocketException) caught when processing request to {}->http://download.eclipse.org:80: Connection reset
26-May-2019 16:18:02 May 26, 2019 4:18:02 PM org.apache.http.impl.client.DefaultRequestDirector tryExecute
26-May-2019 16:18:02 INFO: Retrying request to {}->http://download.eclipse.org:80
26-May-2019 16:18:02 May 26, 2019 4:18:02 PM org.apache.http.impl.client.DefaultRequestDirector tryExecute
26-May-2019 16:18:02 INFO: I/O exception (java.net.SocketException) caught when processing request to {}->http://download.eclipse.org:80: Connection reset
26-May-2019 16:18:02 May 26, 2019 4:18:02 PM org.apache.http.impl.client.DefaultRequestDirector tryExecute
26-May-2019 16:18:02 INFO: Retrying request to {}->http://download.eclipse.org:80
26-May-2019 16:18:04 May 26, 2019 4:18:04 PM org.apache.http.impl.client.DefaultRequestDirector tryExecute
26-May-2019 16:18:04 INFO: I/O exception (java.net.SocketException) caught when processing request to {}->http://download.eclipse.org:80: Connection reset
26-May-2019 16:18:04 May 26, 2019 4:18:04 PM org.apache.http.impl.client.DefaultRequestDirector tryExecute
26-May-2019 16:18:04 INFO: Retrying request to {}->http://download.eclipse.org:80
26-May-2019 16:18:04 May 26, 2019 4:18:04 PM org.apache.http.impl.client.DefaultRequestDirector tryExecute
26-May-2019 16:18:04 INFO: I/O exception (java.net.SocketException) caught when processing request to {}->http://download.eclipse.org:80: Connection reset
26-May-2019 16:18:04 May 26, 2019 4:18:04 PM org.apache.http.impl.client.DefaultRequestDirector tryExecute
26-May-2019 16:18:04 INFO: Retrying request to {}->http://download.eclipse.org:80
26-May-2019 16:18:04 [ERROR] Internal error: java.lang.RuntimeException: Failed to load p2 repository with ID 'photon' from location https://download.eclipse.org/releases/photon: Unable to read repository at https://download.eclipse.org/releases/photon. Unable to read repository at http://download.eclipse.org/technology/epp/packages/photon/content.xml. Connection reset -> [Help 1]
26-May-2019 16:18:04 org.apache.maven.InternalErrorException: Internal error: java.lang.RuntimeException: Failed to load p2 repository with ID 'photon' from location https://download.eclipse.org/releases/photon
26-May-2019 16:18:04         at org.apache.maven.DefaultMaven.execute(DefaultMaven.java:121)
26-May-2019 16:18:04         at org.apache.maven.cli.MavenCli.execute(MavenCli.java:863)
26-May-2019 16:18:04         at org.apache.maven.cli.MavenCli.doMain(MavenCli.java:288)
26-May-2019 16:18:04         at org.apache.maven.cli.MavenCli.main(MavenCli.java:199)
26-May-2019 16:18:04         at sun.reflect.NativeMethodAccessorImpl.invoke0(Native Method)
26-May-2019 16:18:04         at sun.reflect.NativeMethodAccessorImpl.invoke(NativeMethodAccessorImpl.java:62)
26-May-2019 16:18:04         at sun.reflect.DelegatingMethodAccessorImpl.invoke(DelegatingMethodAccessorImpl.java:43)
26-May-2019 16:18:04         at java.lang.reflect.Method.invoke(Method.java:498)
26-May-2019 16:18:04         at org.codehaus.plexus.classworlds.launcher.Launcher.launchEnhanced(Launcher.java:289)
26-May-2019 16:18:04         at org.codehaus.plexus.classworlds.launcher.Launcher.launch(Launcher.java:229)
26-May-2019 16:18:04         at org.codehaus.plexus.classworlds.launcher.Launcher.mainWithExitCode(Launcher.java:415)
26-May-2019 16:18:04         at org.codehaus.plexus.classworlds.launcher.Launcher.main(Launcher.java:356)
26-May-2019 16:18:04 Caused by: java.lang.RuntimeException: Failed to load p2 repository with ID 'photon' from location https://download.eclipse.org/releases/photon
26-May-2019 16:18:04         at org.eclipse.tycho.p2.target.TargetPlatformFactoryImpl.loadMetadataRepository(TargetPlatformFactoryImpl.java:302)
26-May-2019 16:18:04         at org.eclipse.tycho.p2.target.TargetPlatformFactoryImpl.gatherExternalInstallableUnits(TargetPlatformFactoryImpl.java:270)
26-May-2019 16:18:04         at org.eclipse.tycho.p2.target.TargetPlatformFactoryImpl.createTargetPlatform(TargetPlatformFactoryImpl.java:176)
26-May-2019 16:18:04         at org.eclipse.tycho.p2.target.TargetPlatformFactoryImpl.createTargetPlatform(TargetPlatformFactoryImpl.java:128)
26-May-2019 16:18:04         at org.eclipse.tycho.p2.target.TargetPlatformFactoryImpl.createTargetPlatform(TargetPlatformFactoryImpl.java:1)
26-May-2019 16:18:04         at org.eclipse.tycho.p2.manager.ReactorRepositoryManagerImpl.computePreliminaryTargetPlatform(ReactorRepositoryManagerImpl.java:84)
26-May-2019 16:18:04         at org.eclipse.tycho.p2.resolver.P2DependencyResolver.computePreliminaryTargetPlatform(P2DependencyResolver.java:224)
26-May-2019 16:18:04         at org.eclipse.tycho.core.resolver.DefaultTychoResolver.resolveProject(DefaultTychoResolver.java:109)
26-May-2019 16:18:04         at org.eclipse.tycho.core.maven.TychoMavenLifecycleParticipant.afterProjectsRead(TychoMavenLifecycleParticipant.java:95)
26-May-2019 16:18:04         at org.apache.maven.DefaultMaven.doExecute(DefaultMaven.java:266)
26-May-2019 16:18:04         at org.apache.maven.DefaultMaven.doExecute(DefaultMaven.java:193)
26-May-2019 16:18:04         at org.apache.maven.DefaultMaven.execute(DefaultMaven.java:106)
26-May-2019 16:18:04         ... 11 more
26-May-2019 16:18:04 Caused by: org.eclipse.equinox.p2.core.ProvisionException: Unable to read repository at https://download.eclipse.org/releases/photon.
26-May-2019 16:18:04         at org.eclipse.equinox.internal.p2.metadata.repository.CompositeMetadataRepository.addChild(CompositeMetadataRepository.java:184)
26-May-2019 16:18:04         at org.eclipse.equinox.internal.p2.metadata.repository.CompositeMetadataRepository.<init>(CompositeMetadataRepository.java:107)
26-May-2019 16:18:04         at org.eclipse.equinox.internal.p2.metadata.repository.CompositeMetadataRepositoryFactory.load(CompositeMetadataRepositoryFactory.java:121)
26-May-2019 16:18:04         at org.eclipse.equinox.internal.p2.metadata.repository.MetadataRepositoryManager.factoryLoad(MetadataRepositoryManager.java:60)
26-May-2019 16:18:04         at org.eclipse.equinox.internal.p2.repository.helpers.AbstractRepositoryManager.loadRepository(AbstractRepositoryManager.java:767)
26-May-2019 16:18:04         at org.eclipse.equinox.internal.p2.repository.helpers.AbstractRepositoryManager.loadRepository(AbstractRepositoryManager.java:668)
26-May-2019 16:18:04         at org.eclipse.equinox.internal.p2.metadata.repository.MetadataRepositoryManager.loadRepository(MetadataRepositoryManager.java:107)
26-May-2019 16:18:04         at org.eclipse.tycho.p2.remote.RemoteMetadataRepositoryManager.loadRepository(RemoteMetadataRepositoryManager.java:61)
26-May-2019 16:18:04         at org.eclipse.tycho.p2.remote.RemoteMetadataRepositoryManager.loadRepository(RemoteMetadataRepositoryManager.java:53)
26-May-2019 16:18:04         at org.eclipse.tycho.p2.target.TargetPlatformFactoryImpl.loadMetadataRepository(TargetPlatformFactoryImpl.java:298)
26-May-2019 16:18:04         ... 22 more
26-May-2019 16:18:04 Caused by: org.eclipse.equinox.p2.core.ProvisionException: Unable to read repository at http://download.eclipse.org/technology/epp/packages/photon/content.xml.
26-May-2019 16:18:04         at org.eclipse.equinox.internal.p2.repository.CacheManager.createCache(CacheManager.java:243)
26-May-2019 16:18:04         at org.eclipse.tycho.p2.remote.RemoteRepositoryCacheManager.createCache(RemoteRepositoryCacheManager.java:67)
26-May-2019 16:18:04         at org.eclipse.equinox.internal.p2.metadata.repository.SimpleMetadataRepositoryFactory.getLocalFile(SimpleMetadataRepositoryFactory.java:66)
26-May-2019 16:18:04         at org.eclipse.equinox.internal.p2.metadata.repository.SimpleMetadataRepositoryFactory.load(SimpleMetadataRepositoryFactory.java:86)
26-May-2019 16:18:04         at org.eclipse.equinox.internal.p2.metadata.repository.MetadataRepositoryManager.factoryLoad(MetadataRepositoryManager.java:60)
26-May-2019 16:18:04         at org.eclipse.equinox.internal.p2.repository.helpers.AbstractRepositoryManager.loadRepository(AbstractRepositoryManager.java:767)
26-May-2019 16:18:04         at org.eclipse.equinox.internal.p2.repository.helpers.AbstractRepositoryManager.loadRepository(AbstractRepositoryManager.java:668)
26-May-2019 16:18:04         at org.eclipse.equinox.internal.p2.metadata.repository.MetadataRepositoryManager.loadRepository(MetadataRepositoryManager.java:107)
26-May-2019 16:18:04         at org.eclipse.tycho.p2.remote.RemoteMetadataRepositoryManager.loadRepository(RemoteMetadataRepositoryManager.java:61)
26-May-2019 16:18:04         at org.eclipse.tycho.p2.remote.RemoteMetadataRepositoryManager.loadRepository(RemoteMetadataRepositoryManager.java:53)
26-May-2019 16:18:04         at org.eclipse.equinox.internal.p2.metadata.repository.CompositeMetadataRepository.addChild(CompositeMetadataRepository.java:165)
26-May-2019 16:18:04         ... 31 more
26-May-2019 16:18:04 Caused by: java.net.SocketException: Connection reset
26-May-2019 16:18:04         at java.net.SocketInputStream.read(SocketInputStream.java:210)
26-May-2019 16:18:04         at java.net.SocketInputStream.read(SocketInputStream.java:141)
26-May-2019 16:18:04         at org.apache.http.impl.io.AbstractSessionInputBuffer.fillBuffer(AbstractSessionInputBuffer.java:158)
26-May-2019 16:18:04         at org.apache.http.impl.io.SocketInputBuffer.fillBuffer(SocketInputBuffer.java:82)
26-May-2019 16:18:04         at org.apache.http.impl.io.AbstractSessionInputBuffer.readLine(AbstractSessionInputBuffer.java:271)
26-May-2019 16:18:04         at org.apache.http.impl.conn.DefaultHttpResponseParser.parseHead(DefaultHttpResponseParser.java:140)
26-May-2019 16:18:04         at org.apache.http.impl.conn.DefaultHttpResponseParser.parseHead(DefaultHttpResponseParser.java:57)
26-May-2019 16:18:04         at org.apache.http.impl.io.AbstractMessageParser.parse(AbstractMessageParser.java:259)
26-May-2019 16:18:04         at org.apache.http.impl.AbstractHttpClientConnection.receiveResponseHeader(AbstractHttpClientConnection.java:281)
26-May-2019 16:18:04         at org.apache.http.impl.conn.DefaultClientConnection.receiveResponseHeader(DefaultClientConnection.java:259)
26-May-2019 16:18:04         at org.apache.http.impl.conn.ManagedClientConnectionImpl.receiveResponseHeader(ManagedClientConnectionImpl.java:209)
26-May-2019 16:18:04         at org.apache.http.protocol.HttpRequestExecutor.doReceiveResponse(HttpRequestExecutor.java:273)
26-May-2019 16:18:04         at org.apache.http.protocol.HttpRequestExecutor.execute(HttpRequestExecutor.java:125)
26-May-2019 16:18:04         at org.apache.http.impl.client.DefaultRequestDirector.tryExecute(DefaultRequestDirector.java:686)
26-May-2019 16:18:04         at org.apache.http.impl.client.DefaultRequestDirector.execute(DefaultRequestDirector.java:488)
26-May-2019 16:18:04         at org.apache.http.impl.client.AbstractHttpClient.doExecute(AbstractHttpClient.java:884)
26-May-2019 16:18:04         at org.apache.http.impl.client.CloseableHttpClient.execute(CloseableHttpClient.java:82)
26-May-2019 16:18:04         at org.eclipse.ecf.provider.filetransfer.httpclient4.HttpClientFileSystemBrowser.runRequest(HttpClientFileSystemBrowser.java:263)
26-May-2019 16:18:04         at org.eclipse.ecf.provider.filetransfer.browse.AbstractFileSystemBrowser$DirectoryJob.run(AbstractFileSystemBrowser.java:69)
26-May-2019 16:18:04         at org.eclipse.core.internal.jobs.Worker.run(Worker.java:60)
26-May-2019 16:18:04 [ERROR]
26-May-2019 16:18:04 [ERROR] To see the full stack trace of the errors, re-run Maven with the -e switch.
26-May-2019 16:18:04 [ERROR] Re-run Maven using the -X switch to enable full debug logging.
26-May-2019 16:18:04 [ERROR]
26-May-2019 16:18:04 [ERROR] For more information about the errors and possible solutions, please read the following articles:
26-May-2019 16:18:04 [ERROR] [Help 1] http://cwiki.apache.org/confluence/display/MAVEN/InternalErrorException
26-May-2019 16:18:05 Failing task since return code of [/opt/maven-3.3/bin/mvn --batch-mode -Djava.io.tmpdir=/tmp/GRECLIPSE-E48M-JOB1 -Pe48 clean deploy -Psnapshot] was 1 while expected 0
26-May-2019 16:18:05 Parsing test results under /opt/bamboo-home/xml-data/build-dir/GRECLIPSE-E48M-JOB1...
26-May-2019 16:18:05 Finished task 'Maven 3.x' with result: Failed
26-May-2019 16:18:05 Running post build plugin 'Docker Container Cleanup'
26-May-2019 16:18:05 Running post build plugin 'NCover Results Collector'
26-May-2019 16:18:05 Running post build plugin 'Artifactory Release Management Staging'
26-May-2019 16:18:05 Running post build plugin 'Artifactory Build Info Copier'
26-May-2019 16:18:05 Running post build plugin 'Artifactory Gradle Properties Info Copier'
26-May-2019 16:18:05 Running post build plugin 'Clover Results Collector'
26-May-2019 16:18:05 Running post build plugin 'npm Cache Cleanup'
26-May-2019 16:18:05 Running post build plugin 'Artifact Copier'
26-May-2019 16:18:05 Publishing an artifact: Zipped Update Site
26-May-2019 16:18:05 Unable to publish artifact [Zipped Update Site]: the source directory /opt/bamboo-home/xml-data/build-dir/GRECLIPSE-E48M-JOB1/Site-org.codehaus.groovy.eclipse/target/site does not exist.
26-May-2019 16:18:05 The artifact hasn't been successfully published after 1.463 ms
26-May-2019 16:18:05 Publishing an artifact: surefire-reports
26-May-2019 16:18:05 Finished publishing of artifact Non required job artifact: [surefire-reports], pattern: [**/target/TEST-*.xml] in 373.2 ms
26-May-2019 16:18:06 Successfully removed working directory at '/opt/bamboo-home/xml-data/build-dir/GRECLIPSE-E48M-JOB1'
26-May-2019 16:18:06 Finalising the build...
26-May-2019 16:18:06 Stopping timer.
26-May-2019 16:18:06 Build GRECLIPSE-E48M-JOB1-648 completed.
26-May-2019 16:18:06 Running on server: post build plugin 'NCover Results Collector'
26-May-2019 16:18:06 Running on server: post build plugin 'Build Hanging Detection Configuration'
26-May-2019 16:18:06 Running on server: post build plugin 'Clover Delta Calculator'
26-May-2019 16:18:06 Running on server: post build plugin 'Maven Dependencies Postprocessor'
26-May-2019 16:18:06 All post build plugins have finished
26-May-2019 16:18:06 Generating build results summary...
26-May-2019 16:18:06 Saving build results to disk...
26-May-2019 16:18:06 Logging substituted variables...
26-May-2019 16:18:06 Indexing build results...
26-May-2019 16:18:06 Finished building GRECLIPSE-E48M-JOB1-648.