Eclipse Photon

Build: #699 failed

Job: Default Job failed

Stages & jobs

  1. Default Stage

Job result summary

Completed
Duration
104 minutes
Agent
bamboo-19.af.pivotal.io
Revision
20deb288bea3c6a778539f6a35f9f26008893186 20deb288bea3c6a778539f6a35f9f26008893186
Total tests
5840
Failing since
#698 (Code changes detected – )
Fixed in
#702 (Code changes detected)

Tests

  • 5,840 tests in total
  • 4 tests failed
  • 2 failures are new
  • 1 test was fixed
  • 113 tests were quarantined / skipped
  • 99 minutes taken in total.
New test failures 2
Status Test Duration
Collapse Failed ClosureInferencingTests testClosure16 History
< 1 sec
java.lang.AssertionError: Expected type not found.
Expected: C
Found: java.lang.Object
Declaring type: B
ASTNode: org.codehaus.groovy.ast.expr.VariableExpression@11d5c2[variable: xxx]
Confidence: UNKNOWN

java.lang.AssertionError: 
(9 more lines...)
Collapse Failed ClosureInferencingTests testClosure24 History
< 1 sec
java.lang.AssertionError: Expected type not found.
Expected: java.lang.Long
Found: java.lang.Object
Declaring type: Search
ASTNode: org.codehaus.groovy.ast.expr.VariableExpression@f29d7[variable: time]
Confidence: UNKNOWN

java.lang.AssertionError: 
(8 more lines...)
Existing test failures 2
Status Test Failing since Duration
junit.framework.ComparisonFailure: Unexpected error running resulting class file for Day.groovy:
--[START]--
java.lang.NoClassDefFoundError: sun/reflect/MethodAccessorImpl
 at sun.misc.Unsafe.defineClass(Native Method)
 at sun.reflect.ClassDefiner.defineClass(ClassDefiner.java:63)
 at sun.reflect.MethodAccessorGenerator$1.run(MethodAccessorGenerator.java:399)
 at sun.reflect.MethodAccessorGenerator$1.run(MethodAccessorGenerator.java:394)
 at java.security.AccessController.doPrivileged(Native Method)
(398 more lines...)
junit.framework.ComparisonFailure: Unexpected error running resulting class file for Day.groovy:
--[START]--
java.lang.NoClassDefFoundError: sun/reflect/MethodAccessorImpl
 at sun.misc.Unsafe.defineClass(Native Method)
 at sun.reflect.ClassDefiner.defineClass(ClassDefiner.java:63)
 at sun.reflect.MethodAccessorGenerator$1.run(MethodAccessorGenerator.java:399)
 at sun.reflect.MethodAccessorGenerator$1.run(MethodAccessorGenerator.java:394)
 at java.security.AccessController.doPrivileged(Native Method)
(398 more lines...)
Fixed tests 1
Status Test Failing since Duration
Successful DGMInferencingTests testDGM38 History
Failing since build #698 (Code changes detected) < 1 sec

Error summary

The build generated some errors. See the full build log for more details.


(SWT:13376): Gtk-CRITICAL **: 22:32:38.791: gtk_box_gadget_distribute: assertion 'size >= 0' failed in GtkScrollbar
TypeInferencingVisitorWithRequestor.findMethodNode: no match found for Foo(QMap.Entry;, Qjava.lang.Object;)
TypeInferencingVisitorWithRequestor.findMethodNode: no match found for Foo(QMap.Entry;)
TypeInferencingVisitorWithRequestor.findMethodNode: no match found for TestUnit359817.y(QOuter.Inner;)
TypeInferencingVisitorWithRequestor.findMethodNode: no match found for TestUnit359817.y(QOuter.Inner;)
TypeInferencingVisitorWithRequestor.findMethodNode: no match found for TestUnit547821.y(QOuter.Inner;)
TypeInferencingVisitorWithRequestor.findMethodNode: no match found for TestUnit547821.y(QOuter.Inner;)
TypeInferencingVisitorWithRequestor.findMethodNode: no match found for Main.main([Qjava.lang.String;)
TypeInferencingVisitorWithRequestor.findMethodNode: no match found for Main.main([Qjava.lang.String;)
CodeSelectRequestor: Could not proceed due to null declaring type for org.codehaus.groovy.ast.expr.BinaryExpression@ecbea[org.codehaus.groovy.ast.expr.VariableExpression@ecbe3[variable: it]("in" at 1:20:  "in" )org.codehaus.groovy.ast.expr.ListExpression@ee270[]]
CodeSelectRequestor: Could not proceed due to null declaring type for org.codehaus.groovy.ast.expr.RangeExpression@ebcdd
CodeSelectRequestor: Could not proceed due to null declaring type for org.codehaus.groovy.ast.expr.RangeExpression@ebcde
TypeInferencingVisitorWithRequestor.findMethodNode: no match found for Type.x(QList<Qjava.util.Date;>;)
TypeInferencingVisitorWithRequestor.findMethodNode: no match found for Type.x(QList<Qjava.lang.Number;>;)
TypeInferencingVisitorWithRequestor.findMethodNode: no match found for Type.x(QList<Qjava.lang.Number;>;)
TypeInferencingVisitorWithRequestor.findMethodNode: no match found for Type.x(QList<Qjava.util.Date;>;)
TypeInferencingVisitorWithRequestor.findMethodNode: no match found for Type.x(QList<Qjava.lang.Number;>;)
TypeInferencingVisitorWithRequestor.findMethodNode: no match found for Type.x(QList<Qjava.lang.Number;>;)
CodeSelectRequestor: Could not proceed due to null declaring type for org.codehaus.groovy.ast.expr.ConstantExpression@e8fc6[fff]
CodeSelectRequestor: Could not proceed due to null declaring type for org.codehaus.groovy.ast.expr.ConstantExpression@e8fca[fff]
CodeSelectRequestor: Could not proceed due to null declaring type for org.codehaus.groovy.ast.expr.ConstantExpression@e8fca[fff]
Waiting for: Java indexing... 22 files to index (/Project)
Waiting for: Building workspace
Waiting for: Java indexing... 22 files to index (/Project)
Waiting for: Java indexing... 22 files to index (/Project)
Waiting for: Java indexing... 22 files to index (/Project)
Waiting for: Java indexing... 22 files to index (/Project)
Waiting for: Java indexing... 22 files to index (/Project)
Waiting for: Java indexing... 22 files to index (/Project)
Waiting for: Java indexing... 21 files to index (/Project)
Waiting for: Java indexing... 21 files to index (/Project)
Waiting for: Java indexing... 21 files to index (/Project)
Waiting for: Flushing content description cache.
Waiting for: Java indexing... 16 files to index (/opt/jdk8u212-b03/jre/lib/jsse.jar)