Eclipse Photon

Build: #685 failed Changes by Eric Milles

Build result summary

Details

Completed
Duration
103 minutes
Labels
None
Agent
bamboo-22.af.pivotal.io
Revision
d39bd78053c912a259129f97440d93175a9928be d39bd78053c912a259129f97440d93175a9928be
Total tests
5785
Failing since
#684 (Changes by Eric Milles)

Responsible

Code commits

Author Commit Message Commit date
Eric Milles Eric Milles d39bd78053c912a259129f97440d93175a9928be d39bd78053c912a259129f97440d93175a9928be Fix for #917: infer return type of Spock's ValueRecorder.record method

Tests

New test failures 3
Status Test View job Duration
Collapse Failed BasicGroovyBuildTests testTaskMarkerSharedDescription History
Default Job < 1 sec
org.eclipse.core.internal.resources.ResourceException: Marker id 259 not found.
	at org.eclipse.jdt.core.groovy.tests.builder.BasicGroovyBuildTests.testTaskMarkerSharedDescription(BasicGroovyBuildTests.java:2813)
Collapse Failed GroovyContentTypeTests testGroovyThenJavaProject History
Default Job < 1 sec
java.lang.AssertionError: L/Project/bin/p1/HelloJava.class should exist
	at org.eclipse.jdt.core.groovy.tests.model.GroovyContentTypeTests.checkJavaProject(GroovyContentTypeTests.java:152)
	at org.eclipse.jdt.core.groovy.tests.model.GroovyContentTypeTests.testGroovyThenJavaProject(GroovyContentTypeTests.java:90)
Collapse Failed DGMInferencingTests testDGM27 History
Default Job < 1 sec
java.lang.AssertionError: Expected type not found.
Expected: java.lang.String
Found: java.lang.Object
Declaring type: Search
ASTNode: org.codehaus.groovy.ast.expr.VariableExpression@efcbe[variable: key]
Confidence: INFERRED

java.lang.AssertionError: 
(9 more lines...)
Fixed tests 3
Status Test Failing since View job Duration
Successful BasicGroovyBuildTests testNoDoubleResolve History
Failing since build #684 (Changes by Eric Milles) Default Job < 1 sec
Successful InferencingTests testSpread9 History
Failing since build #684 (Changes by Eric Milles) Default Job < 1 sec
Successful OperatorOverloadingInferencingTests testLongExpr2 History
Failing since build #684 (Changes by Eric Milles) Default Job < 1 sec