Build and test Groovy-Eclipse on Eclipse 4.7 (Oxygen)

Build result summary

Details

Completed
Duration
90 minutes
Labels
None
Agent
bamboo-10.af.pivotal.io
Revision
489d753c25441cd32130b50a0937fbcc9caab7fd 489d753c25441cd32130b50a0937fbcc9caab7fd
Total tests
5543
Failing since
#476 (Changes by Eric Milles <eric.milles@thomsonreuters.com>)
Fixed in
#478 (Changes by Eric Milles <eric.milles@thomsonreuters.com>)

Responsible

This build has been failing since #476
No one has taken responsibility

Code commits

Author Commit Message Commit date
Eric Milles <eric.milles@thomsonreuters.com> Eric Milles <eric.milles@thomsonreuters.com> 489d753c25441cd32130b50a0937fbcc9caab7fd 489d753c25441cd32130b50a0937fbcc9caab7fd Support for running tests in additional environments

Tests

New test failures 9
Status Test View job Duration
Collapse Failed SyntheticAccessorRenamingTests testSetterOnly History
Default Job 9 secs
org.eclipse.core.runtime.AssertionFailedException: assertion failed: Search for method declaration did not find original element: java.lang.Object setFoo() [in First [in First.groovy [in p [in src [in TestProject]]]]]
	at org.eclipse.core.runtime.Assert.isTrue(Assert.java:110)
	at org.eclipse.jdt.internal.corext.refactoring.rename.RippleMethodFinder2.findAllRippleMethods(RippleMethodFinder2.java:192)
	at org.eclipse.jdt.internal.corext.refactoring.rename.RippleMethodFinder2.getAllRippleMethods(RippleMethodFinder2.java:168)
	at org.eclipse.jdt.internal.corext.refactoring.rename.RippleMethodFinder2.getRelatedMethods(RippleMethodFinder2.java:161)
	at org.eclipse.jdt.internal.corext.refactoring.rename.RenameMethodProcessor.initializeMethodsToRename(RenameMethodProcessor.java:248)
	at org.eclipse.jdt.internal.corext.refactoring.rename.RenameMethodProcessor.doCheckFinalConditions(RenameMethodProcessor.java:386)
	at org.eclipse.jdt.internal.corext.refactoring.rename.RenameVirtualMethodProcessor.doCheckFinalConditions(RenameVirtualMethodProcessor.java:146)
(31 more lines...)
Collapse Failed SyntheticAccessorRenamingTests testJavaRename1 History
Default Job 1 sec
java.lang.AssertionError: Refactoring produced unexpected results:
-----EXPECTING-----
package q;
class Java {
  void l() {
    p.First f = new p.First();
    f.flar = null;
    f.getFlar();
(33 more lines...)
Collapse Failed SyntheticAccessorRenamingTests testJavaRename2 History
Default Job 1 sec
java.lang.AssertionError: Refactoring produced unexpected results:
-----EXPECTING-----
package q;
class Java {
  void l() {
    p.First f = new p.First();
    f.flar = null;
    f.getFoo();
(28 more lines...)
Collapse Failed SyntheticAccessorRenamingTests testGetterOnly History
Default Job 1 sec
org.eclipse.core.runtime.AssertionFailedException: assertion failed: Search for method declaration did not find original element: java.lang.Object getFoo() [in First [in First.groovy [in p [in src [in TestProject]]]]]
	at org.eclipse.core.runtime.Assert.isTrue(Assert.java:110)
	at org.eclipse.jdt.internal.corext.refactoring.rename.RippleMethodFinder2.findAllRippleMethods(RippleMethodFinder2.java:192)
	at org.eclipse.jdt.internal.corext.refactoring.rename.RippleMethodFinder2.getAllRippleMethods(RippleMethodFinder2.java:168)
	at org.eclipse.jdt.internal.corext.refactoring.rename.RippleMethodFinder2.getRelatedMethods(RippleMethodFinder2.java:161)
	at org.eclipse.jdt.internal.corext.refactoring.rename.RenameMethodProcessor.initializeMethodsToRename(RenameMethodProcessor.java:248)
	at org.eclipse.jdt.internal.corext.refactoring.rename.RenameMethodProcessor.doCheckFinalConditions(RenameMethodProcessor.java:386)
	at org.eclipse.jdt.internal.corext.refactoring.rename.RenameVirtualMethodProcessor.doCheckFinalConditions(RenameVirtualMethodProcessor.java:146)
(25 more lines...)
Collapse Failed SyntheticAccessorRenamingTests testSingleFileRename2 History
Default Job 1 sec
java.lang.AssertionError: Refactoring produced unexpected results:
-----EXPECTING-----
package p
class First {
  def flar
  def getFoo() { }
  def setFoo() { }
  def isFoo() { }
(34 more lines...)
Collapse Failed SyntheticAccessorRenamingTests testMultiFileRename2 History
Default Job 1 sec
java.lang.AssertionError: Refactoring produced unexpected results:
-----EXPECTING-----
package q
def f = new p.First()
f.flar
f.getFoo()
f.setFoo()
f.isFoo()
(20 more lines...)
Collapse Failed SyntheticAccessorRenamingTests testIsserOnly History
Default Job 1 sec
org.eclipse.core.runtime.AssertionFailedException: assertion failed: Search for method declaration did not find original element: java.lang.Object isFoo() [in First [in First.groovy [in p [in src [in TestProject]]]]]
	at org.eclipse.core.runtime.Assert.isTrue(Assert.java:110)
	at org.eclipse.jdt.internal.corext.refactoring.rename.RippleMethodFinder2.findAllRippleMethods(RippleMethodFinder2.java:192)
	at org.eclipse.jdt.internal.corext.refactoring.rename.RippleMethodFinder2.getAllRippleMethods(RippleMethodFinder2.java:168)
	at org.eclipse.jdt.internal.corext.refactoring.rename.RippleMethodFinder2.getRelatedMethods(RippleMethodFinder2.java:161)
	at org.eclipse.jdt.internal.corext.refactoring.rename.RenameMethodProcessor.initializeMethodsToRename(RenameMethodProcessor.java:248)
	at org.eclipse.jdt.internal.corext.refactoring.rename.RenameMethodProcessor.doCheckFinalConditions(RenameMethodProcessor.java:386)
	at org.eclipse.jdt.internal.corext.refactoring.rename.RenameVirtualMethodProcessor.doCheckFinalConditions(RenameVirtualMethodProcessor.java:146)
(25 more lines...)
Collapse Failed SyntheticAccessorRenamingTests testMultiFileRename1 History
Default Job 1 sec
java.lang.AssertionError: Refactoring produced unexpected results:
-----EXPECTING-----
package q
def f = new p.First()
f.flar
f.getFlar()
f.setFlar()
f.isFlar()
(20 more lines...)
Collapse Failed SyntheticAccessorRenamingTests testSingleFileRename1 History
Default Job 1 sec
java.lang.AssertionError: Refactoring produced unexpected results:
-----EXPECTING-----
package p
class First {
  boolean flar
  def run() {
    flar
    getFlar()
(28 more lines...)
Fixed tests 3
Status Test Failing since View job Duration
Successful TraitsTests testTraits20[2] History
Failing since build #476 (Changes by Eric Milles <eric.milles@thomsonreuters.com>) Default Job < 1 sec
Successful TraitsTests testTraits20[1] History
Failing since build #476 (Changes by Eric Milles <eric.milles@thomsonreuters.com>) Default Job < 1 sec
Successful TraitsTests testTraits20[3] History
Failing since build #476 (Changes by Eric Milles <eric.milles@thomsonreuters.com>) Default Job < 1 sec