Build and test Groovy-Eclipse on Eclipse 4.7 (Oxygen)

Build result summary

Details

Completed
Duration
90 minutes
Labels
None
Agent
bamboo-01.af.pivotal.io
Revision
d8f9f76935c4bc6111248c855cb1e35f1edf1352 d8f9f76935c4bc6111248c855cb1e35f1edf1352
Total tests
5557
Failing since
#502 (Custom build by Andy Clement with revision v2.9.2)
Fixed in
#504 (Changes by Eric Milles <eric.milles@thomsonreuters.com>)

Responsible

Code commits

Author Commit Message Commit date
Eric Milles <eric.milles@thomsonreuters.com> Eric Milles <eric.milles@thomsonreuters.com> d8f9f76935c4bc6111248c855cb1e35f1edf1352 d8f9f76935c4bc6111248c855cb1e35f1edf1352 Increment versions

Configuration changes

Plan configuration has changed since the last successful build. See the plan audit log for more details.

Tests

New test failures 2
Status Test View job Duration
Collapse Failed BuiltInDSLInferencingTests testSwingBuilder1 History
Default Job 1 sec
java.lang.AssertionError: Expected declaring type not found.
 Expected: groovy.swing.SwingBuilder
 Found type: java.lang.Object
 Found declaring type: TestUnit715697
 ASTNode: org.codehaus.groovy.ast.expr.VariableExpression@20fa137f[variable: frame]
java.lang.AssertionError: Expected declaring type not found.
	Expected: groovy.swing.SwingBuilder
	Found type: java.lang.Object
(18 more lines...)
Collapse Failed GroovyContentTypeTests testJavaThenGroovyProject History
Default Job 1 sec
java.lang.AssertionError: L/Project/bin/p1/HelloJava.class should exist
	at org.junit.Assert.fail(Assert.java:88)
	at org.junit.Assert.assertTrue(Assert.java:41)
	at org.eclipse.jdt.core.groovy.tests.model.GroovyContentTypeTests.checkGroovyProject(GroovyContentTypeTests.java:166)
	at org.eclipse.jdt.core.groovy.tests.model.GroovyContentTypeTests.access$5(GroovyContentTypeTests.java:157)