Build and test Groovy-Eclipse on Eclipse 4.7 (Oxygen)

Build: #507 failed Changes by Eric Milles

Build result summary

Details

Completed
Duration
100 minutes
Labels
None
Agent
bamboo-06.af.pivotal.io
Revision
5d430a3e0795345ff8d7f93aec8a754356f111f1 5d430a3e0795345ff8d7f93aec8a754356f111f1
Total tests
5557
Failing since
#505 (Changes by Eric Milles)
Fixed in
#508 (Changes by Eric Milles)

Responsible

This build has been failing since #505
No one has taken responsibility

Code commits

Author Commit Message Commit date
Eric Milles Eric Milles 5d430a3e0795345ff8d7f93aec8a754356f111f1 5d430a3e0795345ff8d7f93aec8a754356f111f1 Fix for issue #584

Tests

New test failures 40
Status Test View job Duration
Collapse Failed DefaultGroovyMethodCompletionTests testDGMJavadoc History
Default Job 2 secs
java.lang.IllegalArgumentException: null
	at org.eclipse.jdt.core.dom.ASTParser.<init>(ASTParser.java:234)
	at org.eclipse.jdt.core.dom.ASTParser.newParser(ASTParser.java:131)
	at org.eclipse.jdt.internal.ui.text.javadoc.JavadocContentAccess2.createAST(JavadocContentAccess2.java:746)
	at org.eclipse.jdt.internal.ui.text.javadoc.JavadocContentAccess2.getJavadocNode(JavadocContentAccess2.java:723)
	at org.eclipse.jdt.internal.ui.text.javadoc.JavadocContentAccess2.javadoc2HTML(JavadocContentAccess2.java:759)
	at org.eclipse.jdt.internal.ui.text.javadoc.JavadocContentAccess2.getHTMLContentFromSource(JavadocContentAccess2.java:671)
	at org.eclipse.jdt.internal.ui.text.javadoc.JavadocContentAccess2.getHTMLContent(JavadocContentAccess2.java:534)
(8 more lines...)
Collapse Failed TypeCompletionTests2 testTypeCompletionInScript6 History
Default Job 2 secs
org.junit.ComparisonFailure: Completion proposal applied but different results found. expected:<...onUI /*tag*/ //note
[  // some single-line comment
import javax.swing.text.html.HTML]

HTML
ButtonUI> but was:<...onUI /*tag*/ //note
[import javax.swing.text.html.HTML
  // some single-line comment]
(22 more lines...)
Collapse Failed JUnit4TestFinderTests testUsingTestAnnotation History
Default Job 1 sec
java.lang.IllegalArgumentException: null
	at org.eclipse.jdt.core.dom.ASTParser.<init>(ASTParser.java:234)
	at org.eclipse.jdt.core.dom.ASTParser.newParser(ASTParser.java:131)
	at org.eclipse.jdt.internal.junit.launcher.JUnit4TestFinder.internalIsTest(JUnit4TestFinder.java:208)
	at org.eclipse.jdt.internal.junit.launcher.JUnit4TestFinder.isTest(JUnit4TestFinder.java:200)
	at org.eclipse.jdt.internal.junit.launcher.ITestFinder$isTest.call(Unknown Source)
	at org.codehaus.groovy.eclipse.junit.test.JUnit4TestFinderTests.assertTypeIsTest(JUnit4TestFinderTests.groovy:29)
	at org.codehaus.groovy.eclipse.junit.test.JUnit4TestFinderTests.assertTypeIsTest(JUnit4TestFinderTests.groovy)
(1 more lines...)
Collapse Failed JUnit4TestFinderTests testUsingRunWithAnnotation History
Default Job 1 sec
java.lang.IllegalArgumentException: null
	at org.eclipse.jdt.core.dom.ASTParser.<init>(ASTParser.java:234)
	at org.eclipse.jdt.core.dom.ASTParser.newParser(ASTParser.java:131)
	at org.eclipse.jdt.internal.junit.launcher.JUnit4TestFinder.internalIsTest(JUnit4TestFinder.java:208)
	at org.eclipse.jdt.internal.junit.launcher.JUnit4TestFinder.isTest(JUnit4TestFinder.java:200)
	at org.eclipse.jdt.internal.junit.launcher.ITestFinder$isTest.call(Unknown Source)
	at org.codehaus.groovy.eclipse.junit.test.JUnit4TestFinderTests.assertTypeIsTest(JUnit4TestFinderTests.groovy:29)
	at org.codehaus.groovy.eclipse.junit.test.JUnit4TestFinderTests.assertTypeIsTest(JUnit4TestFinderTests.groovy)
(1 more lines...)
Collapse Failed JUnit4TestFinderTests testFinderOfSubclass History
Default Job 2 secs
java.lang.IllegalArgumentException: null
	at org.eclipse.jdt.core.dom.ASTParser.<init>(ASTParser.java:234)
	at org.eclipse.jdt.core.dom.ASTParser.newParser(ASTParser.java:131)
	at org.eclipse.jdt.internal.junit.launcher.JUnit4TestFinder.internalIsTest(JUnit4TestFinder.java:208)
	at org.eclipse.jdt.internal.junit.launcher.JUnit4TestFinder.isTest(JUnit4TestFinder.java:200)
	at org.eclipse.jdt.internal.junit.launcher.ITestFinder$isTest.call(Unknown Source)
	at org.codehaus.groovy.eclipse.junit.test.JUnit4TestFinderTests.assertTypeIsTest(JUnit4TestFinderTests.groovy:29)
	at org.codehaus.groovy.eclipse.junit.test.JUnit4TestFinderTests.assertTypeIsTest(JUnit4TestFinderTests.groovy)
(1 more lines...)
Collapse Failed JUnit4TestFinderTests testFindTestWithExpectedException History
Default Job 1 sec
java.lang.IllegalArgumentException: null
	at org.eclipse.jdt.core.dom.ASTParser.<init>(ASTParser.java:234)
	at org.eclipse.jdt.core.dom.ASTParser.newParser(ASTParser.java:131)
	at org.eclipse.jdt.internal.junit.launcher.JUnit4TestFinder.internalIsTest(JUnit4TestFinder.java:208)
	at org.eclipse.jdt.internal.junit.launcher.JUnit4TestFinder.isTest(JUnit4TestFinder.java:200)
	at org.eclipse.jdt.internal.junit.util.CoreTestSearchEngine.isTestOrTestSuite(CoreTestSearchEngine.java:57)
	at org.eclipse.jdt.internal.junit.JUnitPropertyTester.isJUnitTest(JUnitPropertyTester.java:117)
	at org.eclipse.jdt.internal.junit.JUnitPropertyTester.canLaunchAsJUnitTest(JUnitPropertyTester.java:85)
(6 more lines...)
Collapse Failed JUnit4TestFinderTests testFinderOfNonPublicSubclass History
Default Job 9 secs
java.lang.IllegalArgumentException: null
	at org.eclipse.jdt.core.dom.ASTParser.<init>(ASTParser.java:234)
	at org.eclipse.jdt.core.dom.ASTParser.newParser(ASTParser.java:131)
	at org.eclipse.jdt.internal.junit.launcher.JUnit4TestFinder.internalIsTest(JUnit4TestFinder.java:208)
	at org.eclipse.jdt.internal.junit.launcher.JUnit4TestFinder.isTest(JUnit4TestFinder.java:200)
	at org.eclipse.jdt.internal.junit.launcher.ITestFinder$isTest.call(Unknown Source)
	at org.codehaus.groovy.runtime.callsite.CallSiteArray.defaultCall(CallSiteArray.java:48)
	at org.codehaus.groovy.runtime.callsite.AbstractCallSite.call(AbstractCallSite.java:113)
(3 more lines...)
Collapse Failed RenameTypeTests test6 History
Default Job < 1 sec
java.lang.IllegalArgumentException: null
	at org.eclipse.jdt.core.dom.ASTParser.<init>(ASTParser.java:234)
	at org.eclipse.jdt.core.dom.ASTParser.newParser(ASTParser.java:131)
	at org.eclipse.jdt.internal.corext.refactoring.util.RefactoringASTParser.<init>(RefactoringASTParser.java:40)
	at org.eclipse.jdt.internal.corext.refactoring.rename.RenameTypeProcessor.analyseEnclosedTypes(RenameTypeProcessor.java:893)
	at org.eclipse.jdt.internal.corext.refactoring.rename.RenameTypeProcessor.doCheckFinalConditions(RenameTypeProcessor.java:541)
	at org.eclipse.jdt.internal.corext.refactoring.rename.JavaRenameProcessor.checkFinalConditions(JavaRenameProcessor.java:48)
	at org.eclipse.ltk.core.refactoring.participants.ProcessorBasedRefactoring.checkFinalConditions(ProcessorBasedRefactoring.java:222)
(32 more lines...)
Collapse Failed RenameTypeTests testGenerics3 History
Default Job < 1 sec
java.lang.IllegalArgumentException: null
	at org.eclipse.jdt.core.dom.ASTParser.<init>(ASTParser.java:234)
	at org.eclipse.jdt.core.dom.ASTParser.newParser(ASTParser.java:131)
	at org.eclipse.jdt.internal.corext.refactoring.util.RefactoringASTParser.<init>(RefactoringASTParser.java:40)
	at org.eclipse.jdt.internal.corext.refactoring.rename.RenameTypeProcessor.analyseEnclosedTypes(RenameTypeProcessor.java:893)
	at org.eclipse.jdt.internal.corext.refactoring.rename.RenameTypeProcessor.doCheckFinalConditions(RenameTypeProcessor.java:541)
	at org.eclipse.jdt.internal.corext.refactoring.rename.JavaRenameProcessor.checkFinalConditions(JavaRenameProcessor.java:48)
	at org.eclipse.ltk.core.refactoring.participants.ProcessorBasedRefactoring.checkFinalConditions(ProcessorBasedRefactoring.java:222)
(32 more lines...)
Collapse Failed RenameTypeTests testGenerics4 History
Default Job < 1 sec
java.lang.IllegalArgumentException: null
	at org.eclipse.jdt.core.dom.ASTParser.<init>(ASTParser.java:234)
	at org.eclipse.jdt.core.dom.ASTParser.newParser(ASTParser.java:131)
	at org.eclipse.jdt.internal.corext.refactoring.util.RefactoringASTParser.<init>(RefactoringASTParser.java:40)
	at org.eclipse.jdt.internal.corext.refactoring.rename.RenameTypeProcessor.analyseEnclosedTypes(RenameTypeProcessor.java:893)
	at org.eclipse.jdt.internal.corext.refactoring.rename.RenameTypeProcessor.doCheckFinalConditions(RenameTypeProcessor.java:541)
	at org.eclipse.jdt.internal.corext.refactoring.rename.JavaRenameProcessor.checkFinalConditions(JavaRenameProcessor.java:48)
	at org.eclipse.ltk.core.refactoring.participants.ProcessorBasedRefactoring.checkFinalConditions(ProcessorBasedRefactoring.java:222)
(32 more lines...)
Collapse Failed RenameTypeTests test11 History
Default Job < 1 sec
java.lang.IllegalArgumentException: null
	at org.eclipse.jdt.core.dom.ASTParser.<init>(ASTParser.java:234)
	at org.eclipse.jdt.core.dom.ASTParser.newParser(ASTParser.java:131)
	at org.eclipse.jdt.internal.corext.refactoring.util.RefactoringASTParser.<init>(RefactoringASTParser.java:40)
	at org.eclipse.jdt.internal.corext.refactoring.rename.RenameTypeProcessor.analyseEnclosedTypes(RenameTypeProcessor.java:893)
	at org.eclipse.jdt.internal.corext.refactoring.rename.RenameTypeProcessor.doCheckFinalConditions(RenameTypeProcessor.java:541)
	at org.eclipse.jdt.internal.corext.refactoring.rename.JavaRenameProcessor.checkFinalConditions(JavaRenameProcessor.java:48)
	at org.eclipse.ltk.core.refactoring.participants.ProcessorBasedRefactoring.checkFinalConditions(ProcessorBasedRefactoring.java:222)
(32 more lines...)
Collapse Failed RenameTypeTests test10 History
Default Job < 1 sec
java.lang.IllegalArgumentException: null
	at org.eclipse.jdt.core.dom.ASTParser.<init>(ASTParser.java:234)
	at org.eclipse.jdt.core.dom.ASTParser.newParser(ASTParser.java:131)
	at org.eclipse.jdt.internal.corext.refactoring.util.RefactoringASTParser.<init>(RefactoringASTParser.java:40)
	at org.eclipse.jdt.internal.corext.refactoring.rename.RenameTypeProcessor.analyseEnclosedTypes(RenameTypeProcessor.java:893)
	at org.eclipse.jdt.internal.corext.refactoring.rename.RenameTypeProcessor.doCheckFinalConditions(RenameTypeProcessor.java:541)
	at org.eclipse.jdt.internal.corext.refactoring.rename.JavaRenameProcessor.checkFinalConditions(JavaRenameProcessor.java:48)
	at org.eclipse.ltk.core.refactoring.participants.ProcessorBasedRefactoring.checkFinalConditions(ProcessorBasedRefactoring.java:222)
(32 more lines...)
Collapse Failed RenameTypeTests testInner3 History
Default Job 1 sec
java.lang.IllegalArgumentException: null
	at org.eclipse.jdt.core.dom.ASTParser.<init>(ASTParser.java:234)
	at org.eclipse.jdt.core.dom.ASTParser.newParser(ASTParser.java:131)
	at org.eclipse.jdt.internal.corext.refactoring.util.RefactoringASTParser.<init>(RefactoringASTParser.java:40)
	at org.eclipse.jdt.internal.corext.refactoring.rename.RenameTypeProcessor.analyseEnclosedTypes(RenameTypeProcessor.java:893)
	at org.eclipse.jdt.internal.corext.refactoring.rename.RenameTypeProcessor.doCheckFinalConditions(RenameTypeProcessor.java:541)
	at org.eclipse.jdt.internal.corext.refactoring.rename.JavaRenameProcessor.checkFinalConditions(JavaRenameProcessor.java:48)
	at org.eclipse.ltk.core.refactoring.participants.ProcessorBasedRefactoring.checkFinalConditions(ProcessorBasedRefactoring.java:222)
(30 more lines...)
Collapse Failed RenameTypeTests testAlias1 History
Default Job < 1 sec
java.lang.IllegalArgumentException: null
	at org.eclipse.jdt.core.dom.ASTParser.<init>(ASTParser.java:234)
	at org.eclipse.jdt.core.dom.ASTParser.newParser(ASTParser.java:131)
	at org.eclipse.jdt.internal.corext.refactoring.util.RefactoringASTParser.<init>(RefactoringASTParser.java:40)
	at org.eclipse.jdt.internal.corext.refactoring.rename.RenameTypeProcessor.analyseEnclosedTypes(RenameTypeProcessor.java:893)
	at org.eclipse.jdt.internal.corext.refactoring.rename.RenameTypeProcessor.doCheckFinalConditions(RenameTypeProcessor.java:541)
	at org.eclipse.jdt.internal.corext.refactoring.rename.JavaRenameProcessor.checkFinalConditions(JavaRenameProcessor.java:48)
	at org.eclipse.ltk.core.refactoring.participants.ProcessorBasedRefactoring.checkFinalConditions(ProcessorBasedRefactoring.java:222)
(32 more lines...)
Collapse Failed RenameTypeTests testJavadoc1 History
Default Job < 1 sec
java.lang.IllegalArgumentException: null
	at org.eclipse.jdt.core.dom.ASTParser.<init>(ASTParser.java:234)
	at org.eclipse.jdt.core.dom.ASTParser.newParser(ASTParser.java:131)
	at org.eclipse.jdt.internal.corext.refactoring.util.RefactoringASTParser.<init>(RefactoringASTParser.java:40)
	at org.eclipse.jdt.internal.corext.refactoring.rename.RenameTypeProcessor.analyseEnclosedTypes(RenameTypeProcessor.java:893)
	at org.eclipse.jdt.internal.corext.refactoring.rename.RenameTypeProcessor.doCheckFinalConditions(RenameTypeProcessor.java:541)
	at org.eclipse.jdt.internal.corext.refactoring.rename.JavaRenameProcessor.checkFinalConditions(JavaRenameProcessor.java:48)
	at org.eclipse.ltk.core.refactoring.participants.ProcessorBasedRefactoring.checkFinalConditions(ProcessorBasedRefactoring.java:222)
(30 more lines...)
Collapse Failed RenameTypeTests test9 History
Default Job < 1 sec
java.lang.IllegalArgumentException: null
	at org.eclipse.jdt.core.dom.ASTParser.<init>(ASTParser.java:234)
	at org.eclipse.jdt.core.dom.ASTParser.newParser(ASTParser.java:131)
	at org.eclipse.jdt.internal.corext.refactoring.util.RefactoringASTParser.<init>(RefactoringASTParser.java:40)
	at org.eclipse.jdt.internal.corext.refactoring.rename.RenameTypeProcessor.analyseEnclosedTypes(RenameTypeProcessor.java:893)
	at org.eclipse.jdt.internal.corext.refactoring.rename.RenameTypeProcessor.doCheckFinalConditions(RenameTypeProcessor.java:541)
	at org.eclipse.jdt.internal.corext.refactoring.rename.JavaRenameProcessor.checkFinalConditions(JavaRenameProcessor.java:48)
	at org.eclipse.ltk.core.refactoring.participants.ProcessorBasedRefactoring.checkFinalConditions(ProcessorBasedRefactoring.java:222)
(32 more lines...)
Collapse Failed RenameTypeTests test3 History
Default Job < 1 sec
java.lang.IllegalArgumentException: null
	at org.eclipse.jdt.core.dom.ASTParser.<init>(ASTParser.java:234)
	at org.eclipse.jdt.core.dom.ASTParser.newParser(ASTParser.java:131)
	at org.eclipse.jdt.internal.corext.refactoring.util.RefactoringASTParser.<init>(RefactoringASTParser.java:40)
	at org.eclipse.jdt.internal.corext.refactoring.rename.RenameTypeProcessor.analyseEnclosedTypes(RenameTypeProcessor.java:893)
	at org.eclipse.jdt.internal.corext.refactoring.rename.RenameTypeProcessor.doCheckFinalConditions(RenameTypeProcessor.java:541)
	at org.eclipse.jdt.internal.corext.refactoring.rename.JavaRenameProcessor.checkFinalConditions(JavaRenameProcessor.java:48)
	at org.eclipse.ltk.core.refactoring.participants.ProcessorBasedRefactoring.checkFinalConditions(ProcessorBasedRefactoring.java:222)
(32 more lines...)
Collapse Failed RenameTypeTests test4 History
Default Job < 1 sec
java.lang.IllegalArgumentException: null
	at org.eclipse.jdt.core.dom.ASTParser.<init>(ASTParser.java:234)
	at org.eclipse.jdt.core.dom.ASTParser.newParser(ASTParser.java:131)
	at org.eclipse.jdt.internal.corext.refactoring.util.RefactoringASTParser.<init>(RefactoringASTParser.java:40)
	at org.eclipse.jdt.internal.corext.refactoring.rename.RenameTypeProcessor.analyseEnclosedTypes(RenameTypeProcessor.java:893)
	at org.eclipse.jdt.internal.corext.refactoring.rename.RenameTypeProcessor.doCheckFinalConditions(RenameTypeProcessor.java:541)
	at org.eclipse.jdt.internal.corext.refactoring.rename.JavaRenameProcessor.checkFinalConditions(JavaRenameProcessor.java:48)
	at org.eclipse.ltk.core.refactoring.participants.ProcessorBasedRefactoring.checkFinalConditions(ProcessorBasedRefactoring.java:222)
(32 more lines...)
Collapse Failed RenameTypeTests test1 History
Default Job < 1 sec
java.lang.IllegalArgumentException: null
	at org.eclipse.jdt.core.dom.ASTParser.<init>(ASTParser.java:234)
	at org.eclipse.jdt.core.dom.ASTParser.newParser(ASTParser.java:131)
	at org.eclipse.jdt.internal.corext.refactoring.util.RefactoringASTParser.<init>(RefactoringASTParser.java:40)
	at org.eclipse.jdt.internal.corext.refactoring.rename.RenameTypeProcessor.analyseEnclosedTypes(RenameTypeProcessor.java:893)
	at org.eclipse.jdt.internal.corext.refactoring.rename.RenameTypeProcessor.doCheckFinalConditions(RenameTypeProcessor.java:541)
	at org.eclipse.jdt.internal.corext.refactoring.rename.JavaRenameProcessor.checkFinalConditions(JavaRenameProcessor.java:48)
	at org.eclipse.ltk.core.refactoring.participants.ProcessorBasedRefactoring.checkFinalConditions(ProcessorBasedRefactoring.java:222)
(32 more lines...)
Collapse Failed RenameTypeTests test2 History
Default Job < 1 sec
java.lang.IllegalArgumentException: null
	at org.eclipse.jdt.core.dom.ASTParser.<init>(ASTParser.java:234)
	at org.eclipse.jdt.core.dom.ASTParser.newParser(ASTParser.java:131)
	at org.eclipse.jdt.internal.corext.refactoring.util.RefactoringASTParser.<init>(RefactoringASTParser.java:40)
	at org.eclipse.jdt.internal.corext.refactoring.rename.RenameTypeProcessor.analyseEnclosedTypes(RenameTypeProcessor.java:893)
	at org.eclipse.jdt.internal.corext.refactoring.rename.RenameTypeProcessor.doCheckFinalConditions(RenameTypeProcessor.java:541)
	at org.eclipse.jdt.internal.corext.refactoring.rename.JavaRenameProcessor.checkFinalConditions(JavaRenameProcessor.java:48)
	at org.eclipse.ltk.core.refactoring.participants.ProcessorBasedRefactoring.checkFinalConditions(ProcessorBasedRefactoring.java:222)
(32 more lines...)
Collapse Failed RenameTypeTests test7 History
Default Job < 1 sec
java.lang.IllegalArgumentException: null
	at org.eclipse.jdt.core.dom.ASTParser.<init>(ASTParser.java:234)
	at org.eclipse.jdt.core.dom.ASTParser.newParser(ASTParser.java:131)
	at org.eclipse.jdt.internal.corext.refactoring.util.RefactoringASTParser.<init>(RefactoringASTParser.java:40)
	at org.eclipse.jdt.internal.corext.refactoring.rename.RenameTypeProcessor.analyseEnclosedTypes(RenameTypeProcessor.java:893)
	at org.eclipse.jdt.internal.corext.refactoring.rename.RenameTypeProcessor.doCheckFinalConditions(RenameTypeProcessor.java:541)
	at org.eclipse.jdt.internal.corext.refactoring.rename.JavaRenameProcessor.checkFinalConditions(JavaRenameProcessor.java:48)
	at org.eclipse.ltk.core.refactoring.participants.ProcessorBasedRefactoring.checkFinalConditions(ProcessorBasedRefactoring.java:222)
(32 more lines...)
Collapse Failed RenameTypeTests test8 History
Default Job < 1 sec
java.lang.IllegalArgumentException: null
	at org.eclipse.jdt.core.dom.ASTParser.<init>(ASTParser.java:234)
	at org.eclipse.jdt.core.dom.ASTParser.newParser(ASTParser.java:131)
	at org.eclipse.jdt.internal.corext.refactoring.util.RefactoringASTParser.<init>(RefactoringASTParser.java:40)
	at org.eclipse.jdt.internal.corext.refactoring.rename.RenameTypeProcessor.analyseEnclosedTypes(RenameTypeProcessor.java:893)
	at org.eclipse.jdt.internal.corext.refactoring.rename.RenameTypeProcessor.doCheckFinalConditions(RenameTypeProcessor.java:541)
	at org.eclipse.jdt.internal.corext.refactoring.rename.JavaRenameProcessor.checkFinalConditions(JavaRenameProcessor.java:48)
	at org.eclipse.ltk.core.refactoring.participants.ProcessorBasedRefactoring.checkFinalConditions(ProcessorBasedRefactoring.java:222)
(32 more lines...)
Collapse Failed RenameTypeTests test5 History
Default Job < 1 sec
java.lang.IllegalArgumentException: null
	at org.eclipse.jdt.core.dom.ASTParser.<init>(ASTParser.java:234)
	at org.eclipse.jdt.core.dom.ASTParser.newParser(ASTParser.java:131)
	at org.eclipse.jdt.internal.corext.refactoring.util.RefactoringASTParser.<init>(RefactoringASTParser.java:40)
	at org.eclipse.jdt.internal.corext.refactoring.rename.RenameTypeProcessor.analyseEnclosedTypes(RenameTypeProcessor.java:893)
	at org.eclipse.jdt.internal.corext.refactoring.rename.RenameTypeProcessor.doCheckFinalConditions(RenameTypeProcessor.java:541)
	at org.eclipse.jdt.internal.corext.refactoring.rename.JavaRenameProcessor.checkFinalConditions(JavaRenameProcessor.java:48)
	at org.eclipse.ltk.core.refactoring.participants.ProcessorBasedRefactoring.checkFinalConditions(ProcessorBasedRefactoring.java:222)
(32 more lines...)
Collapse Failed RenameTypeTests testEnum1 History
Default Job < 1 sec
java.lang.IllegalArgumentException: null
	at org.eclipse.jdt.core.dom.ASTParser.<init>(ASTParser.java:234)
	at org.eclipse.jdt.core.dom.ASTParser.newParser(ASTParser.java:131)
	at org.eclipse.jdt.internal.corext.refactoring.util.RefactoringASTParser.<init>(RefactoringASTParser.java:40)
	at org.eclipse.jdt.internal.corext.refactoring.rename.RenameTypeProcessor.analyseEnclosedTypes(RenameTypeProcessor.java:893)
	at org.eclipse.jdt.internal.corext.refactoring.rename.RenameTypeProcessor.doCheckFinalConditions(RenameTypeProcessor.java:541)
	at org.eclipse.jdt.internal.corext.refactoring.rename.JavaRenameProcessor.checkFinalConditions(JavaRenameProcessor.java:48)
	at org.eclipse.ltk.core.refactoring.participants.ProcessorBasedRefactoring.checkFinalConditions(ProcessorBasedRefactoring.java:222)
(32 more lines...)
Collapse Failed RenameTypeTests testEnum2 History
Default Job < 1 sec
java.lang.IllegalArgumentException: null
	at org.eclipse.jdt.core.dom.ASTParser.<init>(ASTParser.java:234)
	at org.eclipse.jdt.core.dom.ASTParser.newParser(ASTParser.java:131)
	at org.eclipse.jdt.internal.corext.refactoring.util.RefactoringASTParser.<init>(RefactoringASTParser.java:40)
	at org.eclipse.jdt.internal.corext.refactoring.rename.RenameTypeProcessor.analyseEnclosedTypes(RenameTypeProcessor.java:893)
	at org.eclipse.jdt.internal.corext.refactoring.rename.RenameTypeProcessor.doCheckFinalConditions(RenameTypeProcessor.java:541)
	at org.eclipse.jdt.internal.corext.refactoring.rename.JavaRenameProcessor.checkFinalConditions(JavaRenameProcessor.java:48)
	at org.eclipse.ltk.core.refactoring.participants.ProcessorBasedRefactoring.checkFinalConditions(ProcessorBasedRefactoring.java:222)
(32 more lines...)
Collapse Failed RenameTypeTests testInner1 History
Default Job < 1 sec
java.lang.IllegalArgumentException: null
	at org.eclipse.jdt.core.dom.ASTParser.<init>(ASTParser.java:234)
	at org.eclipse.jdt.core.dom.ASTParser.newParser(ASTParser.java:131)
	at org.eclipse.jdt.internal.corext.refactoring.util.RefactoringASTParser.<init>(RefactoringASTParser.java:40)
	at org.eclipse.jdt.internal.corext.refactoring.rename.RenameTypeProcessor.analyseEnclosedTypes(RenameTypeProcessor.java:893)
	at org.eclipse.jdt.internal.corext.refactoring.rename.RenameTypeProcessor.doCheckFinalConditions(RenameTypeProcessor.java:541)
	at org.eclipse.jdt.internal.corext.refactoring.rename.JavaRenameProcessor.checkFinalConditions(JavaRenameProcessor.java:48)
	at org.eclipse.ltk.core.refactoring.participants.ProcessorBasedRefactoring.checkFinalConditions(ProcessorBasedRefactoring.java:222)
(30 more lines...)
Collapse Failed RenameTypeTests testInner2 History
Default Job < 1 sec
java.lang.IllegalArgumentException: null
	at org.eclipse.jdt.core.dom.ASTParser.<init>(ASTParser.java:234)
	at org.eclipse.jdt.core.dom.ASTParser.newParser(ASTParser.java:131)
	at org.eclipse.jdt.internal.corext.refactoring.util.RefactoringASTParser.<init>(RefactoringASTParser.java:40)
	at org.eclipse.jdt.internal.corext.refactoring.rename.RenameTypeProcessor.analyseEnclosedTypes(RenameTypeProcessor.java:893)
	at org.eclipse.jdt.internal.corext.refactoring.rename.RenameTypeProcessor.doCheckFinalConditions(RenameTypeProcessor.java:541)
	at org.eclipse.jdt.internal.corext.refactoring.rename.JavaRenameProcessor.checkFinalConditions(JavaRenameProcessor.java:48)
	at org.eclipse.ltk.core.refactoring.participants.ProcessorBasedRefactoring.checkFinalConditions(ProcessorBasedRefactoring.java:222)
(30 more lines...)
Collapse Failed RenameTypeTests testAnnotation2 History
Default Job < 1 sec
java.lang.IllegalArgumentException: null
	at org.eclipse.jdt.core.dom.ASTParser.<init>(ASTParser.java:234)
	at org.eclipse.jdt.core.dom.ASTParser.newParser(ASTParser.java:131)
	at org.eclipse.jdt.internal.corext.refactoring.util.RefactoringASTParser.<init>(RefactoringASTParser.java:40)
	at org.eclipse.jdt.internal.corext.refactoring.rename.RenameTypeProcessor.analyseEnclosedTypes(RenameTypeProcessor.java:893)
	at org.eclipse.jdt.internal.corext.refactoring.rename.RenameTypeProcessor.doCheckFinalConditions(RenameTypeProcessor.java:541)
	at org.eclipse.jdt.internal.corext.refactoring.rename.JavaRenameProcessor.checkFinalConditions(JavaRenameProcessor.java:48)
	at org.eclipse.ltk.core.refactoring.participants.ProcessorBasedRefactoring.checkFinalConditions(ProcessorBasedRefactoring.java:222)
(32 more lines...)
Collapse Failed RenameTypeTests testAnnotation3 History
Default Job < 1 sec
java.lang.IllegalArgumentException: null
	at org.eclipse.jdt.core.dom.ASTParser.<init>(ASTParser.java:234)
	at org.eclipse.jdt.core.dom.ASTParser.newParser(ASTParser.java:131)
	at org.eclipse.jdt.internal.corext.refactoring.util.RefactoringASTParser.<init>(RefactoringASTParser.java:40)
	at org.eclipse.jdt.internal.corext.refactoring.rename.RenameTypeProcessor.analyseEnclosedTypes(RenameTypeProcessor.java:893)
	at org.eclipse.jdt.internal.corext.refactoring.rename.RenameTypeProcessor.doCheckFinalConditions(RenameTypeProcessor.java:541)
	at org.eclipse.jdt.internal.corext.refactoring.rename.JavaRenameProcessor.checkFinalConditions(JavaRenameProcessor.java:48)
	at org.eclipse.ltk.core.refactoring.participants.ProcessorBasedRefactoring.checkFinalConditions(ProcessorBasedRefactoring.java:222)
(32 more lines...)
Collapse Failed RenameTypeTests testAnnotation1 History
Default Job < 1 sec
java.lang.IllegalArgumentException: null
	at org.eclipse.jdt.core.dom.ASTParser.<init>(ASTParser.java:234)
	at org.eclipse.jdt.core.dom.ASTParser.newParser(ASTParser.java:131)
	at org.eclipse.jdt.internal.corext.refactoring.util.RefactoringASTParser.<init>(RefactoringASTParser.java:40)
	at org.eclipse.jdt.internal.corext.refactoring.rename.RenameTypeProcessor.analyseEnclosedTypes(RenameTypeProcessor.java:893)
	at org.eclipse.jdt.internal.corext.refactoring.rename.RenameTypeProcessor.doCheckFinalConditions(RenameTypeProcessor.java:541)
	at org.eclipse.jdt.internal.corext.refactoring.rename.JavaRenameProcessor.checkFinalConditions(JavaRenameProcessor.java:48)
	at org.eclipse.ltk.core.refactoring.participants.ProcessorBasedRefactoring.checkFinalConditions(ProcessorBasedRefactoring.java:222)
(38 more lines...)
Collapse Failed RenameTypeTests testGenerics1 History
Default Job < 1 sec
java.lang.IllegalArgumentException: null
	at org.eclipse.jdt.core.dom.ASTParser.<init>(ASTParser.java:234)
	at org.eclipse.jdt.core.dom.ASTParser.newParser(ASTParser.java:131)
	at org.eclipse.jdt.internal.corext.refactoring.util.RefactoringASTParser.<init>(RefactoringASTParser.java:40)
	at org.eclipse.jdt.internal.corext.refactoring.rename.RenameTypeProcessor.analyseEnclosedTypes(RenameTypeProcessor.java:893)
	at org.eclipse.jdt.internal.corext.refactoring.rename.RenameTypeProcessor.doCheckFinalConditions(RenameTypeProcessor.java:541)
	at org.eclipse.jdt.internal.corext.refactoring.rename.JavaRenameProcessor.checkFinalConditions(JavaRenameProcessor.java:48)
	at org.eclipse.ltk.core.refactoring.participants.ProcessorBasedRefactoring.checkFinalConditions(ProcessorBasedRefactoring.java:222)
(32 more lines...)
Collapse Failed RenameTypeTests test13 History
Default Job < 1 sec
java.lang.IllegalArgumentException: null
	at org.eclipse.jdt.core.dom.ASTParser.<init>(ASTParser.java:234)
	at org.eclipse.jdt.core.dom.ASTParser.newParser(ASTParser.java:131)
	at org.eclipse.jdt.internal.corext.refactoring.util.RefactoringASTParser.<init>(RefactoringASTParser.java:40)
	at org.eclipse.jdt.internal.corext.refactoring.rename.RenameTypeProcessor.analyseEnclosedTypes(RenameTypeProcessor.java:893)
	at org.eclipse.jdt.internal.corext.refactoring.rename.RenameTypeProcessor.doCheckFinalConditions(RenameTypeProcessor.java:541)
	at org.eclipse.jdt.internal.corext.refactoring.rename.JavaRenameProcessor.checkFinalConditions(JavaRenameProcessor.java:48)
	at org.eclipse.ltk.core.refactoring.participants.ProcessorBasedRefactoring.checkFinalConditions(ProcessorBasedRefactoring.java:222)
(32 more lines...)
Collapse Failed RenameTypeTests testGenerics2 History
Default Job < 1 sec
java.lang.IllegalArgumentException: null
	at org.eclipse.jdt.core.dom.ASTParser.<init>(ASTParser.java:234)
	at org.eclipse.jdt.core.dom.ASTParser.newParser(ASTParser.java:131)
	at org.eclipse.jdt.internal.corext.refactoring.util.RefactoringASTParser.<init>(RefactoringASTParser.java:40)
	at org.eclipse.jdt.internal.corext.refactoring.rename.RenameTypeProcessor.analyseEnclosedTypes(RenameTypeProcessor.java:893)
	at org.eclipse.jdt.internal.corext.refactoring.rename.RenameTypeProcessor.doCheckFinalConditions(RenameTypeProcessor.java:541)
	at org.eclipse.jdt.internal.corext.refactoring.rename.JavaRenameProcessor.checkFinalConditions(JavaRenameProcessor.java:48)
	at org.eclipse.ltk.core.refactoring.participants.ProcessorBasedRefactoring.checkFinalConditions(ProcessorBasedRefactoring.java:222)
(32 more lines...)
Collapse Failed RenameTypeTests test12 History
Default Job < 1 sec
java.lang.IllegalArgumentException: null
	at org.eclipse.jdt.core.dom.ASTParser.<init>(ASTParser.java:234)
	at org.eclipse.jdt.core.dom.ASTParser.newParser(ASTParser.java:131)
	at org.eclipse.jdt.internal.corext.refactoring.util.RefactoringASTParser.<init>(RefactoringASTParser.java:40)
	at org.eclipse.jdt.internal.corext.refactoring.rename.RenameTypeProcessor.analyseEnclosedTypes(RenameTypeProcessor.java:893)
	at org.eclipse.jdt.internal.corext.refactoring.rename.RenameTypeProcessor.doCheckFinalConditions(RenameTypeProcessor.java:541)
	at org.eclipse.jdt.internal.corext.refactoring.rename.JavaRenameProcessor.checkFinalConditions(JavaRenameProcessor.java:48)
	at org.eclipse.ltk.core.refactoring.participants.ProcessorBasedRefactoring.checkFinalConditions(ProcessorBasedRefactoring.java:222)
(32 more lines...)
Collapse Failed NewGroovyTestCaseWizardTests testCreateGroovyTestCase_YesGroovyProject History
Default Job 1 sec
java.lang.IllegalArgumentException: null
	at org.eclipse.jdt.core.dom.ASTParser.<init>(ASTParser.java:234)
	at org.eclipse.jdt.core.dom.ASTParser.newParser(ASTParser.java:131)
	at org.eclipse.jdt.ui.wizards.NewTypeWizardPage.constructCUContent(NewTypeWizardPage.java:2361)
	at org.eclipse.jdt.ui.wizards.NewTypeWizardPage.createType(NewTypeWizardPage.java:2144)
	at org.codehaus.groovy.eclipse.wizards.NewGroovyTestTypeWizardPage.createType(NewGroovyTestTypeWizardPage.java:165)
	at sun.reflect.NativeMethodAccessorImpl.invoke0(Native Method)
	at sun.reflect.NativeMethodAccessorImpl.invoke(NativeMethodAccessorImpl.java:62)
(12 more lines...)
Collapse Failed NewGroovyTestCaseWizardTests testCreateGroovyTestCase_SetUpAndTearDown History
Default Job 1 sec
java.lang.IllegalArgumentException: null
	at org.eclipse.jdt.core.dom.ASTParser.<init>(ASTParser.java:234)
	at org.eclipse.jdt.core.dom.ASTParser.newParser(ASTParser.java:131)
	at org.eclipse.jdt.ui.wizards.NewTypeWizardPage.constructCUContent(NewTypeWizardPage.java:2361)
	at org.eclipse.jdt.ui.wizards.NewTypeWizardPage.createType(NewTypeWizardPage.java:2144)
	at org.codehaus.groovy.eclipse.wizards.NewGroovyTestTypeWizardPage.createType(NewGroovyTestTypeWizardPage.java:165)
	at sun.reflect.NativeMethodAccessorImpl.invoke0(Native Method)
	at sun.reflect.NativeMethodAccessorImpl.invoke(NativeMethodAccessorImpl.java:62)
(12 more lines...)
Collapse Failed NewGroovyTypeWizardTests testCreateGroovyClass4 History
Default Job 1 sec
java.lang.IllegalArgumentException: null
	at org.eclipse.jdt.core.dom.ASTParser.<init>(ASTParser.java:234)
	at org.eclipse.jdt.core.dom.ASTParser.newParser(ASTParser.java:131)
	at org.eclipse.jdt.ui.wizards.NewTypeWizardPage.constructCUContent(NewTypeWizardPage.java:2361)
	at org.eclipse.jdt.ui.wizards.NewTypeWizardPage.createType(NewTypeWizardPage.java:2144)
	at org.codehaus.groovy.eclipse.wizards.NewClassWizardPage.createType(NewClassWizardPage.java:137)
	at org.codehaus.groovy.eclipse.wizards.NewClassWizardPage$createType.call(Unknown Source)
	at org.codehaus.groovy.runtime.callsite.CallSiteArray.defaultCall(CallSiteArray.java:48)
(3 more lines...)
Collapse Failed NewGroovyTypeWizardTests testCreateGroovyClass1 History
Default Job 1 sec
java.lang.IllegalArgumentException: null
	at org.eclipse.jdt.core.dom.ASTParser.<init>(ASTParser.java:234)
	at org.eclipse.jdt.core.dom.ASTParser.newParser(ASTParser.java:131)
	at org.eclipse.jdt.ui.wizards.NewTypeWizardPage.constructCUContent(NewTypeWizardPage.java:2361)
	at org.eclipse.jdt.ui.wizards.NewTypeWizardPage.createType(NewTypeWizardPage.java:2144)
	at org.codehaus.groovy.eclipse.wizards.NewClassWizardPage.createType(NewClassWizardPage.java:137)
	at org.codehaus.groovy.eclipse.wizards.NewClassWizardPage$createType.call(Unknown Source)
	at org.codehaus.groovy.runtime.callsite.CallSiteArray.defaultCall(CallSiteArray.java:48)
(3 more lines...)
Collapse Failed NewGroovyTypeWizardTests testCreateGroovyClass2 History
Default Job 1 sec
java.lang.IllegalArgumentException: null
	at org.eclipse.jdt.core.dom.ASTParser.<init>(ASTParser.java:234)
	at org.eclipse.jdt.core.dom.ASTParser.newParser(ASTParser.java:131)
	at org.eclipse.jdt.internal.corext.refactoring.TypeContextChecker.parseSuperType(TypeContextChecker.java:744)
	at org.eclipse.jdt.internal.corext.refactoring.TypeContextChecker.parseSuperClass(TypeContextChecker.java:724)
	at org.eclipse.jdt.ui.wizards.NewTypeWizardPage.superClassChanged(NewTypeWizardPage.java:1855)
	at org.eclipse.jdt.ui.wizards.NewTypeWizardPage.typePageDialogFieldChanged(NewTypeWizardPage.java:1154)
	at org.eclipse.jdt.ui.wizards.NewTypeWizardPage.access$2(NewTypeWizardPage.java:1118)
(9 more lines...)
Collapse Failed NewGroovyTypeWizardTests testCreateGroovyClass3 History
Default Job < 1 sec
java.lang.IllegalArgumentException: null
	at org.eclipse.jdt.core.dom.ASTParser.<init>(ASTParser.java:234)
	at org.eclipse.jdt.core.dom.ASTParser.newParser(ASTParser.java:131)
	at org.eclipse.jdt.internal.corext.refactoring.TypeContextChecker.parseSuperType(TypeContextChecker.java:744)
	at org.eclipse.jdt.internal.corext.refactoring.TypeContextChecker.parseSuperClass(TypeContextChecker.java:724)
	at org.eclipse.jdt.ui.wizards.NewTypeWizardPage.superClassChanged(NewTypeWizardPage.java:1855)
	at org.eclipse.jdt.ui.wizards.NewTypeWizardPage.typePageDialogFieldChanged(NewTypeWizardPage.java:1154)
	at org.eclipse.jdt.ui.wizards.NewTypeWizardPage.access$2(NewTypeWizardPage.java:1118)
(9 more lines...)
Fixed tests 9
Status Test Failing since View job Duration
Successful SyntheticAccessorRenamingTests testIsserOnly History
Failing since build #506 (Changes by Eric Milles) Default Job 2 secs
Successful SyntheticAccessorRenamingTests testJavaRename2 History
Failing since build #506 (Changes by Eric Milles) Default Job 1 sec
Successful SyntheticAccessorRenamingTests testJavaRename1 History
Failing since build #506 (Changes by Eric Milles) Default Job 1 sec
Successful SyntheticAccessorRenamingTests testMultiFileRename1 History
Failing since build #506 (Changes by Eric Milles) Default Job 1 sec
Successful SyntheticAccessorRenamingTests testMultiFileRename2 History
Failing since build #506 (Changes by Eric Milles) Default Job 1 sec
Successful SyntheticAccessorRenamingTests testSetterOnly History
Failing since build #506 (Changes by Eric Milles) Default Job 9 secs
Successful SyntheticAccessorRenamingTests testGetterOnly History
Failing since build #506 (Changes by Eric Milles) Default Job 2 secs
Successful SyntheticAccessorRenamingTests testSingleFileRename1 History
Failing since build #506 (Changes by Eric Milles) Default Job 1 sec
Successful SyntheticAccessorRenamingTests testSingleFileRename2 History
Failing since build #506 (Changes by Eric Milles) Default Job 1 sec