Build and test Groovy-Eclipse on Eclipse 4.7 (Oxygen)

Build: #507 failed Changes by Eric Milles

Test results

  • 5,557 tests in total
  • 40 tests failed
  • 40 failures are new
  • 9 tests were fixed
  • 195 tests were quarantined / skipped
  • 88 minutes taken in total.
New test failures 40
Status Test View job Duration
Collapse Failed DefaultGroovyMethodCompletionTests testDGMJavadoc History
Default Job 2 secs
java.lang.IllegalArgumentException: null
	at org.eclipse.jdt.core.dom.ASTParser.<init>(ASTParser.java:234)
	at org.eclipse.jdt.core.dom.ASTParser.newParser(ASTParser.java:131)
	at org.eclipse.jdt.internal.ui.text.javadoc.JavadocContentAccess2.createAST(JavadocContentAccess2.java:746)
	at org.eclipse.jdt.internal.ui.text.javadoc.JavadocContentAccess2.getJavadocNode(JavadocContentAccess2.java:723)
	at org.eclipse.jdt.internal.ui.text.javadoc.JavadocContentAccess2.javadoc2HTML(JavadocContentAccess2.java:759)
	at org.eclipse.jdt.internal.ui.text.javadoc.JavadocContentAccess2.getHTMLContentFromSource(JavadocContentAccess2.java:671)
	at org.eclipse.jdt.internal.ui.text.javadoc.JavadocContentAccess2.getHTMLContent(JavadocContentAccess2.java:534)
(8 more lines...)
Collapse Failed TypeCompletionTests2 testTypeCompletionInScript6 History
Default Job 2 secs
org.junit.ComparisonFailure: Completion proposal applied but different results found. expected:<...onUI /*tag*/ //note
[  // some single-line comment
import javax.swing.text.html.HTML]

HTML
ButtonUI> but was:<...onUI /*tag*/ //note
[import javax.swing.text.html.HTML
  // some single-line comment]
(22 more lines...)
Collapse Failed JUnit4TestFinderTests testUsingTestAnnotation History
Default Job 1 sec
java.lang.IllegalArgumentException: null
	at org.eclipse.jdt.core.dom.ASTParser.<init>(ASTParser.java:234)
	at org.eclipse.jdt.core.dom.ASTParser.newParser(ASTParser.java:131)
	at org.eclipse.jdt.internal.junit.launcher.JUnit4TestFinder.internalIsTest(JUnit4TestFinder.java:208)
	at org.eclipse.jdt.internal.junit.launcher.JUnit4TestFinder.isTest(JUnit4TestFinder.java:200)
	at org.eclipse.jdt.internal.junit.launcher.ITestFinder$isTest.call(Unknown Source)
	at org.codehaus.groovy.eclipse.junit.test.JUnit4TestFinderTests.assertTypeIsTest(JUnit4TestFinderTests.groovy:29)
	at org.codehaus.groovy.eclipse.junit.test.JUnit4TestFinderTests.assertTypeIsTest(JUnit4TestFinderTests.groovy)
(1 more lines...)
Collapse Failed JUnit4TestFinderTests testUsingRunWithAnnotation History
Default Job 1 sec
java.lang.IllegalArgumentException: null
	at org.eclipse.jdt.core.dom.ASTParser.<init>(ASTParser.java:234)
	at org.eclipse.jdt.core.dom.ASTParser.newParser(ASTParser.java:131)
	at org.eclipse.jdt.internal.junit.launcher.JUnit4TestFinder.internalIsTest(JUnit4TestFinder.java:208)
	at org.eclipse.jdt.internal.junit.launcher.JUnit4TestFinder.isTest(JUnit4TestFinder.java:200)
	at org.eclipse.jdt.internal.junit.launcher.ITestFinder$isTest.call(Unknown Source)
	at org.codehaus.groovy.eclipse.junit.test.JUnit4TestFinderTests.assertTypeIsTest(JUnit4TestFinderTests.groovy:29)
	at org.codehaus.groovy.eclipse.junit.test.JUnit4TestFinderTests.assertTypeIsTest(JUnit4TestFinderTests.groovy)
(1 more lines...)
Collapse Failed JUnit4TestFinderTests testFinderOfSubclass History
Default Job 2 secs
java.lang.IllegalArgumentException: null
	at org.eclipse.jdt.core.dom.ASTParser.<init>(ASTParser.java:234)
	at org.eclipse.jdt.core.dom.ASTParser.newParser(ASTParser.java:131)
	at org.eclipse.jdt.internal.junit.launcher.JUnit4TestFinder.internalIsTest(JUnit4TestFinder.java:208)
	at org.eclipse.jdt.internal.junit.launcher.JUnit4TestFinder.isTest(JUnit4TestFinder.java:200)
	at org.eclipse.jdt.internal.junit.launcher.ITestFinder$isTest.call(Unknown Source)
	at org.codehaus.groovy.eclipse.junit.test.JUnit4TestFinderTests.assertTypeIsTest(JUnit4TestFinderTests.groovy:29)
	at org.codehaus.groovy.eclipse.junit.test.JUnit4TestFinderTests.assertTypeIsTest(JUnit4TestFinderTests.groovy)
(1 more lines...)
Collapse Failed JUnit4TestFinderTests testFindTestWithExpectedException History
Default Job 1 sec
java.lang.IllegalArgumentException: null
	at org.eclipse.jdt.core.dom.ASTParser.<init>(ASTParser.java:234)
	at org.eclipse.jdt.core.dom.ASTParser.newParser(ASTParser.java:131)
	at org.eclipse.jdt.internal.junit.launcher.JUnit4TestFinder.internalIsTest(JUnit4TestFinder.java:208)
	at org.eclipse.jdt.internal.junit.launcher.JUnit4TestFinder.isTest(JUnit4TestFinder.java:200)
	at org.eclipse.jdt.internal.junit.util.CoreTestSearchEngine.isTestOrTestSuite(CoreTestSearchEngine.java:57)
	at org.eclipse.jdt.internal.junit.JUnitPropertyTester.isJUnitTest(JUnitPropertyTester.java:117)
	at org.eclipse.jdt.internal.junit.JUnitPropertyTester.canLaunchAsJUnitTest(JUnitPropertyTester.java:85)
(6 more lines...)
Collapse Failed JUnit4TestFinderTests testFinderOfNonPublicSubclass History
Default Job 9 secs
java.lang.IllegalArgumentException: null
	at org.eclipse.jdt.core.dom.ASTParser.<init>(ASTParser.java:234)
	at org.eclipse.jdt.core.dom.ASTParser.newParser(ASTParser.java:131)
	at org.eclipse.jdt.internal.junit.launcher.JUnit4TestFinder.internalIsTest(JUnit4TestFinder.java:208)
	at org.eclipse.jdt.internal.junit.launcher.JUnit4TestFinder.isTest(JUnit4TestFinder.java:200)
	at org.eclipse.jdt.internal.junit.launcher.ITestFinder$isTest.call(Unknown Source)
	at org.codehaus.groovy.runtime.callsite.CallSiteArray.defaultCall(CallSiteArray.java:48)
	at org.codehaus.groovy.runtime.callsite.AbstractCallSite.call(AbstractCallSite.java:113)
(3 more lines...)
Collapse Failed RenameTypeTests test6 History
Default Job < 1 sec
java.lang.IllegalArgumentException: null
	at org.eclipse.jdt.core.dom.ASTParser.<init>(ASTParser.java:234)
	at org.eclipse.jdt.core.dom.ASTParser.newParser(ASTParser.java:131)
	at org.eclipse.jdt.internal.corext.refactoring.util.RefactoringASTParser.<init>(RefactoringASTParser.java:40)
	at org.eclipse.jdt.internal.corext.refactoring.rename.RenameTypeProcessor.analyseEnclosedTypes(RenameTypeProcessor.java:893)
	at org.eclipse.jdt.internal.corext.refactoring.rename.RenameTypeProcessor.doCheckFinalConditions(RenameTypeProcessor.java:541)
	at org.eclipse.jdt.internal.corext.refactoring.rename.JavaRenameProcessor.checkFinalConditions(JavaRenameProcessor.java:48)
	at org.eclipse.ltk.core.refactoring.participants.ProcessorBasedRefactoring.checkFinalConditions(ProcessorBasedRefactoring.java:222)
(32 more lines...)
Collapse Failed RenameTypeTests testGenerics3 History
Default Job < 1 sec
java.lang.IllegalArgumentException: null
	at org.eclipse.jdt.core.dom.ASTParser.<init>(ASTParser.java:234)
	at org.eclipse.jdt.core.dom.ASTParser.newParser(ASTParser.java:131)
	at org.eclipse.jdt.internal.corext.refactoring.util.RefactoringASTParser.<init>(RefactoringASTParser.java:40)
	at org.eclipse.jdt.internal.corext.refactoring.rename.RenameTypeProcessor.analyseEnclosedTypes(RenameTypeProcessor.java:893)
	at org.eclipse.jdt.internal.corext.refactoring.rename.RenameTypeProcessor.doCheckFinalConditions(RenameTypeProcessor.java:541)
	at org.eclipse.jdt.internal.corext.refactoring.rename.JavaRenameProcessor.checkFinalConditions(JavaRenameProcessor.java:48)
	at org.eclipse.ltk.core.refactoring.participants.ProcessorBasedRefactoring.checkFinalConditions(ProcessorBasedRefactoring.java:222)
(32 more lines...)
Collapse Failed RenameTypeTests testGenerics4 History
Default Job < 1 sec
java.lang.IllegalArgumentException: null
	at org.eclipse.jdt.core.dom.ASTParser.<init>(ASTParser.java:234)
	at org.eclipse.jdt.core.dom.ASTParser.newParser(ASTParser.java:131)
	at org.eclipse.jdt.internal.corext.refactoring.util.RefactoringASTParser.<init>(RefactoringASTParser.java:40)
	at org.eclipse.jdt.internal.corext.refactoring.rename.RenameTypeProcessor.analyseEnclosedTypes(RenameTypeProcessor.java:893)
	at org.eclipse.jdt.internal.corext.refactoring.rename.RenameTypeProcessor.doCheckFinalConditions(RenameTypeProcessor.java:541)
	at org.eclipse.jdt.internal.corext.refactoring.rename.JavaRenameProcessor.checkFinalConditions(JavaRenameProcessor.java:48)
	at org.eclipse.ltk.core.refactoring.participants.ProcessorBasedRefactoring.checkFinalConditions(ProcessorBasedRefactoring.java:222)
(32 more lines...)
Collapse Failed RenameTypeTests test11 History
Default Job < 1 sec
java.lang.IllegalArgumentException: null
	at org.eclipse.jdt.core.dom.ASTParser.<init>(ASTParser.java:234)
	at org.eclipse.jdt.core.dom.ASTParser.newParser(ASTParser.java:131)
	at org.eclipse.jdt.internal.corext.refactoring.util.RefactoringASTParser.<init>(RefactoringASTParser.java:40)
	at org.eclipse.jdt.internal.corext.refactoring.rename.RenameTypeProcessor.analyseEnclosedTypes(RenameTypeProcessor.java:893)
	at org.eclipse.jdt.internal.corext.refactoring.rename.RenameTypeProcessor.doCheckFinalConditions(RenameTypeProcessor.java:541)
	at org.eclipse.jdt.internal.corext.refactoring.rename.JavaRenameProcessor.checkFinalConditions(JavaRenameProcessor.java:48)
	at org.eclipse.ltk.core.refactoring.participants.ProcessorBasedRefactoring.checkFinalConditions(ProcessorBasedRefactoring.java:222)
(32 more lines...)
Collapse Failed RenameTypeTests test10 History
Default Job < 1 sec
java.lang.IllegalArgumentException: null
	at org.eclipse.jdt.core.dom.ASTParser.<init>(ASTParser.java:234)
	at org.eclipse.jdt.core.dom.ASTParser.newParser(ASTParser.java:131)
	at org.eclipse.jdt.internal.corext.refactoring.util.RefactoringASTParser.<init>(RefactoringASTParser.java:40)
	at org.eclipse.jdt.internal.corext.refactoring.rename.RenameTypeProcessor.analyseEnclosedTypes(RenameTypeProcessor.java:893)
	at org.eclipse.jdt.internal.corext.refactoring.rename.RenameTypeProcessor.doCheckFinalConditions(RenameTypeProcessor.java:541)
	at org.eclipse.jdt.internal.corext.refactoring.rename.JavaRenameProcessor.checkFinalConditions(JavaRenameProcessor.java:48)
	at org.eclipse.ltk.core.refactoring.participants.ProcessorBasedRefactoring.checkFinalConditions(ProcessorBasedRefactoring.java:222)
(32 more lines...)
Collapse Failed RenameTypeTests testInner3 History
Default Job 1 sec
java.lang.IllegalArgumentException: null
	at org.eclipse.jdt.core.dom.ASTParser.<init>(ASTParser.java:234)
	at org.eclipse.jdt.core.dom.ASTParser.newParser(ASTParser.java:131)
	at org.eclipse.jdt.internal.corext.refactoring.util.RefactoringASTParser.<init>(RefactoringASTParser.java:40)
	at org.eclipse.jdt.internal.corext.refactoring.rename.RenameTypeProcessor.analyseEnclosedTypes(RenameTypeProcessor.java:893)
	at org.eclipse.jdt.internal.corext.refactoring.rename.RenameTypeProcessor.doCheckFinalConditions(RenameTypeProcessor.java:541)
	at org.eclipse.jdt.internal.corext.refactoring.rename.JavaRenameProcessor.checkFinalConditions(JavaRenameProcessor.java:48)
	at org.eclipse.ltk.core.refactoring.participants.ProcessorBasedRefactoring.checkFinalConditions(ProcessorBasedRefactoring.java:222)
(30 more lines...)
Collapse Failed RenameTypeTests testAlias1 History
Default Job < 1 sec
java.lang.IllegalArgumentException: null
	at org.eclipse.jdt.core.dom.ASTParser.<init>(ASTParser.java:234)
	at org.eclipse.jdt.core.dom.ASTParser.newParser(ASTParser.java:131)
	at org.eclipse.jdt.internal.corext.refactoring.util.RefactoringASTParser.<init>(RefactoringASTParser.java:40)
	at org.eclipse.jdt.internal.corext.refactoring.rename.RenameTypeProcessor.analyseEnclosedTypes(RenameTypeProcessor.java:893)
	at org.eclipse.jdt.internal.corext.refactoring.rename.RenameTypeProcessor.doCheckFinalConditions(RenameTypeProcessor.java:541)
	at org.eclipse.jdt.internal.corext.refactoring.rename.JavaRenameProcessor.checkFinalConditions(JavaRenameProcessor.java:48)
	at org.eclipse.ltk.core.refactoring.participants.ProcessorBasedRefactoring.checkFinalConditions(ProcessorBasedRefactoring.java:222)
(32 more lines...)
Collapse Failed RenameTypeTests testJavadoc1 History
Default Job < 1 sec
java.lang.IllegalArgumentException: null
	at org.eclipse.jdt.core.dom.ASTParser.<init>(ASTParser.java:234)
	at org.eclipse.jdt.core.dom.ASTParser.newParser(ASTParser.java:131)
	at org.eclipse.jdt.internal.corext.refactoring.util.RefactoringASTParser.<init>(RefactoringASTParser.java:40)
	at org.eclipse.jdt.internal.corext.refactoring.rename.RenameTypeProcessor.analyseEnclosedTypes(RenameTypeProcessor.java:893)
	at org.eclipse.jdt.internal.corext.refactoring.rename.RenameTypeProcessor.doCheckFinalConditions(RenameTypeProcessor.java:541)
	at org.eclipse.jdt.internal.corext.refactoring.rename.JavaRenameProcessor.checkFinalConditions(JavaRenameProcessor.java:48)
	at org.eclipse.ltk.core.refactoring.participants.ProcessorBasedRefactoring.checkFinalConditions(ProcessorBasedRefactoring.java:222)
(30 more lines...)
Collapse Failed RenameTypeTests test9 History
Default Job < 1 sec
java.lang.IllegalArgumentException: null
	at org.eclipse.jdt.core.dom.ASTParser.<init>(ASTParser.java:234)
	at org.eclipse.jdt.core.dom.ASTParser.newParser(ASTParser.java:131)
	at org.eclipse.jdt.internal.corext.refactoring.util.RefactoringASTParser.<init>(RefactoringASTParser.java:40)
	at org.eclipse.jdt.internal.corext.refactoring.rename.RenameTypeProcessor.analyseEnclosedTypes(RenameTypeProcessor.java:893)
	at org.eclipse.jdt.internal.corext.refactoring.rename.RenameTypeProcessor.doCheckFinalConditions(RenameTypeProcessor.java:541)
	at org.eclipse.jdt.internal.corext.refactoring.rename.JavaRenameProcessor.checkFinalConditions(JavaRenameProcessor.java:48)
	at org.eclipse.ltk.core.refactoring.participants.ProcessorBasedRefactoring.checkFinalConditions(ProcessorBasedRefactoring.java:222)
(32 more lines...)
Collapse Failed RenameTypeTests test3 History
Default Job < 1 sec
java.lang.IllegalArgumentException: null
	at org.eclipse.jdt.core.dom.ASTParser.<init>(ASTParser.java:234)
	at org.eclipse.jdt.core.dom.ASTParser.newParser(ASTParser.java:131)
	at org.eclipse.jdt.internal.corext.refactoring.util.RefactoringASTParser.<init>(RefactoringASTParser.java:40)
	at org.eclipse.jdt.internal.corext.refactoring.rename.RenameTypeProcessor.analyseEnclosedTypes(RenameTypeProcessor.java:893)
	at org.eclipse.jdt.internal.corext.refactoring.rename.RenameTypeProcessor.doCheckFinalConditions(RenameTypeProcessor.java:541)
	at org.eclipse.jdt.internal.corext.refactoring.rename.JavaRenameProcessor.checkFinalConditions(JavaRenameProcessor.java:48)
	at org.eclipse.ltk.core.refactoring.participants.ProcessorBasedRefactoring.checkFinalConditions(ProcessorBasedRefactoring.java:222)
(32 more lines...)
Collapse Failed RenameTypeTests test4 History
Default Job < 1 sec
java.lang.IllegalArgumentException: null
	at org.eclipse.jdt.core.dom.ASTParser.<init>(ASTParser.java:234)
	at org.eclipse.jdt.core.dom.ASTParser.newParser(ASTParser.java:131)
	at org.eclipse.jdt.internal.corext.refactoring.util.RefactoringASTParser.<init>(RefactoringASTParser.java:40)
	at org.eclipse.jdt.internal.corext.refactoring.rename.RenameTypeProcessor.analyseEnclosedTypes(RenameTypeProcessor.java:893)
	at org.eclipse.jdt.internal.corext.refactoring.rename.RenameTypeProcessor.doCheckFinalConditions(RenameTypeProcessor.java:541)
	at org.eclipse.jdt.internal.corext.refactoring.rename.JavaRenameProcessor.checkFinalConditions(JavaRenameProcessor.java:48)
	at org.eclipse.ltk.core.refactoring.participants.ProcessorBasedRefactoring.checkFinalConditions(ProcessorBasedRefactoring.java:222)
(32 more lines...)
Collapse Failed RenameTypeTests test1 History
Default Job < 1 sec
java.lang.IllegalArgumentException: null
	at org.eclipse.jdt.core.dom.ASTParser.<init>(ASTParser.java:234)
	at org.eclipse.jdt.core.dom.ASTParser.newParser(ASTParser.java:131)
	at org.eclipse.jdt.internal.corext.refactoring.util.RefactoringASTParser.<init>(RefactoringASTParser.java:40)
	at org.eclipse.jdt.internal.corext.refactoring.rename.RenameTypeProcessor.analyseEnclosedTypes(RenameTypeProcessor.java:893)
	at org.eclipse.jdt.internal.corext.refactoring.rename.RenameTypeProcessor.doCheckFinalConditions(RenameTypeProcessor.java:541)
	at org.eclipse.jdt.internal.corext.refactoring.rename.JavaRenameProcessor.checkFinalConditions(JavaRenameProcessor.java:48)
	at org.eclipse.ltk.core.refactoring.participants.ProcessorBasedRefactoring.checkFinalConditions(ProcessorBasedRefactoring.java:222)
(32 more lines...)
Collapse Failed RenameTypeTests test2 History
Default Job < 1 sec
java.lang.IllegalArgumentException: null
	at org.eclipse.jdt.core.dom.ASTParser.<init>(ASTParser.java:234)
	at org.eclipse.jdt.core.dom.ASTParser.newParser(ASTParser.java:131)
	at org.eclipse.jdt.internal.corext.refactoring.util.RefactoringASTParser.<init>(RefactoringASTParser.java:40)
	at org.eclipse.jdt.internal.corext.refactoring.rename.RenameTypeProcessor.analyseEnclosedTypes(RenameTypeProcessor.java:893)
	at org.eclipse.jdt.internal.corext.refactoring.rename.RenameTypeProcessor.doCheckFinalConditions(RenameTypeProcessor.java:541)
	at org.eclipse.jdt.internal.corext.refactoring.rename.JavaRenameProcessor.checkFinalConditions(JavaRenameProcessor.java:48)
	at org.eclipse.ltk.core.refactoring.participants.ProcessorBasedRefactoring.checkFinalConditions(ProcessorBasedRefactoring.java:222)
(32 more lines...)
Collapse Failed RenameTypeTests test7 History
Default Job < 1 sec
java.lang.IllegalArgumentException: null
	at org.eclipse.jdt.core.dom.ASTParser.<init>(ASTParser.java:234)
	at org.eclipse.jdt.core.dom.ASTParser.newParser(ASTParser.java:131)
	at org.eclipse.jdt.internal.corext.refactoring.util.RefactoringASTParser.<init>(RefactoringASTParser.java:40)
	at org.eclipse.jdt.internal.corext.refactoring.rename.RenameTypeProcessor.analyseEnclosedTypes(RenameTypeProcessor.java:893)
	at org.eclipse.jdt.internal.corext.refactoring.rename.RenameTypeProcessor.doCheckFinalConditions(RenameTypeProcessor.java:541)
	at org.eclipse.jdt.internal.corext.refactoring.rename.JavaRenameProcessor.checkFinalConditions(JavaRenameProcessor.java:48)
	at org.eclipse.ltk.core.refactoring.participants.ProcessorBasedRefactoring.checkFinalConditions(ProcessorBasedRefactoring.java:222)
(32 more lines...)
Collapse Failed RenameTypeTests test8 History
Default Job < 1 sec
java.lang.IllegalArgumentException: null
	at org.eclipse.jdt.core.dom.ASTParser.<init>(ASTParser.java:234)
	at org.eclipse.jdt.core.dom.ASTParser.newParser(ASTParser.java:131)
	at org.eclipse.jdt.internal.corext.refactoring.util.RefactoringASTParser.<init>(RefactoringASTParser.java:40)
	at org.eclipse.jdt.internal.corext.refactoring.rename.RenameTypeProcessor.analyseEnclosedTypes(RenameTypeProcessor.java:893)
	at org.eclipse.jdt.internal.corext.refactoring.rename.RenameTypeProcessor.doCheckFinalConditions(RenameTypeProcessor.java:541)
	at org.eclipse.jdt.internal.corext.refactoring.rename.JavaRenameProcessor.checkFinalConditions(JavaRenameProcessor.java:48)
	at org.eclipse.ltk.core.refactoring.participants.ProcessorBasedRefactoring.checkFinalConditions(ProcessorBasedRefactoring.java:222)
(32 more lines...)
Collapse Failed RenameTypeTests test5 History
Default Job < 1 sec
java.lang.IllegalArgumentException: null
	at org.eclipse.jdt.core.dom.ASTParser.<init>(ASTParser.java:234)
	at org.eclipse.jdt.core.dom.ASTParser.newParser(ASTParser.java:131)
	at org.eclipse.jdt.internal.corext.refactoring.util.RefactoringASTParser.<init>(RefactoringASTParser.java:40)
	at org.eclipse.jdt.internal.corext.refactoring.rename.RenameTypeProcessor.analyseEnclosedTypes(RenameTypeProcessor.java:893)
	at org.eclipse.jdt.internal.corext.refactoring.rename.RenameTypeProcessor.doCheckFinalConditions(RenameTypeProcessor.java:541)
	at org.eclipse.jdt.internal.corext.refactoring.rename.JavaRenameProcessor.checkFinalConditions(JavaRenameProcessor.java:48)
	at org.eclipse.ltk.core.refactoring.participants.ProcessorBasedRefactoring.checkFinalConditions(ProcessorBasedRefactoring.java:222)
(32 more lines...)
Collapse Failed RenameTypeTests testEnum1 History
Default Job < 1 sec
java.lang.IllegalArgumentException: null
	at org.eclipse.jdt.core.dom.ASTParser.<init>(ASTParser.java:234)
	at org.eclipse.jdt.core.dom.ASTParser.newParser(ASTParser.java:131)
	at org.eclipse.jdt.internal.corext.refactoring.util.RefactoringASTParser.<init>(RefactoringASTParser.java:40)
	at org.eclipse.jdt.internal.corext.refactoring.rename.RenameTypeProcessor.analyseEnclosedTypes(RenameTypeProcessor.java:893)
	at org.eclipse.jdt.internal.corext.refactoring.rename.RenameTypeProcessor.doCheckFinalConditions(RenameTypeProcessor.java:541)
	at org.eclipse.jdt.internal.corext.refactoring.rename.JavaRenameProcessor.checkFinalConditions(JavaRenameProcessor.java:48)
	at org.eclipse.ltk.core.refactoring.participants.ProcessorBasedRefactoring.checkFinalConditions(ProcessorBasedRefactoring.java:222)
(32 more lines...)
Collapse Failed RenameTypeTests testEnum2 History
Default Job < 1 sec
java.lang.IllegalArgumentException: null
	at org.eclipse.jdt.core.dom.ASTParser.<init>(ASTParser.java:234)
	at org.eclipse.jdt.core.dom.ASTParser.newParser(ASTParser.java:131)
	at org.eclipse.jdt.internal.corext.refactoring.util.RefactoringASTParser.<init>(RefactoringASTParser.java:40)
	at org.eclipse.jdt.internal.corext.refactoring.rename.RenameTypeProcessor.analyseEnclosedTypes(RenameTypeProcessor.java:893)
	at org.eclipse.jdt.internal.corext.refactoring.rename.RenameTypeProcessor.doCheckFinalConditions(RenameTypeProcessor.java:541)
	at org.eclipse.jdt.internal.corext.refactoring.rename.JavaRenameProcessor.checkFinalConditions(JavaRenameProcessor.java:48)
	at org.eclipse.ltk.core.refactoring.participants.ProcessorBasedRefactoring.checkFinalConditions(ProcessorBasedRefactoring.java:222)
(32 more lines...)
Collapse Failed RenameTypeTests testInner1 History
Default Job < 1 sec
java.lang.IllegalArgumentException: null
	at org.eclipse.jdt.core.dom.ASTParser.<init>(ASTParser.java:234)
	at org.eclipse.jdt.core.dom.ASTParser.newParser(ASTParser.java:131)
	at org.eclipse.jdt.internal.corext.refactoring.util.RefactoringASTParser.<init>(RefactoringASTParser.java:40)
	at org.eclipse.jdt.internal.corext.refactoring.rename.RenameTypeProcessor.analyseEnclosedTypes(RenameTypeProcessor.java:893)
	at org.eclipse.jdt.internal.corext.refactoring.rename.RenameTypeProcessor.doCheckFinalConditions(RenameTypeProcessor.java:541)
	at org.eclipse.jdt.internal.corext.refactoring.rename.JavaRenameProcessor.checkFinalConditions(JavaRenameProcessor.java:48)
	at org.eclipse.ltk.core.refactoring.participants.ProcessorBasedRefactoring.checkFinalConditions(ProcessorBasedRefactoring.java:222)
(30 more lines...)
Collapse Failed RenameTypeTests testInner2 History
Default Job < 1 sec
java.lang.IllegalArgumentException: null
	at org.eclipse.jdt.core.dom.ASTParser.<init>(ASTParser.java:234)
	at org.eclipse.jdt.core.dom.ASTParser.newParser(ASTParser.java:131)
	at org.eclipse.jdt.internal.corext.refactoring.util.RefactoringASTParser.<init>(RefactoringASTParser.java:40)
	at org.eclipse.jdt.internal.corext.refactoring.rename.RenameTypeProcessor.analyseEnclosedTypes(RenameTypeProcessor.java:893)
	at org.eclipse.jdt.internal.corext.refactoring.rename.RenameTypeProcessor.doCheckFinalConditions(RenameTypeProcessor.java:541)
	at org.eclipse.jdt.internal.corext.refactoring.rename.JavaRenameProcessor.checkFinalConditions(JavaRenameProcessor.java:48)
	at org.eclipse.ltk.core.refactoring.participants.ProcessorBasedRefactoring.checkFinalConditions(ProcessorBasedRefactoring.java:222)
(30 more lines...)
Collapse Failed RenameTypeTests testAnnotation2 History
Default Job < 1 sec
java.lang.IllegalArgumentException: null
	at org.eclipse.jdt.core.dom.ASTParser.<init>(ASTParser.java:234)
	at org.eclipse.jdt.core.dom.ASTParser.newParser(ASTParser.java:131)
	at org.eclipse.jdt.internal.corext.refactoring.util.RefactoringASTParser.<init>(RefactoringASTParser.java:40)
	at org.eclipse.jdt.internal.corext.refactoring.rename.RenameTypeProcessor.analyseEnclosedTypes(RenameTypeProcessor.java:893)
	at org.eclipse.jdt.internal.corext.refactoring.rename.RenameTypeProcessor.doCheckFinalConditions(RenameTypeProcessor.java:541)
	at org.eclipse.jdt.internal.corext.refactoring.rename.JavaRenameProcessor.checkFinalConditions(JavaRenameProcessor.java:48)
	at org.eclipse.ltk.core.refactoring.participants.ProcessorBasedRefactoring.checkFinalConditions(ProcessorBasedRefactoring.java:222)
(32 more lines...)
Collapse Failed RenameTypeTests testAnnotation3 History
Default Job < 1 sec
java.lang.IllegalArgumentException: null
	at org.eclipse.jdt.core.dom.ASTParser.<init>(ASTParser.java:234)
	at org.eclipse.jdt.core.dom.ASTParser.newParser(ASTParser.java:131)
	at org.eclipse.jdt.internal.corext.refactoring.util.RefactoringASTParser.<init>(RefactoringASTParser.java:40)
	at org.eclipse.jdt.internal.corext.refactoring.rename.RenameTypeProcessor.analyseEnclosedTypes(RenameTypeProcessor.java:893)
	at org.eclipse.jdt.internal.corext.refactoring.rename.RenameTypeProcessor.doCheckFinalConditions(RenameTypeProcessor.java:541)
	at org.eclipse.jdt.internal.corext.refactoring.rename.JavaRenameProcessor.checkFinalConditions(JavaRenameProcessor.java:48)
	at org.eclipse.ltk.core.refactoring.participants.ProcessorBasedRefactoring.checkFinalConditions(ProcessorBasedRefactoring.java:222)
(32 more lines...)
Collapse Failed RenameTypeTests testAnnotation1 History
Default Job < 1 sec
java.lang.IllegalArgumentException: null
	at org.eclipse.jdt.core.dom.ASTParser.<init>(ASTParser.java:234)
	at org.eclipse.jdt.core.dom.ASTParser.newParser(ASTParser.java:131)
	at org.eclipse.jdt.internal.corext.refactoring.util.RefactoringASTParser.<init>(RefactoringASTParser.java:40)
	at org.eclipse.jdt.internal.corext.refactoring.rename.RenameTypeProcessor.analyseEnclosedTypes(RenameTypeProcessor.java:893)
	at org.eclipse.jdt.internal.corext.refactoring.rename.RenameTypeProcessor.doCheckFinalConditions(RenameTypeProcessor.java:541)
	at org.eclipse.jdt.internal.corext.refactoring.rename.JavaRenameProcessor.checkFinalConditions(JavaRenameProcessor.java:48)
	at org.eclipse.ltk.core.refactoring.participants.ProcessorBasedRefactoring.checkFinalConditions(ProcessorBasedRefactoring.java:222)
(38 more lines...)
Collapse Failed RenameTypeTests testGenerics1 History
Default Job < 1 sec
java.lang.IllegalArgumentException: null
	at org.eclipse.jdt.core.dom.ASTParser.<init>(ASTParser.java:234)
	at org.eclipse.jdt.core.dom.ASTParser.newParser(ASTParser.java:131)
	at org.eclipse.jdt.internal.corext.refactoring.util.RefactoringASTParser.<init>(RefactoringASTParser.java:40)
	at org.eclipse.jdt.internal.corext.refactoring.rename.RenameTypeProcessor.analyseEnclosedTypes(RenameTypeProcessor.java:893)
	at org.eclipse.jdt.internal.corext.refactoring.rename.RenameTypeProcessor.doCheckFinalConditions(RenameTypeProcessor.java:541)
	at org.eclipse.jdt.internal.corext.refactoring.rename.JavaRenameProcessor.checkFinalConditions(JavaRenameProcessor.java:48)
	at org.eclipse.ltk.core.refactoring.participants.ProcessorBasedRefactoring.checkFinalConditions(ProcessorBasedRefactoring.java:222)
(32 more lines...)
Collapse Failed RenameTypeTests test13 History
Default Job < 1 sec
java.lang.IllegalArgumentException: null
	at org.eclipse.jdt.core.dom.ASTParser.<init>(ASTParser.java:234)
	at org.eclipse.jdt.core.dom.ASTParser.newParser(ASTParser.java:131)
	at org.eclipse.jdt.internal.corext.refactoring.util.RefactoringASTParser.<init>(RefactoringASTParser.java:40)
	at org.eclipse.jdt.internal.corext.refactoring.rename.RenameTypeProcessor.analyseEnclosedTypes(RenameTypeProcessor.java:893)
	at org.eclipse.jdt.internal.corext.refactoring.rename.RenameTypeProcessor.doCheckFinalConditions(RenameTypeProcessor.java:541)
	at org.eclipse.jdt.internal.corext.refactoring.rename.JavaRenameProcessor.checkFinalConditions(JavaRenameProcessor.java:48)
	at org.eclipse.ltk.core.refactoring.participants.ProcessorBasedRefactoring.checkFinalConditions(ProcessorBasedRefactoring.java:222)
(32 more lines...)
Collapse Failed RenameTypeTests testGenerics2 History
Default Job < 1 sec
java.lang.IllegalArgumentException: null
	at org.eclipse.jdt.core.dom.ASTParser.<init>(ASTParser.java:234)
	at org.eclipse.jdt.core.dom.ASTParser.newParser(ASTParser.java:131)
	at org.eclipse.jdt.internal.corext.refactoring.util.RefactoringASTParser.<init>(RefactoringASTParser.java:40)
	at org.eclipse.jdt.internal.corext.refactoring.rename.RenameTypeProcessor.analyseEnclosedTypes(RenameTypeProcessor.java:893)
	at org.eclipse.jdt.internal.corext.refactoring.rename.RenameTypeProcessor.doCheckFinalConditions(RenameTypeProcessor.java:541)
	at org.eclipse.jdt.internal.corext.refactoring.rename.JavaRenameProcessor.checkFinalConditions(JavaRenameProcessor.java:48)
	at org.eclipse.ltk.core.refactoring.participants.ProcessorBasedRefactoring.checkFinalConditions(ProcessorBasedRefactoring.java:222)
(32 more lines...)
Collapse Failed RenameTypeTests test12 History
Default Job < 1 sec
java.lang.IllegalArgumentException: null
	at org.eclipse.jdt.core.dom.ASTParser.<init>(ASTParser.java:234)
	at org.eclipse.jdt.core.dom.ASTParser.newParser(ASTParser.java:131)
	at org.eclipse.jdt.internal.corext.refactoring.util.RefactoringASTParser.<init>(RefactoringASTParser.java:40)
	at org.eclipse.jdt.internal.corext.refactoring.rename.RenameTypeProcessor.analyseEnclosedTypes(RenameTypeProcessor.java:893)
	at org.eclipse.jdt.internal.corext.refactoring.rename.RenameTypeProcessor.doCheckFinalConditions(RenameTypeProcessor.java:541)
	at org.eclipse.jdt.internal.corext.refactoring.rename.JavaRenameProcessor.checkFinalConditions(JavaRenameProcessor.java:48)
	at org.eclipse.ltk.core.refactoring.participants.ProcessorBasedRefactoring.checkFinalConditions(ProcessorBasedRefactoring.java:222)
(32 more lines...)
Collapse Failed NewGroovyTestCaseWizardTests testCreateGroovyTestCase_YesGroovyProject History
Default Job 1 sec
java.lang.IllegalArgumentException: null
	at org.eclipse.jdt.core.dom.ASTParser.<init>(ASTParser.java:234)
	at org.eclipse.jdt.core.dom.ASTParser.newParser(ASTParser.java:131)
	at org.eclipse.jdt.ui.wizards.NewTypeWizardPage.constructCUContent(NewTypeWizardPage.java:2361)
	at org.eclipse.jdt.ui.wizards.NewTypeWizardPage.createType(NewTypeWizardPage.java:2144)
	at org.codehaus.groovy.eclipse.wizards.NewGroovyTestTypeWizardPage.createType(NewGroovyTestTypeWizardPage.java:165)
	at sun.reflect.NativeMethodAccessorImpl.invoke0(Native Method)
	at sun.reflect.NativeMethodAccessorImpl.invoke(NativeMethodAccessorImpl.java:62)
(12 more lines...)
Collapse Failed NewGroovyTestCaseWizardTests testCreateGroovyTestCase_SetUpAndTearDown History
Default Job 1 sec
java.lang.IllegalArgumentException: null
	at org.eclipse.jdt.core.dom.ASTParser.<init>(ASTParser.java:234)
	at org.eclipse.jdt.core.dom.ASTParser.newParser(ASTParser.java:131)
	at org.eclipse.jdt.ui.wizards.NewTypeWizardPage.constructCUContent(NewTypeWizardPage.java:2361)
	at org.eclipse.jdt.ui.wizards.NewTypeWizardPage.createType(NewTypeWizardPage.java:2144)
	at org.codehaus.groovy.eclipse.wizards.NewGroovyTestTypeWizardPage.createType(NewGroovyTestTypeWizardPage.java:165)
	at sun.reflect.NativeMethodAccessorImpl.invoke0(Native Method)
	at sun.reflect.NativeMethodAccessorImpl.invoke(NativeMethodAccessorImpl.java:62)
(12 more lines...)
Collapse Failed NewGroovyTypeWizardTests testCreateGroovyClass4 History
Default Job 1 sec
java.lang.IllegalArgumentException: null
	at org.eclipse.jdt.core.dom.ASTParser.<init>(ASTParser.java:234)
	at org.eclipse.jdt.core.dom.ASTParser.newParser(ASTParser.java:131)
	at org.eclipse.jdt.ui.wizards.NewTypeWizardPage.constructCUContent(NewTypeWizardPage.java:2361)
	at org.eclipse.jdt.ui.wizards.NewTypeWizardPage.createType(NewTypeWizardPage.java:2144)
	at org.codehaus.groovy.eclipse.wizards.NewClassWizardPage.createType(NewClassWizardPage.java:137)
	at org.codehaus.groovy.eclipse.wizards.NewClassWizardPage$createType.call(Unknown Source)
	at org.codehaus.groovy.runtime.callsite.CallSiteArray.defaultCall(CallSiteArray.java:48)
(3 more lines...)
Collapse Failed NewGroovyTypeWizardTests testCreateGroovyClass1 History
Default Job 1 sec
java.lang.IllegalArgumentException: null
	at org.eclipse.jdt.core.dom.ASTParser.<init>(ASTParser.java:234)
	at org.eclipse.jdt.core.dom.ASTParser.newParser(ASTParser.java:131)
	at org.eclipse.jdt.ui.wizards.NewTypeWizardPage.constructCUContent(NewTypeWizardPage.java:2361)
	at org.eclipse.jdt.ui.wizards.NewTypeWizardPage.createType(NewTypeWizardPage.java:2144)
	at org.codehaus.groovy.eclipse.wizards.NewClassWizardPage.createType(NewClassWizardPage.java:137)
	at org.codehaus.groovy.eclipse.wizards.NewClassWizardPage$createType.call(Unknown Source)
	at org.codehaus.groovy.runtime.callsite.CallSiteArray.defaultCall(CallSiteArray.java:48)
(3 more lines...)
Collapse Failed NewGroovyTypeWizardTests testCreateGroovyClass2 History
Default Job 1 sec
java.lang.IllegalArgumentException: null
	at org.eclipse.jdt.core.dom.ASTParser.<init>(ASTParser.java:234)
	at org.eclipse.jdt.core.dom.ASTParser.newParser(ASTParser.java:131)
	at org.eclipse.jdt.internal.corext.refactoring.TypeContextChecker.parseSuperType(TypeContextChecker.java:744)
	at org.eclipse.jdt.internal.corext.refactoring.TypeContextChecker.parseSuperClass(TypeContextChecker.java:724)
	at org.eclipse.jdt.ui.wizards.NewTypeWizardPage.superClassChanged(NewTypeWizardPage.java:1855)
	at org.eclipse.jdt.ui.wizards.NewTypeWizardPage.typePageDialogFieldChanged(NewTypeWizardPage.java:1154)
	at org.eclipse.jdt.ui.wizards.NewTypeWizardPage.access$2(NewTypeWizardPage.java:1118)
(9 more lines...)
Collapse Failed NewGroovyTypeWizardTests testCreateGroovyClass3 History
Default Job < 1 sec
java.lang.IllegalArgumentException: null
	at org.eclipse.jdt.core.dom.ASTParser.<init>(ASTParser.java:234)
	at org.eclipse.jdt.core.dom.ASTParser.newParser(ASTParser.java:131)
	at org.eclipse.jdt.internal.corext.refactoring.TypeContextChecker.parseSuperType(TypeContextChecker.java:744)
	at org.eclipse.jdt.internal.corext.refactoring.TypeContextChecker.parseSuperClass(TypeContextChecker.java:724)
	at org.eclipse.jdt.ui.wizards.NewTypeWizardPage.superClassChanged(NewTypeWizardPage.java:1855)
	at org.eclipse.jdt.ui.wizards.NewTypeWizardPage.typePageDialogFieldChanged(NewTypeWizardPage.java:1154)
	at org.eclipse.jdt.ui.wizards.NewTypeWizardPage.access$2(NewTypeWizardPage.java:1118)
(9 more lines...)
Fixed tests 9
Status Test Failing since View job Duration
Successful SyntheticAccessorRenamingTests testIsserOnly History
Failing since build #506 (Changes by Eric Milles) Default Job 2 secs
Successful SyntheticAccessorRenamingTests testJavaRename2 History
Failing since build #506 (Changes by Eric Milles) Default Job 1 sec
Successful SyntheticAccessorRenamingTests testJavaRename1 History
Failing since build #506 (Changes by Eric Milles) Default Job 1 sec
Successful SyntheticAccessorRenamingTests testMultiFileRename1 History
Failing since build #506 (Changes by Eric Milles) Default Job 1 sec
Successful SyntheticAccessorRenamingTests testMultiFileRename2 History
Failing since build #506 (Changes by Eric Milles) Default Job 1 sec
Successful SyntheticAccessorRenamingTests testSetterOnly History
Failing since build #506 (Changes by Eric Milles) Default Job 9 secs
Successful SyntheticAccessorRenamingTests testGetterOnly History
Failing since build #506 (Changes by Eric Milles) Default Job 2 secs
Successful SyntheticAccessorRenamingTests testSingleFileRename1 History
Failing since build #506 (Changes by Eric Milles) Default Job 1 sec
Successful SyntheticAccessorRenamingTests testSingleFileRename2 History
Failing since build #506 (Changes by Eric Milles) Default Job 1 sec
Skipped tests 100
Status Test Failing since View job
Skipped GroovyLikeCompletionTests testNamedArguments2 History
Default Job
Skipped GroovyLikeCompletionTests testNamedArguments1 History
Default Job
Skipped GroovyLikeCompletionTests testGString1 History
Default Job
Skipped RelevanceTests testNewMethodThenModifier History
Default Job
Skipped MoveCURefactoringTests testInnerMove2 History
Default Job
Skipped MoveCURefactoringTests testInnerMove1 History
Default Job
Skipped MoveCURefactoringTests testInnerMove3 History
Default Job
Skipped MoveCURefactoringTests testInnerMove4 History
Default Job
Skipped RenameMethodTests testDelegate1 History
Default Job
Skipped RenameMethodTests testDelegate2 History
Default Job
Skipped OrganizeImportsTests testDynamicVariable1 History
Default Job
Skipped OrganizeImportsTests testOrganizeWithInterleavedComments History
Default Job
Skipped ExpressionFinderTests testNoExpression1 History
Default Job
Skipped ExpressionFinderTests testComplex4 History
Default Job
Skipped FindOccurrencesTests testDefaultParameters2 History
Default Job
Skipped FindOccurrencesTests testFindPrimitive History
Default Job
Skipped FindOccurrencesTests testDefaultParameters1a History
Default Job
Skipped SemanticHighlightingTests testAnnoElems2 History
Default Job
Skipped SemanticHighlightingTests testTailCallMethods History
Default Job
Skipped BasicGroovyBuildTests testUpdateWkspPreferences History
Default Job
Skipped BasicGroovyBuildTests testBuildClash History
Default Job
Skipped BasicGroovyBuildTests testCompileStatic_1505 History
Default Job
Skipped BasicGroovyBuildTests testCompileStatic_1506 History
Default Job
Skipped BasicGroovyBuildTests testUpdateProjectPreferences History
Default Job
Skipped BasicGroovyBuildTests testScriptSupport History
Default Job
Skipped ASTNodeSourceLocationsTests testMapExpression4 History
Default Job
Skipped GroovyCompilationUnitTests testAnonymousInner1 History
Default Job
Skipped GroovyCompilationUnitTests testAnonymousInner3 History
Default Job
Skipped GroovyCompilationUnitTests testAnonymousInner6 History
Default Job
Skipped GroovyCompilationUnitTests testAnonymousInner4 History
Default Job
Skipped GroovyCompilationUnitTests testAnonymousInner5 History
Default Job
Skipped GroovyCompilationUnitTests testAnonymousInner2 History
Default Job
Skipped GroovyPartialModelTests testFieldInitializerIsNotMoved2 History
Default Job
Skipped GroovyPartialModelTests testFieldInitializerIsNotMoved1 History
Default Job
Skipped DGMInferencingTests testDGM10 History
Default Job
Skipped GenericInferencingTests testJira1718 History
Default Job
Skipped GenericInferencingTests testStaticMethod8 History
Default Job
Skipped AnnotationsTests testWildcards10[0] History
Default Job
Skipped AnnotationsTests testWildcards10[2] History
Default Job
Skipped AnnotationsTests testWildcards10[3] History
Default Job
Skipped AnnotationsTests testWildcards10[1] History
Default Job
Skipped ErrorRecoveryTests testParsingNewRecoveryImports5_GRE538[0] History
Default Job
Skipped ErrorRecoveryTests testParsingMissingCurlyRecovery2_GRE468[0] History
Default Job
Skipped ErrorRecoveryTests testParsingNewRecoveryImports3_GRE538[3] History
Default Job
Skipped ErrorRecoveryTests testParsingNewRecoveryImports1_GRE538[1] History
Default Job
Skipped ErrorRecoveryTests testParsingNewRecoveryImports2_GRE538[3] History
Default Job
Skipped ErrorRecoveryTests testUnrecoverableErrors_GRE949[3] History
Default Job
Skipped ErrorRecoveryTests testParsingNewRecoveryImports1_GRE538[0] History
Default Job
Skipped ErrorRecoveryTests testParsingNewRecoveryImports2_GRE538[2] History
Default Job
Skipped ErrorRecoveryTests testParsingNewRecoveryImports1_GRE538[3] History
Default Job
Skipped ErrorRecoveryTests testUnrecoverableErrors_GRE949[1] History
Default Job
Skipped ErrorRecoveryTests testParsingNewRecoveryImports1_GRE538[2] History
Default Job
Skipped ErrorRecoveryTests testUnrecoverableErrors_GRE949[2] History
Default Job
Skipped ErrorRecoveryTests testParsingNewRecoveryImports4_GRE538[3] History
Default Job
Skipped ErrorRecoveryTests testParsingNewRecoveryImports5_GRE538[3] History
Default Job
Skipped ErrorRecoveryTests testUnrecoverableErrors_GRE949[0] History
Default Job
Skipped ErrorRecoveryTests testParsingNewRecoveryImports4_GRE538[2] History
Default Job
Skipped ErrorRecoveryTests testParsingNewRecoveryImports4_GRE538[1] History
Default Job
Skipped ErrorRecoveryTests testParsingMissingCurlyRecovery1_GRE468[1] History
Default Job
Skipped ErrorRecoveryTests testParsingMissingCurlyRecovery1_GRE468[0] History
Default Job
Skipped ErrorRecoveryTests testParsingMissingCurlyRecovery1_GRE468[2] History
Default Job
Skipped ErrorRecoveryTests testParsingMissingCurlyRecovery1_GRE468[3] History
Default Job
Skipped ErrorRecoveryTests testParsingNewRecoveryImports4_GRE538[0] History
Default Job
Skipped ErrorRecoveryTests testParsingNewRecoveryImports5_GRE538[1] History
Default Job
Skipped ErrorRecoveryTests testParsingNewRecoveryImports3_GRE538[0] History
Default Job
Skipped ErrorRecoveryTests testParsingMissingCurlyRecovery2_GRE468[3] History
Default Job
Skipped ErrorRecoveryTests testParsingNewRecoveryImports5_GRE538[2] History
Default Job
Skipped ErrorRecoveryTests testParsingNewRecoveryImports2_GRE538[0] History
Default Job
Skipped ErrorRecoveryTests testParsingNewRecoveryImports3_GRE538[1] History
Default Job
Skipped ErrorRecoveryTests testParsingMissingCurlyRecovery2_GRE468[2] History
Default Job
Skipped ErrorRecoveryTests testParsingMissingCurlyRecovery2_GRE468[1] History
Default Job
Skipped ErrorRecoveryTests testParsingNewRecoveryImports3_GRE538[2] History
Default Job
Skipped ErrorRecoveryTests testParsingNewRecoveryImports2_GRE538[1] History
Default Job
Skipped GenericsTests testGenericsPositions_6_GRE267[3] History
Default Job
Skipped GenericsTests testDisablingGenericsWarnings[3] History
Default Job
Skipped GenericsTests testExtendingGenerics_GroovyExtendsJava5a[3] History
Default Job
Skipped GenericsTests testDisablingGenericsWarnings[0] History
Default Job
Skipped GenericsTests testExtendingGenerics_GroovyExtendsJava4[3] History
Default Job
Skipped GenericsTests testJava7[0] History
Default Job
Skipped GenericsTests testDisablingGenericsWarnings[1] History
Default Job
Skipped GenericsTests testJava7_2[2] History
Default Job
Skipped GenericsTests testJava7[1] History
Default Job
Skipped GenericsTests testDisablingGenericsWarnings[2] History
Default Job
Skipped GenericsTests testGenericsPositions_6_GRE267[0] History
Default Job
Skipped GenericsTests testGenericsPositions_6_GRE267[1] History
Default Job
Skipped GenericsTests testGenericsPositions_6_GRE267[2] History
Default Job
Skipped GenericsTests testJava7_2[3] History
Default Job
Skipped GenericsTests testJava7_3[3] History
Default Job
Skipped GenericsTests testExtendingGenerics_GroovyExtendsJava5[3] History
Default Job
Skipped GenericsTests testJava7_3[2] History
Default Job
Skipped GroovySimpleTests testClash_GRE1076[0] History
Default Job
Skipped GroovySimpleTests testSts3930[3] History
Default Job
Skipped GroovySimpleTests testSts3930[2] History
Default Job
Skipped GroovySimpleTests testClash_GRE1076_2[2] History
Default Job
Skipped GroovySimpleTests testClash_GRE1076_2[3] History
Default Job
Skipped GroovySimpleTests testInfiniteLoop[0] History
Default Job
Skipped GroovySimpleTests testClash_GRE1076_2[1] History
Default Job
Skipped GroovySimpleTests testInfiniteLoop[1] History
Default Job
Skipped GroovySimpleTests testSts3930[1] History
Default Job
Skipped GroovySimpleTests testClash_GRE1076[2] History
Default Job