Build and test Groovy-Eclipse on Eclipse 4.7 (Oxygen)

Build: #510 failed Changes by Eric Milles

Build result summary

Details

Completed
Duration
3 minutes
Labels
None
Agent
bamboo-06.af.pivotal.io
Revision
2c337798d113cd79e19986ef1d98177ee3f502e8 2c337798d113cd79e19986ef1d98177ee3f502e8
Fixed in
#513 (Changes by Eric Milles)

No failed tests found, a possible compilation error occurred.

Responsible

No one has taken responsibility for this failure

Code commits

Author Commit Message Commit date
Eric Milles Eric Milles 2c337798d113cd79e19986ef1d98177ee3f502e8 2c337798d113cd79e19986ef1d98177ee3f502e8 Revert to Maven Central available compiler plugins

Error summary for Default Job

The job generated some errors, drill down into the full build log for more details.

Could not find test result reports in the /opt/bamboo-home/xml-data/build-dir/GRECLIPSE-GE47-JOB1 directory.
        at java.lang.Thread.run(Thread.java:748)
exception handling
org.codehaus.groovy.control.MultipleCompilationErrorsException: startup failed:

        at org.codehaus.groovy.control.ErrorCollector.failIfErrors(ErrorCollector.java:313)
        at org.codehaus.groovy.control.CompilationUnit.applyToSourceUnits(CompilationUnit.java:1027)
        at org.codehaus.groovy.control.CompilationUnit.compile(CompilationUnit.java:592)
        at org.codehaus.jdt.groovy.internal.compiler.ast.GroovyCompilationUnitDeclaration.processToPhase(GroovyCompilationUnitDeclaration.java:184)
        at org.codehaus.jdt.groovy.internal.compiler.ast.GroovyCompilationUnitDeclaration.resolve(GroovyCompilationUnitDeclaration.java:2098)
        at org.eclipse.jdt.internal.compiler.Compiler.process(Compiler.java:827)
        at org.eclipse.jdt.internal.compiler.ProcessTaskManager.run(ProcessTaskManager.java:137)
        at java.lang.Thread.run(Thread.java:748)
exception handling
org.codehaus.groovy.control.MultipleCompilationErrorsException: startup failed:

        at org.codehaus.groovy.control.ErrorCollector.failIfErrors(ErrorCollector.java:313)
        at org.codehaus.groovy.control.CompilationUnit.applyToSourceUnits(CompilationUnit.java:1027)
        at org.codehaus.groovy.control.CompilationUnit.compile(CompilationUnit.java:592)
        at org.codehaus.jdt.groovy.internal.compiler.ast.GroovyCompilationUnitDeclaration.processToPhase(GroovyCompilationUnitDeclaration.java:184)
        at org.codehaus.jdt.groovy.internal.compiler.ast.GroovyCompilationUnitDeclaration.analyseCode(GroovyCompilationUnitDeclaration.java:2181)
        at org.eclipse.jdt.internal.compiler.Compiler.process(Compiler.java:833)
        at org.eclipse.jdt.internal.compiler.ProcessTaskManager.run(ProcessTaskManager.java:137)
        at java.lang.Thread.run(Thread.java:748)
exception handling
org.codehaus.groovy.control.MultipleCompilationErrorsException: startup failed:

        at org.codehaus.groovy.control.ErrorCollector.failIfErrors(ErrorCollector.java:313)
        at org.codehaus.groovy.control.CompilationUnit.applyToSourceUnits(CompilationUnit.java:1027)
        at org.codehaus.groovy.control.CompilationUnit.compile(CompilationUnit.java:592)
        at org.codehaus.jdt.groovy.internal.compiler.ast.GroovyCompilationUnitDeclaration.processToPhase(GroovyCompilationUnitDeclaration.java:184)
        at org.codehaus.jdt.groovy.internal.compiler.ast.GroovyCompilationUnitDeclaration.generateCode(GroovyCompilationUnitDeclaration.java:1632)
        at org.eclipse.jdt.internal.compiler.Compiler.process(Compiler.java:838)
        at org.eclipse.jdt.internal.compiler.ProcessTaskManager.run(ProcessTaskManager.java:137)
        at java.lang.Thread.run(Thread.java:748)
exception handling
org.codehaus.groovy.control.MultipleCompilationErrorsException: startup failed:

        at org.codehaus.groovy.control.ErrorCollector.failIfErrors(ErrorCollector.java:313)
        at org.codehaus.groovy.control.CompilationUnit.applyToSourceUnits(CompilationUnit.java:1027)
        at org.codehaus.groovy.control.CompilationUnit.compile(CompilationUnit.java:592)
        at org.codehaus.jdt.groovy.internal.compiler.ast.GroovyCompilationUnitDeclaration.processToPhase(GroovyCompilationUnitDeclaration.java:184)
        at org.codehaus.jdt.groovy.internal.compiler.ast.GroovyCompilationUnitDeclaration.resolve(GroovyCompilationUnitDeclaration.java:2098)
        at org.eclipse.jdt.internal.compiler.Compiler.process(Compiler.java:827)
        at org.eclipse.jdt.internal.compiler.ProcessTaskManager.run(ProcessTaskManager.java:137)
        at java.lang.Thread.run(Thread.java:748)
exception handling
org.codehaus.groovy.control.MultipleCompilationErrorsException: startup failed:

        at org.codehaus.groovy.control.ErrorCollector.failIfErrors(ErrorCollector.java:313)
        at org.codehaus.groovy.control.CompilationUnit.applyToSourceUnits(CompilationUnit.java:1027)
        at org.codehaus.groovy.control.CompilationUnit.compile(CompilationUnit.java:592)
        at org.codehaus.jdt.groovy.internal.compiler.ast.GroovyCompilationUnitDeclaration.processToPhase(GroovyCompilationUnitDeclaration.java:184)
        at org.codehaus.jdt.groovy.internal.compiler.ast.GroovyCompilationUnitDeclaration.analyseCode(GroovyCompilationUnitDeclaration.java:2181)
        at org.eclipse.jdt.internal.compiler.Compiler.process(Compiler.java:833)
        at org.eclipse.jdt.internal.compiler.ProcessTaskManager.run(ProcessTaskManager.java:137)
        at java.lang.Thread.run(Thread.java:748)
exception handling
org.codehaus.groovy.control.MultipleCompilationErrorsException: startup failed:

        at org.codehaus.groovy.control.ErrorCollector.failIfErrors(ErrorCollector.java:313)
        at org.codehaus.groovy.control.CompilationUnit.applyToSourceUnits(CompilationUnit.java:1027)
        at org.codehaus.groovy.control.CompilationUnit.compile(CompilationUnit.java:592)
        at org.codehaus.jdt.groovy.internal.compiler.ast.GroovyCompilationUnitDeclaration.processToPhase(GroovyCompilationUnitDeclaration.java:184)
        at org.codehaus.jdt.groovy.internal.compiler.ast.GroovyCompilationUnitDeclaration.generateCode(GroovyCompilationUnitDeclaration.java:1632)
        at org.eclipse.jdt.internal.compiler.Compiler.process(Compiler.java:838)
        at org.eclipse.jdt.internal.compiler.ProcessTaskManager.run(ProcessTaskManager.java:137)
        at java.lang.Thread.run(Thread.java:748)
exception handling
org.codehaus.groovy.control.MultipleCompilationErrorsException: startup failed:

        at org.codehaus.groovy.control.ErrorCollector.failIfErrors(ErrorCollector.java:313)
        at org.codehaus.groovy.control.CompilationUnit.applyToSourceUnits(CompilationUnit.java:1027)
        at org.codehaus.groovy.control.CompilationUnit.compile(CompilationUnit.java:592)
        at org.codehaus.jdt.groovy.internal.compiler.ast.GroovyCompilationUnitDeclaration.processToPhase(GroovyCompilationUnitDeclaration.java:184)
        at org.codehaus.jdt.groovy.internal.compiler.ast.GroovyCompilationUnitDeclaration.resolve(GroovyCompilationUnitDeclaration.java:2098)
        at org.eclipse.jdt.internal.compiler.Compiler.process(Compiler.java:827)
        at org.eclipse.jdt.internal.compiler.ProcessTaskManager.run(ProcessTaskManager.java:137)
        at java.lang.Thread.run(Thread.java:748)
exception handling
org.codehaus.groovy.control.MultipleCompilationErrorsException: startup failed:

        at org.codehaus.groovy.control.ErrorCollector.failIfErrors(ErrorCollector.java:313)
        at org.codehaus.groovy.control.CompilationUnit.applyToSourceUnits(CompilationUnit.java:1027)
        at org.codehaus.groovy.control.CompilationUnit.compile(CompilationUnit.java:592)
        at org.codehaus.jdt.groovy.internal.compiler.ast.GroovyCompilationUnitDeclaration.processToPhase(GroovyCompilationUnitDeclaration.java:184)
        at org.codehaus.jdt.groovy.internal.compiler.ast.GroovyCompilationUnitDeclaration.analyseCode(GroovyCompilationUnitDeclaration.java:2181)
        at org.eclipse.jdt.internal.compiler.Compiler.process(Compiler.java:833)
        at org.eclipse.jdt.internal.compiler.ProcessTaskManager.run(ProcessTaskManager.java:137)
        at java.lang.Thread.run(Thread.java:748)
exception handling
org.codehaus.groovy.control.MultipleCompilationErrorsException: startup failed:

        at org.codehaus.groovy.control.ErrorCollector.failIfErrors(ErrorCollector.java:313)
        at org.codehaus.groovy.control.CompilationUnit.applyToSourceUnits(CompilationUnit.java:1027)
        at org.codehaus.groovy.control.CompilationUnit.compile(CompilationUnit.java:592)
        at org.codehaus.jdt.groovy.internal.compiler.ast.GroovyCompilationUnitDeclaration.processToPhase(GroovyCompilationUnitDeclaration.java:184)
        at org.codehaus.jdt.groovy.internal.compiler.ast.GroovyCompilationUnitDeclaration.generateCode(GroovyCompilationUnitDeclaration.java:1632)
        at org.eclipse.jdt.internal.compiler.Compiler.process(Compiler.java:838)
        at org.eclipse.jdt.internal.compiler.ProcessTaskManager.run(ProcessTaskManager.java:137)
        at java.lang.Thread.run(Thread.java:748)