Build and test Groovy-Eclipse on Eclipse 4.7 (Oxygen)

Build: #512 failed Changes by Eric Milles

Logs

The following logs have been generated by the jobs in this plan.
  • Expand all
  • Collapse all
Job Logs
Collapse Default Job Default Stage Download or View
26-Jun-2018 01:25:27 [INFO] ------------------------------------------------------------------------
26-Jun-2018 01:25:27 [INFO] BUILD FAILURE
26-Jun-2018 01:25:27 [INFO] ------------------------------------------------------------------------
26-Jun-2018 01:25:27 [INFO] Total time: 04:28 min
26-Jun-2018 01:25:27 [INFO] Finished at: 2018-06-26T01:25:27+00:00
26-Jun-2018 01:25:27 [INFO] Final Memory: 164M/688M
26-Jun-2018 01:25:27 [INFO] ------------------------------------------------------------------------
26-Jun-2018 01:25:27 [ERROR] Failed to execute goal org.eclipse.tycho:tycho-compiler-plugin:0.24.0:compile (default-compile) on project org.codehaus.groovy.eclipse.dsl.tests: Compilation failure: Compilation failure:
26-Jun-2018 01:25:27 [ERROR] /opt/bamboo-home/xml-data/build-dir/GRECLIPSE-GE47-JOB1/ide-test/org.codehaus.groovy.eclipse.dsl.tests/src/org/codehaus/groovy/eclipse/dsl/tests/MetaDSLInferencingTests.groovy:[64,1] 1. ERROR in /opt/bamboo-home/xml-data/build-dir/GRECLIPSE-GE47-JOB1/ide-test/org.codehaus.groovy.eclipse.dsl.tests/src/org/codehaus/groovy/eclipse/dsl/tests/MetaDSLInferencingTests.groovy (at line 64)
26-Jun-2018 01:25:27 [ERROR] @Test
26-Jun-2018 01:25:27 [ERROR] ^
26-Jun-2018 01:25:27 [ERROR] Groovy:The return type of VisitStatus acceptASTNode(org.codehaus.groovy.ast.ASTNode, org.eclipse.jdt.groovy.search.TypeLookupResult, org.eclipse.jdt.core.IJavaElement) in org.codehaus.groovy.eclipse.dsl.tests.PointcutEvaluationTests$PointcutEvaluationRequestor is incompatible with org.eclipse.jdt.groovy.search.ITypeRequestor$VisitStatus acceptASTNode(org.codehaus.groovy.ast.ASTNode, org.eclipse.jdt.groovy.search.TypeLookupResult, org.eclipse.jdt.core.IJavaElement) in org.eclipse.jdt.groovy.search.ITypeRequestor
26-Jun-2018 01:25:27 [ERROR]
26-Jun-2018 01:25:27 [ERROR] Found 1 error and 0 warnings.
26-Jun-2018 01:25:27 [ERROR] -> [Help 1]
26-Jun-2018 01:25:27 [ERROR]
26-Jun-2018 01:25:27 [ERROR] To see the full stack trace of the errors, re-run Maven with the -e switch.
26-Jun-2018 01:25:27 [ERROR] Re-run Maven using the -X switch to enable full debug logging.
26-Jun-2018 01:25:27 [ERROR]
26-Jun-2018 01:25:27 [ERROR] For more information about the errors and possible solutions, please read the following articles:
26-Jun-2018 01:25:27 [ERROR] [Help 1] http://cwiki.apache.org/confluence/display/MAVEN/MojoFailureException
26-Jun-2018 01:25:27 [ERROR]
26-Jun-2018 01:25:27 [ERROR] After correcting the problems, you can resume the build with the command
26-Jun-2018 01:25:27 [ERROR]   mvn <goals> -rf :org.codehaus.groovy.eclipse.dsl.tests
26-Jun-2018 01:25:31 Unable to publish artifact [Zipped Update Site]: the source directory /opt/bamboo-home/xml-data/build-dir/GRECLIPSE-GE47-JOB1/Site-org.codehaus.groovy.eclipse/target/site does not exist.