Build and test Groovy-Eclipse on Eclipse 4.7 (Oxygen)

Build: #506 failed

Job: Default Job failed

Stages & jobs

  1. Default Stage

Job result summary

Completed
Duration
92 minutes
Agent
bamboo-00.af.pivotal.io
Revision
963d06b94da5f0e08daac857ac4981b8e908dffb 963d06b94da5f0e08daac857ac4981b8e908dffb
Total tests
5557
Failing since
#505 (Code changes detected – )
Fixed in
#508 (Code changes detected)

Tests

  • 5,557 tests in total
  • 9 tests failed
  • 9 failures are new
  • 1 test was fixed
  • 195 tests were quarantined / skipped
  • 85 minutes taken in total.
New test failures 9
Status Test Duration
Collapse Failed SyntheticAccessorRenamingTests testGetterOnly History
2 secs
org.eclipse.core.runtime.AssertionFailedException: assertion failed: Search for method declaration did not find original element: java.lang.Object getFoo() [in First [in First.groovy [in p [in src [in TestProject]]]]]
	at org.eclipse.core.runtime.Assert.isTrue(Assert.java:110)
	at org.eclipse.jdt.internal.corext.refactoring.rename.RippleMethodFinder2.findAllRippleMethods(RippleMethodFinder2.java:192)
	at org.eclipse.jdt.internal.corext.refactoring.rename.RippleMethodFinder2.getAllRippleMethods(RippleMethodFinder2.java:168)
	at org.eclipse.jdt.internal.corext.refactoring.rename.RippleMethodFinder2.getRelatedMethods(RippleMethodFinder2.java:161)
	at org.eclipse.jdt.internal.corext.refactoring.rename.RenameMethodProcessor.initializeMethodsToRename(RenameMethodProcessor.java:248)
	at org.eclipse.jdt.internal.corext.refactoring.rename.RenameMethodProcessor.doCheckFinalConditions(RenameMethodProcessor.java:386)
	at org.eclipse.jdt.internal.corext.refactoring.rename.RenameVirtualMethodProcessor.doCheckFinalConditions(RenameVirtualMethodProcessor.java:146)
(25 more lines...)
Collapse Failed SyntheticAccessorRenamingTests testIsserOnly History
1 sec
org.eclipse.core.runtime.AssertionFailedException: assertion failed: Search for method declaration did not find original element: java.lang.Object isFoo() [in First [in First.groovy [in p [in src [in TestProject]]]]]
	at org.eclipse.core.runtime.Assert.isTrue(Assert.java:110)
	at org.eclipse.jdt.internal.corext.refactoring.rename.RippleMethodFinder2.findAllRippleMethods(RippleMethodFinder2.java:192)
	at org.eclipse.jdt.internal.corext.refactoring.rename.RippleMethodFinder2.getAllRippleMethods(RippleMethodFinder2.java:168)
	at org.eclipse.jdt.internal.corext.refactoring.rename.RippleMethodFinder2.getRelatedMethods(RippleMethodFinder2.java:161)
	at org.eclipse.jdt.internal.corext.refactoring.rename.RenameMethodProcessor.initializeMethodsToRename(RenameMethodProcessor.java:248)
	at org.eclipse.jdt.internal.corext.refactoring.rename.RenameMethodProcessor.doCheckFinalConditions(RenameMethodProcessor.java:386)
	at org.eclipse.jdt.internal.corext.refactoring.rename.RenameVirtualMethodProcessor.doCheckFinalConditions(RenameVirtualMethodProcessor.java:146)
(25 more lines...)
Collapse Failed SyntheticAccessorRenamingTests testJavaRename1 History
1 sec
java.lang.AssertionError: Refactoring produced unexpected results:
-----EXPECTING-----
package q;
class Java {
  void l() {
    p.First f = new p.First();
    f.flar = null;
    f.getFlar();
(33 more lines...)
Collapse Failed SyntheticAccessorRenamingTests testJavaRename2 History
1 sec
java.lang.AssertionError: Refactoring produced unexpected results:
-----EXPECTING-----
package q;
class Java {
  void l() {
    p.First f = new p.First();
    f.flar = null;
    f.getFoo();
(28 more lines...)
Collapse Failed SyntheticAccessorRenamingTests testMultiFileRename1 History
1 sec
java.lang.AssertionError: Refactoring produced unexpected results:
-----EXPECTING-----
package q
def f = new p.First()
f.flar
f.getFlar()
f.setFlar()
f.isFlar()
(20 more lines...)
Collapse Failed SyntheticAccessorRenamingTests testMultiFileRename2 History
1 sec
java.lang.AssertionError: Refactoring produced unexpected results:
-----EXPECTING-----
package q
def f = new p.First()
f.flar
f.getFoo()
f.setFoo()
f.isFoo()
(20 more lines...)
Collapse Failed SyntheticAccessorRenamingTests testSetterOnly History
9 secs
org.eclipse.core.runtime.AssertionFailedException: assertion failed: Search for method declaration did not find original element: java.lang.Object setFoo() [in First [in First.groovy [in p [in src [in TestProject]]]]]
	at org.eclipse.core.runtime.Assert.isTrue(Assert.java:110)
	at org.eclipse.jdt.internal.corext.refactoring.rename.RippleMethodFinder2.findAllRippleMethods(RippleMethodFinder2.java:192)
	at org.eclipse.jdt.internal.corext.refactoring.rename.RippleMethodFinder2.getAllRippleMethods(RippleMethodFinder2.java:168)
	at org.eclipse.jdt.internal.corext.refactoring.rename.RippleMethodFinder2.getRelatedMethods(RippleMethodFinder2.java:161)
	at org.eclipse.jdt.internal.corext.refactoring.rename.RenameMethodProcessor.initializeMethodsToRename(RenameMethodProcessor.java:248)
	at org.eclipse.jdt.internal.corext.refactoring.rename.RenameMethodProcessor.doCheckFinalConditions(RenameMethodProcessor.java:386)
	at org.eclipse.jdt.internal.corext.refactoring.rename.RenameVirtualMethodProcessor.doCheckFinalConditions(RenameVirtualMethodProcessor.java:146)
(31 more lines...)
Collapse Failed SyntheticAccessorRenamingTests testSingleFileRename1 History
1 sec
java.lang.AssertionError: Refactoring produced unexpected results:
-----EXPECTING-----
package p
class First {
  boolean flar
  def run() {
    flar
    getFlar()
(28 more lines...)
Collapse Failed SyntheticAccessorRenamingTests testSingleFileRename2 History
1 sec
java.lang.AssertionError: Refactoring produced unexpected results:
-----EXPECTING-----
package p
class First {
  def flar
  def getFoo() { }
  def setFoo() { }
  def isFoo() { }
(34 more lines...)
Fixed tests 1
Status Test Failing since Duration
Successful BinarySearchTests testMethodRefInInitializer History
Failing since build #505 (Code changes detected) 1 sec

Error summary

The build generated some errors. See the full build log for more details.

Java HotSpot(TM) 64-Bit Server VM warning: ignoring option MaxPermSize=256M; support was removed in 8.0
*** BUG ***
In pixman_region32_init_rect: Invalid rectangle passed
Set a breakpoint on '_pixman_log_error' to debug

*** BUG ***
In pixman_region32_init_rect: Invalid rectangle passed
Set a breakpoint on '_pixman_log_error' to debug

*** BUG ***
In pixman_region32_init_rect: Invalid rectangle passed
Set a breakpoint on '_pixman_log_error' to debug

*** BUG ***
In pixman_region32_init_rect: Invalid rectangle passed
Set a breakpoint on '_pixman_log_error' to debug

*** BUG ***
In pixman_region32_init_rect: Invalid rectangle passed
Set a breakpoint on '_pixman_log_error' to debug

CodeSelectRequestor: Could not proceed due to null declaring type for org.codehaus.groovy.ast.expr.BinaryExpression@1dafe14[org.codehaus.groovy.ast.expr.VariableExpression@41ae8dbb[variable: it]("in" at 1:20:  "in" )org.codehaus.groovy.ast.expr.ListExpression@6121f2cd[]]
CodeSelectRequestor: Could not proceed due to null declaring type for org.codehaus.groovy.ast.expr.RangeExpression@43a2fc9f
CodeSelectRequestor: Could not proceed due to null declaring type for org.codehaus.groovy.ast.expr.RangeExpression@3245160e
TypeInferencingVisitorWithRequestor.findMethodNode: no match found for Type.x(QList<Qjava.util.Date;>;)
TypeInferencingVisitorWithRequestor.findMethodNode: no match found for Type.x(QList<Qjava.lang.Number;>;)
TypeInferencingVisitorWithRequestor.findMethodNode: no match found for Type.x(QList<Qjava.lang.Number;>;)
TypeInferencingVisitorWithRequestor.findMethodNode: no match found for Type.x(QList<Qjava.util.Date;>;)
TypeInferencingVisitorWithRequestor.findMethodNode: no match found for Type.x(QList<Qjava.lang.Number;>;)
CodeSelectRequestor: Could not proceed due to null declaring type for ConstantExpression[fff]
CodeSelectRequestor: Could not proceed due to null declaring type for ConstantExpression[fff]
CodeSelectRequestor: Could not proceed due to null declaring type for ConstantExpression[fff]
augment: type Foo having GroovyObject methods added

augment: type Foo having GroovyObject methods added

augment: type Foo having GroovyObject methods added

augment: type Foo having GroovyObject methods added

augment: type Foo having GroovyObject methods added

augment: type Foo having GroovyObject methods added

augment: type Foo having GroovyObject methods added

augment: type Foo having GroovyObject methods added

Waiting for: Java indexing... 13 files to index (/Project)
Waiting for: Java indexing... 13 files to index (/Project)
Waiting for: Java indexing... 13 files to index (/Project)
Waiting for: Java indexing... 13 files to index (/Project)
Waiting for: Java indexing... 13 files to index (/Project)
Waiting for: Java indexing... 13 files to index (/Project)
Waiting for: Java indexing... 13 files to index (/Project)
Waiting for: Java indexing... 7 files to index (/Project)
Waiting for: Java indexing... 12 files to index (/Project)
Waiting for: Java indexing... 12 files to index (/Project)
Waiting for: Building workspace
Waiting for: Java indexing... 3 files to index (/Project)