Build and test Groovy-Eclipse on Eclipse 4.7 (Oxygen)

Build: #507 failed

Job: Default Job failed

Stages & jobs

  1. Default Stage

Job result summary

Completed
Duration
99 minutes
Agent
bamboo-06.af.pivotal.io
Revision
5d430a3e0795345ff8d7f93aec8a754356f111f1 5d430a3e0795345ff8d7f93aec8a754356f111f1
Total tests
5557
Failing since
#505 (Code changes detected – )
Fixed in
#508 (Code changes detected)

Tests

  • 5,557 tests in total
  • 40 tests failed
  • 40 failures are new
  • 9 tests were fixed
  • 195 tests were quarantined / skipped
  • 88 minutes taken in total.
New test failures 40
Status Test Duration
Collapse Failed DefaultGroovyMethodCompletionTests testDGMJavadoc History
2 secs
java.lang.IllegalArgumentException: null
	at org.eclipse.jdt.core.dom.ASTParser.<init>(ASTParser.java:234)
	at org.eclipse.jdt.core.dom.ASTParser.newParser(ASTParser.java:131)
	at org.eclipse.jdt.internal.ui.text.javadoc.JavadocContentAccess2.createAST(JavadocContentAccess2.java:746)
	at org.eclipse.jdt.internal.ui.text.javadoc.JavadocContentAccess2.getJavadocNode(JavadocContentAccess2.java:723)
	at org.eclipse.jdt.internal.ui.text.javadoc.JavadocContentAccess2.javadoc2HTML(JavadocContentAccess2.java:759)
	at org.eclipse.jdt.internal.ui.text.javadoc.JavadocContentAccess2.getHTMLContentFromSource(JavadocContentAccess2.java:671)
	at org.eclipse.jdt.internal.ui.text.javadoc.JavadocContentAccess2.getHTMLContent(JavadocContentAccess2.java:534)
(8 more lines...)
Collapse Failed TypeCompletionTests2 testTypeCompletionInScript6 History
2 secs
org.junit.ComparisonFailure: Completion proposal applied but different results found. expected:<...onUI /*tag*/ //note
[  // some single-line comment
import javax.swing.text.html.HTML]

HTML
ButtonUI> but was:<...onUI /*tag*/ //note
[import javax.swing.text.html.HTML
  // some single-line comment]
(22 more lines...)
Collapse Failed JUnit4TestFinderTests testFindTestWithExpectedException History
1 sec
java.lang.IllegalArgumentException: null
	at org.eclipse.jdt.core.dom.ASTParser.<init>(ASTParser.java:234)
	at org.eclipse.jdt.core.dom.ASTParser.newParser(ASTParser.java:131)
	at org.eclipse.jdt.internal.junit.launcher.JUnit4TestFinder.internalIsTest(JUnit4TestFinder.java:208)
	at org.eclipse.jdt.internal.junit.launcher.JUnit4TestFinder.isTest(JUnit4TestFinder.java:200)
	at org.eclipse.jdt.internal.junit.util.CoreTestSearchEngine.isTestOrTestSuite(CoreTestSearchEngine.java:57)
	at org.eclipse.jdt.internal.junit.JUnitPropertyTester.isJUnitTest(JUnitPropertyTester.java:117)
	at org.eclipse.jdt.internal.junit.JUnitPropertyTester.canLaunchAsJUnitTest(JUnitPropertyTester.java:85)
(6 more lines...)
Collapse Failed JUnit4TestFinderTests testFinderOfNonPublicSubclass History
9 secs
java.lang.IllegalArgumentException: null
	at org.eclipse.jdt.core.dom.ASTParser.<init>(ASTParser.java:234)
	at org.eclipse.jdt.core.dom.ASTParser.newParser(ASTParser.java:131)
	at org.eclipse.jdt.internal.junit.launcher.JUnit4TestFinder.internalIsTest(JUnit4TestFinder.java:208)
	at org.eclipse.jdt.internal.junit.launcher.JUnit4TestFinder.isTest(JUnit4TestFinder.java:200)
	at org.eclipse.jdt.internal.junit.launcher.ITestFinder$isTest.call(Unknown Source)
	at org.codehaus.groovy.runtime.callsite.CallSiteArray.defaultCall(CallSiteArray.java:48)
	at org.codehaus.groovy.runtime.callsite.AbstractCallSite.call(AbstractCallSite.java:113)
(3 more lines...)
Collapse Failed JUnit4TestFinderTests testFinderOfSubclass History
2 secs
java.lang.IllegalArgumentException: null
	at org.eclipse.jdt.core.dom.ASTParser.<init>(ASTParser.java:234)
	at org.eclipse.jdt.core.dom.ASTParser.newParser(ASTParser.java:131)
	at org.eclipse.jdt.internal.junit.launcher.JUnit4TestFinder.internalIsTest(JUnit4TestFinder.java:208)
	at org.eclipse.jdt.internal.junit.launcher.JUnit4TestFinder.isTest(JUnit4TestFinder.java:200)
	at org.eclipse.jdt.internal.junit.launcher.ITestFinder$isTest.call(Unknown Source)
	at org.codehaus.groovy.eclipse.junit.test.JUnit4TestFinderTests.assertTypeIsTest(JUnit4TestFinderTests.groovy:29)
	at org.codehaus.groovy.eclipse.junit.test.JUnit4TestFinderTests.assertTypeIsTest(JUnit4TestFinderTests.groovy)
(1 more lines...)
Collapse Failed JUnit4TestFinderTests testUsingRunWithAnnotation History
1 sec
java.lang.IllegalArgumentException: null
	at org.eclipse.jdt.core.dom.ASTParser.<init>(ASTParser.java:234)
	at org.eclipse.jdt.core.dom.ASTParser.newParser(ASTParser.java:131)
	at org.eclipse.jdt.internal.junit.launcher.JUnit4TestFinder.internalIsTest(JUnit4TestFinder.java:208)
	at org.eclipse.jdt.internal.junit.launcher.JUnit4TestFinder.isTest(JUnit4TestFinder.java:200)
	at org.eclipse.jdt.internal.junit.launcher.ITestFinder$isTest.call(Unknown Source)
	at org.codehaus.groovy.eclipse.junit.test.JUnit4TestFinderTests.assertTypeIsTest(JUnit4TestFinderTests.groovy:29)
	at org.codehaus.groovy.eclipse.junit.test.JUnit4TestFinderTests.assertTypeIsTest(JUnit4TestFinderTests.groovy)
(1 more lines...)
Collapse Failed JUnit4TestFinderTests testUsingTestAnnotation History
1 sec
java.lang.IllegalArgumentException: null
	at org.eclipse.jdt.core.dom.ASTParser.<init>(ASTParser.java:234)
	at org.eclipse.jdt.core.dom.ASTParser.newParser(ASTParser.java:131)
	at org.eclipse.jdt.internal.junit.launcher.JUnit4TestFinder.internalIsTest(JUnit4TestFinder.java:208)
	at org.eclipse.jdt.internal.junit.launcher.JUnit4TestFinder.isTest(JUnit4TestFinder.java:200)
	at org.eclipse.jdt.internal.junit.launcher.ITestFinder$isTest.call(Unknown Source)
	at org.codehaus.groovy.eclipse.junit.test.JUnit4TestFinderTests.assertTypeIsTest(JUnit4TestFinderTests.groovy:29)
	at org.codehaus.groovy.eclipse.junit.test.JUnit4TestFinderTests.assertTypeIsTest(JUnit4TestFinderTests.groovy)
(1 more lines...)
Collapse Failed RenameTypeTests test1 History
< 1 sec
java.lang.IllegalArgumentException: null
	at org.eclipse.jdt.core.dom.ASTParser.<init>(ASTParser.java:234)
	at org.eclipse.jdt.core.dom.ASTParser.newParser(ASTParser.java:131)
	at org.eclipse.jdt.internal.corext.refactoring.util.RefactoringASTParser.<init>(RefactoringASTParser.java:40)
	at org.eclipse.jdt.internal.corext.refactoring.rename.RenameTypeProcessor.analyseEnclosedTypes(RenameTypeProcessor.java:893)
	at org.eclipse.jdt.internal.corext.refactoring.rename.RenameTypeProcessor.doCheckFinalConditions(RenameTypeProcessor.java:541)
	at org.eclipse.jdt.internal.corext.refactoring.rename.JavaRenameProcessor.checkFinalConditions(JavaRenameProcessor.java:48)
	at org.eclipse.ltk.core.refactoring.participants.ProcessorBasedRefactoring.checkFinalConditions(ProcessorBasedRefactoring.java:222)
(32 more lines...)
Collapse Failed RenameTypeTests test10 History
< 1 sec
java.lang.IllegalArgumentException: null
	at org.eclipse.jdt.core.dom.ASTParser.<init>(ASTParser.java:234)
	at org.eclipse.jdt.core.dom.ASTParser.newParser(ASTParser.java:131)
	at org.eclipse.jdt.internal.corext.refactoring.util.RefactoringASTParser.<init>(RefactoringASTParser.java:40)
	at org.eclipse.jdt.internal.corext.refactoring.rename.RenameTypeProcessor.analyseEnclosedTypes(RenameTypeProcessor.java:893)
	at org.eclipse.jdt.internal.corext.refactoring.rename.RenameTypeProcessor.doCheckFinalConditions(RenameTypeProcessor.java:541)
	at org.eclipse.jdt.internal.corext.refactoring.rename.JavaRenameProcessor.checkFinalConditions(JavaRenameProcessor.java:48)
	at org.eclipse.ltk.core.refactoring.participants.ProcessorBasedRefactoring.checkFinalConditions(ProcessorBasedRefactoring.java:222)
(32 more lines...)
Collapse Failed RenameTypeTests test11 History
< 1 sec
java.lang.IllegalArgumentException: null
	at org.eclipse.jdt.core.dom.ASTParser.<init>(ASTParser.java:234)
	at org.eclipse.jdt.core.dom.ASTParser.newParser(ASTParser.java:131)
	at org.eclipse.jdt.internal.corext.refactoring.util.RefactoringASTParser.<init>(RefactoringASTParser.java:40)
	at org.eclipse.jdt.internal.corext.refactoring.rename.RenameTypeProcessor.analyseEnclosedTypes(RenameTypeProcessor.java:893)
	at org.eclipse.jdt.internal.corext.refactoring.rename.RenameTypeProcessor.doCheckFinalConditions(RenameTypeProcessor.java:541)
	at org.eclipse.jdt.internal.corext.refactoring.rename.JavaRenameProcessor.checkFinalConditions(JavaRenameProcessor.java:48)
	at org.eclipse.ltk.core.refactoring.participants.ProcessorBasedRefactoring.checkFinalConditions(ProcessorBasedRefactoring.java:222)
(32 more lines...)
Collapse Failed RenameTypeTests test12 History
< 1 sec
java.lang.IllegalArgumentException: null
	at org.eclipse.jdt.core.dom.ASTParser.<init>(ASTParser.java:234)
	at org.eclipse.jdt.core.dom.ASTParser.newParser(ASTParser.java:131)
	at org.eclipse.jdt.internal.corext.refactoring.util.RefactoringASTParser.<init>(RefactoringASTParser.java:40)
	at org.eclipse.jdt.internal.corext.refactoring.rename.RenameTypeProcessor.analyseEnclosedTypes(RenameTypeProcessor.java:893)
	at org.eclipse.jdt.internal.corext.refactoring.rename.RenameTypeProcessor.doCheckFinalConditions(RenameTypeProcessor.java:541)
	at org.eclipse.jdt.internal.corext.refactoring.rename.JavaRenameProcessor.checkFinalConditions(JavaRenameProcessor.java:48)
	at org.eclipse.ltk.core.refactoring.participants.ProcessorBasedRefactoring.checkFinalConditions(ProcessorBasedRefactoring.java:222)
(32 more lines...)
Collapse Failed RenameTypeTests test13 History
< 1 sec
java.lang.IllegalArgumentException: null
	at org.eclipse.jdt.core.dom.ASTParser.<init>(ASTParser.java:234)
	at org.eclipse.jdt.core.dom.ASTParser.newParser(ASTParser.java:131)
	at org.eclipse.jdt.internal.corext.refactoring.util.RefactoringASTParser.<init>(RefactoringASTParser.java:40)
	at org.eclipse.jdt.internal.corext.refactoring.rename.RenameTypeProcessor.analyseEnclosedTypes(RenameTypeProcessor.java:893)
	at org.eclipse.jdt.internal.corext.refactoring.rename.RenameTypeProcessor.doCheckFinalConditions(RenameTypeProcessor.java:541)
	at org.eclipse.jdt.internal.corext.refactoring.rename.JavaRenameProcessor.checkFinalConditions(JavaRenameProcessor.java:48)
	at org.eclipse.ltk.core.refactoring.participants.ProcessorBasedRefactoring.checkFinalConditions(ProcessorBasedRefactoring.java:222)
(32 more lines...)
Collapse Failed RenameTypeTests test2 History
< 1 sec
java.lang.IllegalArgumentException: null
	at org.eclipse.jdt.core.dom.ASTParser.<init>(ASTParser.java:234)
	at org.eclipse.jdt.core.dom.ASTParser.newParser(ASTParser.java:131)
	at org.eclipse.jdt.internal.corext.refactoring.util.RefactoringASTParser.<init>(RefactoringASTParser.java:40)
	at org.eclipse.jdt.internal.corext.refactoring.rename.RenameTypeProcessor.analyseEnclosedTypes(RenameTypeProcessor.java:893)
	at org.eclipse.jdt.internal.corext.refactoring.rename.RenameTypeProcessor.doCheckFinalConditions(RenameTypeProcessor.java:541)
	at org.eclipse.jdt.internal.corext.refactoring.rename.JavaRenameProcessor.checkFinalConditions(JavaRenameProcessor.java:48)
	at org.eclipse.ltk.core.refactoring.participants.ProcessorBasedRefactoring.checkFinalConditions(ProcessorBasedRefactoring.java:222)
(32 more lines...)
Collapse Failed RenameTypeTests test3 History
< 1 sec
java.lang.IllegalArgumentException: null
	at org.eclipse.jdt.core.dom.ASTParser.<init>(ASTParser.java:234)
	at org.eclipse.jdt.core.dom.ASTParser.newParser(ASTParser.java:131)
	at org.eclipse.jdt.internal.corext.refactoring.util.RefactoringASTParser.<init>(RefactoringASTParser.java:40)
	at org.eclipse.jdt.internal.corext.refactoring.rename.RenameTypeProcessor.analyseEnclosedTypes(RenameTypeProcessor.java:893)
	at org.eclipse.jdt.internal.corext.refactoring.rename.RenameTypeProcessor.doCheckFinalConditions(RenameTypeProcessor.java:541)
	at org.eclipse.jdt.internal.corext.refactoring.rename.JavaRenameProcessor.checkFinalConditions(JavaRenameProcessor.java:48)
	at org.eclipse.ltk.core.refactoring.participants.ProcessorBasedRefactoring.checkFinalConditions(ProcessorBasedRefactoring.java:222)
(32 more lines...)
Collapse Failed RenameTypeTests test4 History
< 1 sec
java.lang.IllegalArgumentException: null
	at org.eclipse.jdt.core.dom.ASTParser.<init>(ASTParser.java:234)
	at org.eclipse.jdt.core.dom.ASTParser.newParser(ASTParser.java:131)
	at org.eclipse.jdt.internal.corext.refactoring.util.RefactoringASTParser.<init>(RefactoringASTParser.java:40)
	at org.eclipse.jdt.internal.corext.refactoring.rename.RenameTypeProcessor.analyseEnclosedTypes(RenameTypeProcessor.java:893)
	at org.eclipse.jdt.internal.corext.refactoring.rename.RenameTypeProcessor.doCheckFinalConditions(RenameTypeProcessor.java:541)
	at org.eclipse.jdt.internal.corext.refactoring.rename.JavaRenameProcessor.checkFinalConditions(JavaRenameProcessor.java:48)
	at org.eclipse.ltk.core.refactoring.participants.ProcessorBasedRefactoring.checkFinalConditions(ProcessorBasedRefactoring.java:222)
(32 more lines...)
Collapse Failed RenameTypeTests test5 History
< 1 sec
java.lang.IllegalArgumentException: null
	at org.eclipse.jdt.core.dom.ASTParser.<init>(ASTParser.java:234)
	at org.eclipse.jdt.core.dom.ASTParser.newParser(ASTParser.java:131)
	at org.eclipse.jdt.internal.corext.refactoring.util.RefactoringASTParser.<init>(RefactoringASTParser.java:40)
	at org.eclipse.jdt.internal.corext.refactoring.rename.RenameTypeProcessor.analyseEnclosedTypes(RenameTypeProcessor.java:893)
	at org.eclipse.jdt.internal.corext.refactoring.rename.RenameTypeProcessor.doCheckFinalConditions(RenameTypeProcessor.java:541)
	at org.eclipse.jdt.internal.corext.refactoring.rename.JavaRenameProcessor.checkFinalConditions(JavaRenameProcessor.java:48)
	at org.eclipse.ltk.core.refactoring.participants.ProcessorBasedRefactoring.checkFinalConditions(ProcessorBasedRefactoring.java:222)
(32 more lines...)
Collapse Failed RenameTypeTests test6 History
< 1 sec
java.lang.IllegalArgumentException: null
	at org.eclipse.jdt.core.dom.ASTParser.<init>(ASTParser.java:234)
	at org.eclipse.jdt.core.dom.ASTParser.newParser(ASTParser.java:131)
	at org.eclipse.jdt.internal.corext.refactoring.util.RefactoringASTParser.<init>(RefactoringASTParser.java:40)
	at org.eclipse.jdt.internal.corext.refactoring.rename.RenameTypeProcessor.analyseEnclosedTypes(RenameTypeProcessor.java:893)
	at org.eclipse.jdt.internal.corext.refactoring.rename.RenameTypeProcessor.doCheckFinalConditions(RenameTypeProcessor.java:541)
	at org.eclipse.jdt.internal.corext.refactoring.rename.JavaRenameProcessor.checkFinalConditions(JavaRenameProcessor.java:48)
	at org.eclipse.ltk.core.refactoring.participants.ProcessorBasedRefactoring.checkFinalConditions(ProcessorBasedRefactoring.java:222)
(32 more lines...)
Collapse Failed RenameTypeTests test7 History
< 1 sec
java.lang.IllegalArgumentException: null
	at org.eclipse.jdt.core.dom.ASTParser.<init>(ASTParser.java:234)
	at org.eclipse.jdt.core.dom.ASTParser.newParser(ASTParser.java:131)
	at org.eclipse.jdt.internal.corext.refactoring.util.RefactoringASTParser.<init>(RefactoringASTParser.java:40)
	at org.eclipse.jdt.internal.corext.refactoring.rename.RenameTypeProcessor.analyseEnclosedTypes(RenameTypeProcessor.java:893)
	at org.eclipse.jdt.internal.corext.refactoring.rename.RenameTypeProcessor.doCheckFinalConditions(RenameTypeProcessor.java:541)
	at org.eclipse.jdt.internal.corext.refactoring.rename.JavaRenameProcessor.checkFinalConditions(JavaRenameProcessor.java:48)
	at org.eclipse.ltk.core.refactoring.participants.ProcessorBasedRefactoring.checkFinalConditions(ProcessorBasedRefactoring.java:222)
(32 more lines...)
Collapse Failed RenameTypeTests test8 History
< 1 sec
java.lang.IllegalArgumentException: null
	at org.eclipse.jdt.core.dom.ASTParser.<init>(ASTParser.java:234)
	at org.eclipse.jdt.core.dom.ASTParser.newParser(ASTParser.java:131)
	at org.eclipse.jdt.internal.corext.refactoring.util.RefactoringASTParser.<init>(RefactoringASTParser.java:40)
	at org.eclipse.jdt.internal.corext.refactoring.rename.RenameTypeProcessor.analyseEnclosedTypes(RenameTypeProcessor.java:893)
	at org.eclipse.jdt.internal.corext.refactoring.rename.RenameTypeProcessor.doCheckFinalConditions(RenameTypeProcessor.java:541)
	at org.eclipse.jdt.internal.corext.refactoring.rename.JavaRenameProcessor.checkFinalConditions(JavaRenameProcessor.java:48)
	at org.eclipse.ltk.core.refactoring.participants.ProcessorBasedRefactoring.checkFinalConditions(ProcessorBasedRefactoring.java:222)
(32 more lines...)
Collapse Failed RenameTypeTests test9 History
< 1 sec
java.lang.IllegalArgumentException: null
	at org.eclipse.jdt.core.dom.ASTParser.<init>(ASTParser.java:234)
	at org.eclipse.jdt.core.dom.ASTParser.newParser(ASTParser.java:131)
	at org.eclipse.jdt.internal.corext.refactoring.util.RefactoringASTParser.<init>(RefactoringASTParser.java:40)
	at org.eclipse.jdt.internal.corext.refactoring.rename.RenameTypeProcessor.analyseEnclosedTypes(RenameTypeProcessor.java:893)
	at org.eclipse.jdt.internal.corext.refactoring.rename.RenameTypeProcessor.doCheckFinalConditions(RenameTypeProcessor.java:541)
	at org.eclipse.jdt.internal.corext.refactoring.rename.JavaRenameProcessor.checkFinalConditions(JavaRenameProcessor.java:48)
	at org.eclipse.ltk.core.refactoring.participants.ProcessorBasedRefactoring.checkFinalConditions(ProcessorBasedRefactoring.java:222)
(32 more lines...)
Collapse Failed RenameTypeTests testAlias1 History
< 1 sec
java.lang.IllegalArgumentException: null
	at org.eclipse.jdt.core.dom.ASTParser.<init>(ASTParser.java:234)
	at org.eclipse.jdt.core.dom.ASTParser.newParser(ASTParser.java:131)
	at org.eclipse.jdt.internal.corext.refactoring.util.RefactoringASTParser.<init>(RefactoringASTParser.java:40)
	at org.eclipse.jdt.internal.corext.refactoring.rename.RenameTypeProcessor.analyseEnclosedTypes(RenameTypeProcessor.java:893)
	at org.eclipse.jdt.internal.corext.refactoring.rename.RenameTypeProcessor.doCheckFinalConditions(RenameTypeProcessor.java:541)
	at org.eclipse.jdt.internal.corext.refactoring.rename.JavaRenameProcessor.checkFinalConditions(JavaRenameProcessor.java:48)
	at org.eclipse.ltk.core.refactoring.participants.ProcessorBasedRefactoring.checkFinalConditions(ProcessorBasedRefactoring.java:222)
(32 more lines...)
Collapse Failed RenameTypeTests testAnnotation1 History
< 1 sec
java.lang.IllegalArgumentException: null
	at org.eclipse.jdt.core.dom.ASTParser.<init>(ASTParser.java:234)
	at org.eclipse.jdt.core.dom.ASTParser.newParser(ASTParser.java:131)
	at org.eclipse.jdt.internal.corext.refactoring.util.RefactoringASTParser.<init>(RefactoringASTParser.java:40)
	at org.eclipse.jdt.internal.corext.refactoring.rename.RenameTypeProcessor.analyseEnclosedTypes(RenameTypeProcessor.java:893)
	at org.eclipse.jdt.internal.corext.refactoring.rename.RenameTypeProcessor.doCheckFinalConditions(RenameTypeProcessor.java:541)
	at org.eclipse.jdt.internal.corext.refactoring.rename.JavaRenameProcessor.checkFinalConditions(JavaRenameProcessor.java:48)
	at org.eclipse.ltk.core.refactoring.participants.ProcessorBasedRefactoring.checkFinalConditions(ProcessorBasedRefactoring.java:222)
(38 more lines...)
Collapse Failed RenameTypeTests testAnnotation2 History
< 1 sec
java.lang.IllegalArgumentException: null
	at org.eclipse.jdt.core.dom.ASTParser.<init>(ASTParser.java:234)
	at org.eclipse.jdt.core.dom.ASTParser.newParser(ASTParser.java:131)
	at org.eclipse.jdt.internal.corext.refactoring.util.RefactoringASTParser.<init>(RefactoringASTParser.java:40)
	at org.eclipse.jdt.internal.corext.refactoring.rename.RenameTypeProcessor.analyseEnclosedTypes(RenameTypeProcessor.java:893)
	at org.eclipse.jdt.internal.corext.refactoring.rename.RenameTypeProcessor.doCheckFinalConditions(RenameTypeProcessor.java:541)
	at org.eclipse.jdt.internal.corext.refactoring.rename.JavaRenameProcessor.checkFinalConditions(JavaRenameProcessor.java:48)
	at org.eclipse.ltk.core.refactoring.participants.ProcessorBasedRefactoring.checkFinalConditions(ProcessorBasedRefactoring.java:222)
(32 more lines...)
Collapse Failed RenameTypeTests testAnnotation3 History
< 1 sec
java.lang.IllegalArgumentException: null
	at org.eclipse.jdt.core.dom.ASTParser.<init>(ASTParser.java:234)
	at org.eclipse.jdt.core.dom.ASTParser.newParser(ASTParser.java:131)
	at org.eclipse.jdt.internal.corext.refactoring.util.RefactoringASTParser.<init>(RefactoringASTParser.java:40)
	at org.eclipse.jdt.internal.corext.refactoring.rename.RenameTypeProcessor.analyseEnclosedTypes(RenameTypeProcessor.java:893)
	at org.eclipse.jdt.internal.corext.refactoring.rename.RenameTypeProcessor.doCheckFinalConditions(RenameTypeProcessor.java:541)
	at org.eclipse.jdt.internal.corext.refactoring.rename.JavaRenameProcessor.checkFinalConditions(JavaRenameProcessor.java:48)
	at org.eclipse.ltk.core.refactoring.participants.ProcessorBasedRefactoring.checkFinalConditions(ProcessorBasedRefactoring.java:222)
(32 more lines...)
Collapse Failed RenameTypeTests testEnum1 History
< 1 sec
java.lang.IllegalArgumentException: null
	at org.eclipse.jdt.core.dom.ASTParser.<init>(ASTParser.java:234)
	at org.eclipse.jdt.core.dom.ASTParser.newParser(ASTParser.java:131)
	at org.eclipse.jdt.internal.corext.refactoring.util.RefactoringASTParser.<init>(RefactoringASTParser.java:40)
	at org.eclipse.jdt.internal.corext.refactoring.rename.RenameTypeProcessor.analyseEnclosedTypes(RenameTypeProcessor.java:893)
	at org.eclipse.jdt.internal.corext.refactoring.rename.RenameTypeProcessor.doCheckFinalConditions(RenameTypeProcessor.java:541)
	at org.eclipse.jdt.internal.corext.refactoring.rename.JavaRenameProcessor.checkFinalConditions(JavaRenameProcessor.java:48)
	at org.eclipse.ltk.core.refactoring.participants.ProcessorBasedRefactoring.checkFinalConditions(ProcessorBasedRefactoring.java:222)
(32 more lines...)
Collapse Failed RenameTypeTests testEnum2 History
< 1 sec
java.lang.IllegalArgumentException: null
	at org.eclipse.jdt.core.dom.ASTParser.<init>(ASTParser.java:234)
	at org.eclipse.jdt.core.dom.ASTParser.newParser(ASTParser.java:131)
	at org.eclipse.jdt.internal.corext.refactoring.util.RefactoringASTParser.<init>(RefactoringASTParser.java:40)
	at org.eclipse.jdt.internal.corext.refactoring.rename.RenameTypeProcessor.analyseEnclosedTypes(RenameTypeProcessor.java:893)
	at org.eclipse.jdt.internal.corext.refactoring.rename.RenameTypeProcessor.doCheckFinalConditions(RenameTypeProcessor.java:541)
	at org.eclipse.jdt.internal.corext.refactoring.rename.JavaRenameProcessor.checkFinalConditions(JavaRenameProcessor.java:48)
	at org.eclipse.ltk.core.refactoring.participants.ProcessorBasedRefactoring.checkFinalConditions(ProcessorBasedRefactoring.java:222)
(32 more lines...)
Collapse Failed RenameTypeTests testGenerics1 History
< 1 sec
java.lang.IllegalArgumentException: null
	at org.eclipse.jdt.core.dom.ASTParser.<init>(ASTParser.java:234)
	at org.eclipse.jdt.core.dom.ASTParser.newParser(ASTParser.java:131)
	at org.eclipse.jdt.internal.corext.refactoring.util.RefactoringASTParser.<init>(RefactoringASTParser.java:40)
	at org.eclipse.jdt.internal.corext.refactoring.rename.RenameTypeProcessor.analyseEnclosedTypes(RenameTypeProcessor.java:893)
	at org.eclipse.jdt.internal.corext.refactoring.rename.RenameTypeProcessor.doCheckFinalConditions(RenameTypeProcessor.java:541)
	at org.eclipse.jdt.internal.corext.refactoring.rename.JavaRenameProcessor.checkFinalConditions(JavaRenameProcessor.java:48)
	at org.eclipse.ltk.core.refactoring.participants.ProcessorBasedRefactoring.checkFinalConditions(ProcessorBasedRefactoring.java:222)
(32 more lines...)
Collapse Failed RenameTypeTests testGenerics2 History
< 1 sec
java.lang.IllegalArgumentException: null
	at org.eclipse.jdt.core.dom.ASTParser.<init>(ASTParser.java:234)
	at org.eclipse.jdt.core.dom.ASTParser.newParser(ASTParser.java:131)
	at org.eclipse.jdt.internal.corext.refactoring.util.RefactoringASTParser.<init>(RefactoringASTParser.java:40)
	at org.eclipse.jdt.internal.corext.refactoring.rename.RenameTypeProcessor.analyseEnclosedTypes(RenameTypeProcessor.java:893)
	at org.eclipse.jdt.internal.corext.refactoring.rename.RenameTypeProcessor.doCheckFinalConditions(RenameTypeProcessor.java:541)
	at org.eclipse.jdt.internal.corext.refactoring.rename.JavaRenameProcessor.checkFinalConditions(JavaRenameProcessor.java:48)
	at org.eclipse.ltk.core.refactoring.participants.ProcessorBasedRefactoring.checkFinalConditions(ProcessorBasedRefactoring.java:222)
(32 more lines...)
Collapse Failed RenameTypeTests testGenerics3 History
< 1 sec
java.lang.IllegalArgumentException: null
	at org.eclipse.jdt.core.dom.ASTParser.<init>(ASTParser.java:234)
	at org.eclipse.jdt.core.dom.ASTParser.newParser(ASTParser.java:131)
	at org.eclipse.jdt.internal.corext.refactoring.util.RefactoringASTParser.<init>(RefactoringASTParser.java:40)
	at org.eclipse.jdt.internal.corext.refactoring.rename.RenameTypeProcessor.analyseEnclosedTypes(RenameTypeProcessor.java:893)
	at org.eclipse.jdt.internal.corext.refactoring.rename.RenameTypeProcessor.doCheckFinalConditions(RenameTypeProcessor.java:541)
	at org.eclipse.jdt.internal.corext.refactoring.rename.JavaRenameProcessor.checkFinalConditions(JavaRenameProcessor.java:48)
	at org.eclipse.ltk.core.refactoring.participants.ProcessorBasedRefactoring.checkFinalConditions(ProcessorBasedRefactoring.java:222)
(32 more lines...)
Collapse Failed RenameTypeTests testGenerics4 History
< 1 sec
java.lang.IllegalArgumentException: null
	at org.eclipse.jdt.core.dom.ASTParser.<init>(ASTParser.java:234)
	at org.eclipse.jdt.core.dom.ASTParser.newParser(ASTParser.java:131)
	at org.eclipse.jdt.internal.corext.refactoring.util.RefactoringASTParser.<init>(RefactoringASTParser.java:40)
	at org.eclipse.jdt.internal.corext.refactoring.rename.RenameTypeProcessor.analyseEnclosedTypes(RenameTypeProcessor.java:893)
	at org.eclipse.jdt.internal.corext.refactoring.rename.RenameTypeProcessor.doCheckFinalConditions(RenameTypeProcessor.java:541)
	at org.eclipse.jdt.internal.corext.refactoring.rename.JavaRenameProcessor.checkFinalConditions(JavaRenameProcessor.java:48)
	at org.eclipse.ltk.core.refactoring.participants.ProcessorBasedRefactoring.checkFinalConditions(ProcessorBasedRefactoring.java:222)
(32 more lines...)
Collapse Failed RenameTypeTests testInner1 History
< 1 sec
java.lang.IllegalArgumentException: null
	at org.eclipse.jdt.core.dom.ASTParser.<init>(ASTParser.java:234)
	at org.eclipse.jdt.core.dom.ASTParser.newParser(ASTParser.java:131)
	at org.eclipse.jdt.internal.corext.refactoring.util.RefactoringASTParser.<init>(RefactoringASTParser.java:40)
	at org.eclipse.jdt.internal.corext.refactoring.rename.RenameTypeProcessor.analyseEnclosedTypes(RenameTypeProcessor.java:893)
	at org.eclipse.jdt.internal.corext.refactoring.rename.RenameTypeProcessor.doCheckFinalConditions(RenameTypeProcessor.java:541)
	at org.eclipse.jdt.internal.corext.refactoring.rename.JavaRenameProcessor.checkFinalConditions(JavaRenameProcessor.java:48)
	at org.eclipse.ltk.core.refactoring.participants.ProcessorBasedRefactoring.checkFinalConditions(ProcessorBasedRefactoring.java:222)
(30 more lines...)
Collapse Failed RenameTypeTests testInner2 History
< 1 sec
java.lang.IllegalArgumentException: null
	at org.eclipse.jdt.core.dom.ASTParser.<init>(ASTParser.java:234)
	at org.eclipse.jdt.core.dom.ASTParser.newParser(ASTParser.java:131)
	at org.eclipse.jdt.internal.corext.refactoring.util.RefactoringASTParser.<init>(RefactoringASTParser.java:40)
	at org.eclipse.jdt.internal.corext.refactoring.rename.RenameTypeProcessor.analyseEnclosedTypes(RenameTypeProcessor.java:893)
	at org.eclipse.jdt.internal.corext.refactoring.rename.RenameTypeProcessor.doCheckFinalConditions(RenameTypeProcessor.java:541)
	at org.eclipse.jdt.internal.corext.refactoring.rename.JavaRenameProcessor.checkFinalConditions(JavaRenameProcessor.java:48)
	at org.eclipse.ltk.core.refactoring.participants.ProcessorBasedRefactoring.checkFinalConditions(ProcessorBasedRefactoring.java:222)
(30 more lines...)
Collapse Failed RenameTypeTests testInner3 History
1 sec
java.lang.IllegalArgumentException: null
	at org.eclipse.jdt.core.dom.ASTParser.<init>(ASTParser.java:234)
	at org.eclipse.jdt.core.dom.ASTParser.newParser(ASTParser.java:131)
	at org.eclipse.jdt.internal.corext.refactoring.util.RefactoringASTParser.<init>(RefactoringASTParser.java:40)
	at org.eclipse.jdt.internal.corext.refactoring.rename.RenameTypeProcessor.analyseEnclosedTypes(RenameTypeProcessor.java:893)
	at org.eclipse.jdt.internal.corext.refactoring.rename.RenameTypeProcessor.doCheckFinalConditions(RenameTypeProcessor.java:541)
	at org.eclipse.jdt.internal.corext.refactoring.rename.JavaRenameProcessor.checkFinalConditions(JavaRenameProcessor.java:48)
	at org.eclipse.ltk.core.refactoring.participants.ProcessorBasedRefactoring.checkFinalConditions(ProcessorBasedRefactoring.java:222)
(30 more lines...)
Collapse Failed RenameTypeTests testJavadoc1 History
< 1 sec
java.lang.IllegalArgumentException: null
	at org.eclipse.jdt.core.dom.ASTParser.<init>(ASTParser.java:234)
	at org.eclipse.jdt.core.dom.ASTParser.newParser(ASTParser.java:131)
	at org.eclipse.jdt.internal.corext.refactoring.util.RefactoringASTParser.<init>(RefactoringASTParser.java:40)
	at org.eclipse.jdt.internal.corext.refactoring.rename.RenameTypeProcessor.analyseEnclosedTypes(RenameTypeProcessor.java:893)
	at org.eclipse.jdt.internal.corext.refactoring.rename.RenameTypeProcessor.doCheckFinalConditions(RenameTypeProcessor.java:541)
	at org.eclipse.jdt.internal.corext.refactoring.rename.JavaRenameProcessor.checkFinalConditions(JavaRenameProcessor.java:48)
	at org.eclipse.ltk.core.refactoring.participants.ProcessorBasedRefactoring.checkFinalConditions(ProcessorBasedRefactoring.java:222)
(30 more lines...)
Collapse Failed NewGroovyTestCaseWizardTests testCreateGroovyTestCase_SetUpAndTearDown History
1 sec
java.lang.IllegalArgumentException: null
	at org.eclipse.jdt.core.dom.ASTParser.<init>(ASTParser.java:234)
	at org.eclipse.jdt.core.dom.ASTParser.newParser(ASTParser.java:131)
	at org.eclipse.jdt.ui.wizards.NewTypeWizardPage.constructCUContent(NewTypeWizardPage.java:2361)
	at org.eclipse.jdt.ui.wizards.NewTypeWizardPage.createType(NewTypeWizardPage.java:2144)
	at org.codehaus.groovy.eclipse.wizards.NewGroovyTestTypeWizardPage.createType(NewGroovyTestTypeWizardPage.java:165)
	at sun.reflect.NativeMethodAccessorImpl.invoke0(Native Method)
	at sun.reflect.NativeMethodAccessorImpl.invoke(NativeMethodAccessorImpl.java:62)
(12 more lines...)
Collapse Failed NewGroovyTestCaseWizardTests testCreateGroovyTestCase_YesGroovyProject History
1 sec
java.lang.IllegalArgumentException: null
	at org.eclipse.jdt.core.dom.ASTParser.<init>(ASTParser.java:234)
	at org.eclipse.jdt.core.dom.ASTParser.newParser(ASTParser.java:131)
	at org.eclipse.jdt.ui.wizards.NewTypeWizardPage.constructCUContent(NewTypeWizardPage.java:2361)
	at org.eclipse.jdt.ui.wizards.NewTypeWizardPage.createType(NewTypeWizardPage.java:2144)
	at org.codehaus.groovy.eclipse.wizards.NewGroovyTestTypeWizardPage.createType(NewGroovyTestTypeWizardPage.java:165)
	at sun.reflect.NativeMethodAccessorImpl.invoke0(Native Method)
	at sun.reflect.NativeMethodAccessorImpl.invoke(NativeMethodAccessorImpl.java:62)
(12 more lines...)
Collapse Failed NewGroovyTypeWizardTests testCreateGroovyClass1 History
1 sec
java.lang.IllegalArgumentException: null
	at org.eclipse.jdt.core.dom.ASTParser.<init>(ASTParser.java:234)
	at org.eclipse.jdt.core.dom.ASTParser.newParser(ASTParser.java:131)
	at org.eclipse.jdt.ui.wizards.NewTypeWizardPage.constructCUContent(NewTypeWizardPage.java:2361)
	at org.eclipse.jdt.ui.wizards.NewTypeWizardPage.createType(NewTypeWizardPage.java:2144)
	at org.codehaus.groovy.eclipse.wizards.NewClassWizardPage.createType(NewClassWizardPage.java:137)
	at org.codehaus.groovy.eclipse.wizards.NewClassWizardPage$createType.call(Unknown Source)
	at org.codehaus.groovy.runtime.callsite.CallSiteArray.defaultCall(CallSiteArray.java:48)
(3 more lines...)
Collapse Failed NewGroovyTypeWizardTests testCreateGroovyClass2 History
1 sec
java.lang.IllegalArgumentException: null
	at org.eclipse.jdt.core.dom.ASTParser.<init>(ASTParser.java:234)
	at org.eclipse.jdt.core.dom.ASTParser.newParser(ASTParser.java:131)
	at org.eclipse.jdt.internal.corext.refactoring.TypeContextChecker.parseSuperType(TypeContextChecker.java:744)
	at org.eclipse.jdt.internal.corext.refactoring.TypeContextChecker.parseSuperClass(TypeContextChecker.java:724)
	at org.eclipse.jdt.ui.wizards.NewTypeWizardPage.superClassChanged(NewTypeWizardPage.java:1855)
	at org.eclipse.jdt.ui.wizards.NewTypeWizardPage.typePageDialogFieldChanged(NewTypeWizardPage.java:1154)
	at org.eclipse.jdt.ui.wizards.NewTypeWizardPage.access$2(NewTypeWizardPage.java:1118)
(9 more lines...)
Collapse Failed NewGroovyTypeWizardTests testCreateGroovyClass3 History
< 1 sec
java.lang.IllegalArgumentException: null
	at org.eclipse.jdt.core.dom.ASTParser.<init>(ASTParser.java:234)
	at org.eclipse.jdt.core.dom.ASTParser.newParser(ASTParser.java:131)
	at org.eclipse.jdt.internal.corext.refactoring.TypeContextChecker.parseSuperType(TypeContextChecker.java:744)
	at org.eclipse.jdt.internal.corext.refactoring.TypeContextChecker.parseSuperClass(TypeContextChecker.java:724)
	at org.eclipse.jdt.ui.wizards.NewTypeWizardPage.superClassChanged(NewTypeWizardPage.java:1855)
	at org.eclipse.jdt.ui.wizards.NewTypeWizardPage.typePageDialogFieldChanged(NewTypeWizardPage.java:1154)
	at org.eclipse.jdt.ui.wizards.NewTypeWizardPage.access$2(NewTypeWizardPage.java:1118)
(9 more lines...)
Collapse Failed NewGroovyTypeWizardTests testCreateGroovyClass4 History
1 sec
java.lang.IllegalArgumentException: null
	at org.eclipse.jdt.core.dom.ASTParser.<init>(ASTParser.java:234)
	at org.eclipse.jdt.core.dom.ASTParser.newParser(ASTParser.java:131)
	at org.eclipse.jdt.ui.wizards.NewTypeWizardPage.constructCUContent(NewTypeWizardPage.java:2361)
	at org.eclipse.jdt.ui.wizards.NewTypeWizardPage.createType(NewTypeWizardPage.java:2144)
	at org.codehaus.groovy.eclipse.wizards.NewClassWizardPage.createType(NewClassWizardPage.java:137)
	at org.codehaus.groovy.eclipse.wizards.NewClassWizardPage$createType.call(Unknown Source)
	at org.codehaus.groovy.runtime.callsite.CallSiteArray.defaultCall(CallSiteArray.java:48)
(3 more lines...)
Fixed tests 9
Status Test Failing since Duration
Successful SyntheticAccessorRenamingTests testGetterOnly History
Failing since build #506 (Code changes detected) 2 secs
Successful SyntheticAccessorRenamingTests testIsserOnly History
Failing since build #506 (Code changes detected) 2 secs
Successful SyntheticAccessorRenamingTests testJavaRename1 History
Failing since build #506 (Code changes detected) 1 sec
Successful SyntheticAccessorRenamingTests testJavaRename2 History
Failing since build #506 (Code changes detected) 1 sec
Successful SyntheticAccessorRenamingTests testMultiFileRename1 History
Failing since build #506 (Code changes detected) 1 sec
Successful SyntheticAccessorRenamingTests testMultiFileRename2 History
Failing since build #506 (Code changes detected) 1 sec
Successful SyntheticAccessorRenamingTests testSetterOnly History
Failing since build #506 (Code changes detected) 9 secs
Successful SyntheticAccessorRenamingTests testSingleFileRename1 History
Failing since build #506 (Code changes detected) 1 sec
Successful SyntheticAccessorRenamingTests testSingleFileRename2 History
Failing since build #506 (Code changes detected) 1 sec

Error summary

The build generated some errors. See the full build log for more details.

May 14, 2018 2:00:32 PM org.apache.http.impl.client.DefaultRequestDirector tryExecute
INFO: I/O exception (java.net.SocketException) caught when processing request to {}->http://download.eclipse.org: Connection reset
May 14, 2018 2:00:32 PM org.apache.http.impl.client.DefaultRequestDirector tryExecute
INFO: Retrying request to {}->http://download.eclipse.org
May 14, 2018 2:00:43 PM org.apache.http.impl.client.DefaultRequestDirector tryExecute
INFO: I/O exception (java.net.SocketException) caught when processing request to {}->http://download.eclipse.org: Connection reset
May 14, 2018 2:00:43 PM org.apache.http.impl.client.DefaultRequestDirector tryExecute
INFO: Retrying request to {}->http://download.eclipse.org
May 14, 2018 2:00:48 PM org.apache.http.impl.client.DefaultRequestDirector tryExecute
INFO: I/O exception (java.net.SocketException) caught when processing request to {}->http://download.eclipse.org: Connection reset
May 14, 2018 2:00:48 PM org.apache.http.impl.client.DefaultRequestDirector tryExecute
INFO: Retrying request to {}->http://download.eclipse.org
May 14, 2018 2:01:03 PM org.apache.http.impl.client.DefaultRequestDirector tryExecute
INFO: I/O exception (java.net.SocketException) caught when processing request to {}->http://download.eclipse.org: Connection reset
May 14, 2018 2:01:03 PM org.apache.http.impl.client.DefaultRequestDirector tryExecute
INFO: Retrying request to {}->http://download.eclipse.org
May 14, 2018 2:01:25 PM org.apache.http.impl.client.DefaultRequestDirector tryExecute
INFO: I/O exception (java.net.SocketException) caught when processing request to {}->http://download.eclipse.org: Connection reset
May 14, 2018 2:01:25 PM org.apache.http.impl.client.DefaultRequestDirector tryExecute
INFO: Retrying request to {}->http://download.eclipse.org
May 14, 2018 2:02:06 PM org.apache.http.impl.client.DefaultRequestDirector tryExecute
INFO: I/O exception (java.net.SocketException) caught when processing request to {}->http://download.eclipse.org: Connection reset
May 14, 2018 2:02:06 PM org.apache.http.impl.client.DefaultRequestDirector tryExecute
INFO: Retrying request to {}->http://download.eclipse.org
May 14, 2018 2:02:11 PM org.apache.http.impl.client.DefaultRequestDirector tryExecute
INFO: I/O exception (java.net.SocketException) caught when processing request to {}->http://download.eclipse.org: Connection reset
May 14, 2018 2:02:11 PM org.apache.http.impl.client.DefaultRequestDirector tryExecute
INFO: Retrying request to {}->http://download.eclipse.org
May 14, 2018 2:02:17 PM org.apache.http.impl.client.DefaultRequestDirector tryExecute
INFO: I/O exception (java.net.SocketException) caught when processing request to {}->http://download.eclipse.org: Connection reset
May 14, 2018 2:02:17 PM org.apache.http.impl.client.DefaultRequestDirector tryExecute
INFO: Retrying request to {}->http://download.eclipse.org
May 14, 2018 2:02:25 PM org.apache.http.impl.client.DefaultRequestDirector tryExecute
INFO: I/O exception (java.net.SocketException) caught when processing request to {}->http://download.eclipse.org: Connection reset
May 14, 2018 2:02:25 PM org.apache.http.impl.client.DefaultRequestDirector tryExecute
INFO: Retrying request to {}->http://download.eclipse.org
Java HotSpot(TM) 64-Bit Server VM warning: ignoring option MaxPermSize=256M; support was removed in 8.0
*** BUG ***
In pixman_region32_init_rect: Invalid rectangle passed
Set a breakpoint on '_pixman_log_error' to debug

*** BUG ***
In pixman_region32_init_rect: Invalid rectangle passed
Set a breakpoint on '_pixman_log_error' to debug

*** BUG ***
In pixman_region32_init_rect: Invalid rectangle passed
Set a breakpoint on '_pixman_log_error' to debug

*** BUG ***
In pixman_region32_init_rect: Invalid rectangle passed
Set a breakpoint on '_pixman_log_error' to debug

*** BUG ***
In pixman_region32_init_rect: Invalid rectangle passed
Set a breakpoint on '_pixman_log_error' to debug

CodeSelectRequestor: Could not proceed due to null declaring type for org.codehaus.groovy.ast.expr.BinaryExpression@4c42975e[org.codehaus.groovy.ast.expr.VariableExpression@65107cdc[variable: it]("in" at 1:20:  "in" )org.codehaus.groovy.ast.expr.ListExpression@346b35e5[]]
CodeSelectRequestor: Could not proceed due to null declaring type for org.codehaus.groovy.ast.expr.RangeExpression@1a28f337
CodeSelectRequestor: Could not proceed due to null declaring type for org.codehaus.groovy.ast.expr.RangeExpression@25f3cedb
TypeInferencingVisitorWithRequestor.findMethodNode: no match found for Type.x(QList<Qjava.util.Date;>;)
TypeInferencingVisitorWithRequestor.findMethodNode: no match found for Type.x(QList<Qjava.lang.Number;>;)
TypeInferencingVisitorWithRequestor.findMethodNode: no match found for Type.x(QList<Qjava.util.Date;>;)
TypeInferencingVisitorWithRequestor.findMethodNode: no match found for Type.x(QList<Qjava.lang.Number;>;)
CodeSelectRequestor: Could not proceed due to null declaring type for ConstantExpression[fff]
CodeSelectRequestor: Could not proceed due to null declaring type for ConstantExpression[fff]
CodeSelectRequestor: Could not proceed due to null declaring type for ConstantExpression[fff]
augment: type Foo having GroovyObject methods added

augment: type Foo having GroovyObject methods added

augment: type Foo having GroovyObject methods added

augment: type Foo having GroovyObject methods added

augment: type Foo having GroovyObject methods added

augment: type Foo having GroovyObject methods added

augment: type Foo having GroovyObject methods added

augment: type Foo having GroovyObject methods added

Waiting for: Java indexing... 3 files to index (/Project)
Waiting for: Java indexing... 13 files to index (/Project)
Waiting for: Java indexing... 13 files to index (/Project)
Waiting for: Java indexing... 13 files to index (/Project)
Waiting for: Java indexing... 13 files to index (/Project)
Waiting for: Java indexing... 13 files to index (/Project)
Waiting for: Java indexing... 13 files to index (/Project)
Waiting for: Java indexing... 7 files to index (/Project)
Waiting for: Java indexing... 12 files to index (/Project)
Waiting for: Java indexing... 12 files to index (/Project)
Waiting for: Java indexing... 9 files to index (/opt/jdk1.8.0_144/jre/lib/rt.jar)