Build and test Groovy-Eclipse on Eclipse 4.7 (Oxygen)

Build: #510 failed

Job: Default Job failed

Stages & jobs

  1. Default Stage

Job result summary

Completed
Duration
3 minutes
Revision
2c337798d113cd79e19986ef1d98177ee3f502e8 2c337798d113cd79e19986ef1d98177ee3f502e8
Fixed in
#513 (Code changes detected)
No failed test found. A possible compilation error occurred.

Error summary

The build generated some errors. See the full build log for more details.

Could not find test result reports in the /opt/bamboo-home/xml-data/build-dir/GRECLIPSE-GE47-JOB1 directory.
        at java.lang.Thread.run(Thread.java:748)
exception handling
org.codehaus.groovy.control.MultipleCompilationErrorsException: startup failed:

        at org.codehaus.groovy.control.ErrorCollector.failIfErrors(ErrorCollector.java:313)
        at org.codehaus.groovy.control.CompilationUnit.applyToSourceUnits(CompilationUnit.java:1027)
        at org.codehaus.groovy.control.CompilationUnit.compile(CompilationUnit.java:592)
        at org.codehaus.jdt.groovy.internal.compiler.ast.GroovyCompilationUnitDeclaration.processToPhase(GroovyCompilationUnitDeclaration.java:184)
        at org.codehaus.jdt.groovy.internal.compiler.ast.GroovyCompilationUnitDeclaration.resolve(GroovyCompilationUnitDeclaration.java:2098)
        at org.eclipse.jdt.internal.compiler.Compiler.process(Compiler.java:827)
        at org.eclipse.jdt.internal.compiler.ProcessTaskManager.run(ProcessTaskManager.java:137)
        at java.lang.Thread.run(Thread.java:748)
exception handling
org.codehaus.groovy.control.MultipleCompilationErrorsException: startup failed:

        at org.codehaus.groovy.control.ErrorCollector.failIfErrors(ErrorCollector.java:313)
        at org.codehaus.groovy.control.CompilationUnit.applyToSourceUnits(CompilationUnit.java:1027)
        at org.codehaus.groovy.control.CompilationUnit.compile(CompilationUnit.java:592)
        at org.codehaus.jdt.groovy.internal.compiler.ast.GroovyCompilationUnitDeclaration.processToPhase(GroovyCompilationUnitDeclaration.java:184)
        at org.codehaus.jdt.groovy.internal.compiler.ast.GroovyCompilationUnitDeclaration.analyseCode(GroovyCompilationUnitDeclaration.java:2181)
        at org.eclipse.jdt.internal.compiler.Compiler.process(Compiler.java:833)
        at org.eclipse.jdt.internal.compiler.ProcessTaskManager.run(ProcessTaskManager.java:137)
        at java.lang.Thread.run(Thread.java:748)
exception handling
org.codehaus.groovy.control.MultipleCompilationErrorsException: startup failed:

        at org.codehaus.groovy.control.ErrorCollector.failIfErrors(ErrorCollector.java:313)
        at org.codehaus.groovy.control.CompilationUnit.applyToSourceUnits(CompilationUnit.java:1027)
        at org.codehaus.groovy.control.CompilationUnit.compile(CompilationUnit.java:592)
        at org.codehaus.jdt.groovy.internal.compiler.ast.GroovyCompilationUnitDeclaration.processToPhase(GroovyCompilationUnitDeclaration.java:184)
        at org.codehaus.jdt.groovy.internal.compiler.ast.GroovyCompilationUnitDeclaration.generateCode(GroovyCompilationUnitDeclaration.java:1632)
        at org.eclipse.jdt.internal.compiler.Compiler.process(Compiler.java:838)
        at org.eclipse.jdt.internal.compiler.ProcessTaskManager.run(ProcessTaskManager.java:137)
        at java.lang.Thread.run(Thread.java:748)
exception handling
org.codehaus.groovy.control.MultipleCompilationErrorsException: startup failed:

        at org.codehaus.groovy.control.ErrorCollector.failIfErrors(ErrorCollector.java:313)
        at org.codehaus.groovy.control.CompilationUnit.applyToSourceUnits(CompilationUnit.java:1027)
        at org.codehaus.groovy.control.CompilationUnit.compile(CompilationUnit.java:592)
        at org.codehaus.jdt.groovy.internal.compiler.ast.GroovyCompilationUnitDeclaration.processToPhase(GroovyCompilationUnitDeclaration.java:184)
        at org.codehaus.jdt.groovy.internal.compiler.ast.GroovyCompilationUnitDeclaration.resolve(GroovyCompilationUnitDeclaration.java:2098)
        at org.eclipse.jdt.internal.compiler.Compiler.process(Compiler.java:827)
        at org.eclipse.jdt.internal.compiler.ProcessTaskManager.run(ProcessTaskManager.java:137)
        at java.lang.Thread.run(Thread.java:748)
exception handling
org.codehaus.groovy.control.MultipleCompilationErrorsException: startup failed:

        at org.codehaus.groovy.control.ErrorCollector.failIfErrors(ErrorCollector.java:313)
        at org.codehaus.groovy.control.CompilationUnit.applyToSourceUnits(CompilationUnit.java:1027)
        at org.codehaus.groovy.control.CompilationUnit.compile(CompilationUnit.java:592)
        at org.codehaus.jdt.groovy.internal.compiler.ast.GroovyCompilationUnitDeclaration.processToPhase(GroovyCompilationUnitDeclaration.java:184)
        at org.codehaus.jdt.groovy.internal.compiler.ast.GroovyCompilationUnitDeclaration.analyseCode(GroovyCompilationUnitDeclaration.java:2181)
        at org.eclipse.jdt.internal.compiler.Compiler.process(Compiler.java:833)
        at org.eclipse.jdt.internal.compiler.ProcessTaskManager.run(ProcessTaskManager.java:137)
        at java.lang.Thread.run(Thread.java:748)
exception handling
org.codehaus.groovy.control.MultipleCompilationErrorsException: startup failed:

        at org.codehaus.groovy.control.ErrorCollector.failIfErrors(ErrorCollector.java:313)
        at org.codehaus.groovy.control.CompilationUnit.applyToSourceUnits(CompilationUnit.java:1027)
        at org.codehaus.groovy.control.CompilationUnit.compile(CompilationUnit.java:592)
        at org.codehaus.jdt.groovy.internal.compiler.ast.GroovyCompilationUnitDeclaration.processToPhase(GroovyCompilationUnitDeclaration.java:184)
        at org.codehaus.jdt.groovy.internal.compiler.ast.GroovyCompilationUnitDeclaration.generateCode(GroovyCompilationUnitDeclaration.java:1632)
        at org.eclipse.jdt.internal.compiler.Compiler.process(Compiler.java:838)
        at org.eclipse.jdt.internal.compiler.ProcessTaskManager.run(ProcessTaskManager.java:137)
        at java.lang.Thread.run(Thread.java:748)
exception handling
org.codehaus.groovy.control.MultipleCompilationErrorsException: startup failed:

        at org.codehaus.groovy.control.ErrorCollector.failIfErrors(ErrorCollector.java:313)
        at org.codehaus.groovy.control.CompilationUnit.applyToSourceUnits(CompilationUnit.java:1027)
        at org.codehaus.groovy.control.CompilationUnit.compile(CompilationUnit.java:592)
        at org.codehaus.jdt.groovy.internal.compiler.ast.GroovyCompilationUnitDeclaration.processToPhase(GroovyCompilationUnitDeclaration.java:184)
        at org.codehaus.jdt.groovy.internal.compiler.ast.GroovyCompilationUnitDeclaration.resolve(GroovyCompilationUnitDeclaration.java:2098)
        at org.eclipse.jdt.internal.compiler.Compiler.process(Compiler.java:827)
        at org.eclipse.jdt.internal.compiler.ProcessTaskManager.run(ProcessTaskManager.java:137)
        at java.lang.Thread.run(Thread.java:748)
exception handling
org.codehaus.groovy.control.MultipleCompilationErrorsException: startup failed:

        at org.codehaus.groovy.control.ErrorCollector.failIfErrors(ErrorCollector.java:313)
        at org.codehaus.groovy.control.CompilationUnit.applyToSourceUnits(CompilationUnit.java:1027)
        at org.codehaus.groovy.control.CompilationUnit.compile(CompilationUnit.java:592)
        at org.codehaus.jdt.groovy.internal.compiler.ast.GroovyCompilationUnitDeclaration.processToPhase(GroovyCompilationUnitDeclaration.java:184)
        at org.codehaus.jdt.groovy.internal.compiler.ast.GroovyCompilationUnitDeclaration.analyseCode(GroovyCompilationUnitDeclaration.java:2181)
        at org.eclipse.jdt.internal.compiler.Compiler.process(Compiler.java:833)
        at org.eclipse.jdt.internal.compiler.ProcessTaskManager.run(ProcessTaskManager.java:137)
        at java.lang.Thread.run(Thread.java:748)
exception handling
org.codehaus.groovy.control.MultipleCompilationErrorsException: startup failed:

        at org.codehaus.groovy.control.ErrorCollector.failIfErrors(ErrorCollector.java:313)
        at org.codehaus.groovy.control.CompilationUnit.applyToSourceUnits(CompilationUnit.java:1027)
        at org.codehaus.groovy.control.CompilationUnit.compile(CompilationUnit.java:592)
        at org.codehaus.jdt.groovy.internal.compiler.ast.GroovyCompilationUnitDeclaration.processToPhase(GroovyCompilationUnitDeclaration.java:184)
        at org.codehaus.jdt.groovy.internal.compiler.ast.GroovyCompilationUnitDeclaration.generateCode(GroovyCompilationUnitDeclaration.java:1632)
        at org.eclipse.jdt.internal.compiler.Compiler.process(Compiler.java:838)
        at org.eclipse.jdt.internal.compiler.ProcessTaskManager.run(ProcessTaskManager.java:137)
        at java.lang.Thread.run(Thread.java:748)