Build and test Groovy-Eclipse on Eclipse 4.7 (Oxygen)

Build: #510 failed

Job: Default Job failed

Stages & jobs

  1. Default Stage

Build log

The build generated 3,515 lines of output.The output is too long and has been truncated to the last 1,000 lines. Download or view full build log

26-Jun-2018 00:41:54 [INFO]                                                                         
26-Jun-2018 00:41:54 [INFO] ------------------------------------------------------------------------
26-Jun-2018 00:41:54 [INFO] Building org.codehaus.groovy.eclipse.tests 2.9.3-SNAPSHOT
26-Jun-2018 00:41:54 [INFO] ------------------------------------------------------------------------
26-Jun-2018 00:41:54 [INFO]
26-Jun-2018 00:41:54 [INFO] --- maven-clean-plugin:2.5:clean (default-clean) @ org.codehaus.groovy.eclipse.tests ---
26-Jun-2018 00:41:54 [INFO]
26-Jun-2018 00:41:54 [INFO] --- tycho-packaging-plugin:0.24.0:build-qualifier (default-build-qualifier) @ org.codehaus.groovy.eclipse.tests ---
26-Jun-2018 00:41:54 [INFO] The project's OSGi version is 2.9.3.xx-201806260040-e47
26-Jun-2018 00:41:54 [INFO]
26-Jun-2018 00:41:54 [INFO] --- tycho-packaging-plugin:0.24.0:validate-id (default-validate-id) @ org.codehaus.groovy.eclipse.tests ---
26-Jun-2018 00:41:54 [INFO]
26-Jun-2018 00:41:54 [INFO] --- tycho-packaging-plugin:0.24.0:validate-version (default-validate-version) @ org.codehaus.groovy.eclipse.tests ---
26-Jun-2018 00:41:54 [INFO]
26-Jun-2018 00:41:54 [INFO] --- properties-maven-plugin:1.0-alpha-2:read-project-properties (default) @ org.codehaus.groovy.eclipse.tests ---
26-Jun-2018 00:41:54 [INFO]
26-Jun-2018 00:41:54 [INFO] --- maven-resources-plugin:2.4.3:resources (default-resources) @ org.codehaus.groovy.eclipse.tests ---
26-Jun-2018 00:41:54 [WARNING] Using platform encoding (UTF-8 actually) to copy filtered resources, i.e. build is platform dependent!
26-Jun-2018 00:41:54 [INFO] skip non existing resourceDirectory /opt/bamboo-home/xml-data/build-dir/GRECLIPSE-GE47-JOB1/ide-test/org.codehaus.groovy.eclipse.tests/src/main/resources
26-Jun-2018 00:41:54 [INFO]
26-Jun-2018 00:41:54 [INFO] --- tycho-compiler-plugin:0.24.0:compile (default-compile) @ org.codehaus.groovy.eclipse.tests ---
26-Jun-2018 00:41:54 [INFO] Using Groovy-Eclipse compiler to compile both Java and Groovy files
26-Jun-2018 00:41:57 [INFO]
26-Jun-2018 00:41:57 [INFO] --- maven-resources-plugin:2.4.3:testResources (default-testResources) @ org.codehaus.groovy.eclipse.tests ---
26-Jun-2018 00:41:57 [WARNING] Using platform encoding (UTF-8 actually) to copy filtered resources, i.e. build is platform dependent!
26-Jun-2018 00:41:57 [INFO] skip non existing resourceDirectory /opt/bamboo-home/xml-data/build-dir/GRECLIPSE-GE47-JOB1/ide-test/org.codehaus.groovy.eclipse.tests/src/test/resources
26-Jun-2018 00:41:57 [INFO]
26-Jun-2018 00:41:57 [INFO] --- tycho-source-plugin:0.24.0:plugin-source (plugin-source) @ org.codehaus.groovy.eclipse.tests ---
26-Jun-2018 00:41:57 [WARNING] bundle localization file /opt/bamboo-home/xml-data/build-dir/GRECLIPSE-GE47-JOB1/ide-test/org.codehaus.groovy.eclipse.tests/plugin.properties not found
26-Jun-2018 00:41:57 [WARNING] Bundle-Vendor header not found in /opt/bamboo-home/xml-data/build-dir/GRECLIPSE-GE47-JOB1/ide-test/org.codehaus.groovy.eclipse.tests/META-INF/MANIFEST.MF, fallback to 'unknown' for source bundle
26-Jun-2018 00:41:57 [INFO] Building jar: /opt/bamboo-home/xml-data/build-dir/GRECLIPSE-GE47-JOB1/ide-test/org.codehaus.groovy.eclipse.tests/target/org.codehaus.groovy.eclipse.tests-2.9.3-SNAPSHOT-sources.jar
26-Jun-2018 00:41:57 [INFO]
26-Jun-2018 00:41:57 [INFO] --- target-platform-configuration:0.24.0:target-platform (default-target-platform) @ org.codehaus.groovy.eclipse.tests ---
26-Jun-2018 00:41:57 [INFO]
26-Jun-2018 00:41:57 [INFO] --- tycho-packaging-plugin:0.24.0:package-plugin (default-package-plugin) @ org.codehaus.groovy.eclipse.tests ---
26-Jun-2018 00:41:57 [INFO] Building jar: /opt/bamboo-home/xml-data/build-dir/GRECLIPSE-GE47-JOB1/ide-test/org.codehaus.groovy.eclipse.tests/target/org.codehaus.groovy.eclipse.tests-2.9.3-SNAPSHOT.jar
26-Jun-2018 00:41:57 [INFO]
26-Jun-2018 00:41:57 [INFO] --- tycho-p2-plugin:0.24.0:p2-metadata-default (default-p2-metadata-default) @ org.codehaus.groovy.eclipse.tests ---
26-Jun-2018 00:41:57 [INFO]
26-Jun-2018 00:41:57 [INFO] --- maven-jarsigner-plugin:1.2:sign (sign) @ org.codehaus.groovy.eclipse.tests ---
26-Jun-2018 00:41:58 [INFO] 2 archive(s) processed
26-Jun-2018 00:41:58 [INFO]
26-Jun-2018 00:41:58 [INFO] --- tycho-source-feature-plugin:0.24.0:source-feature (source-feature) @ org.codehaus.groovy.eclipse.tests ---
26-Jun-2018 00:41:58 [INFO]
26-Jun-2018 00:41:58 [INFO] --- tycho-p2-plugin:0.24.0:p2-metadata (attach-p2-metadata) @ org.codehaus.groovy.eclipse.tests ---
26-Jun-2018 00:41:59 [INFO]
26-Jun-2018 00:41:59 [INFO] --- maven-install-plugin:2.3.1:install (default-install) @ org.codehaus.groovy.eclipse.tests ---
26-Jun-2018 00:41:59 [INFO] Installing /opt/bamboo-home/xml-data/build-dir/GRECLIPSE-GE47-JOB1/ide-test/org.codehaus.groovy.eclipse.tests/target/org.codehaus.groovy.eclipse.tests-2.9.3-SNAPSHOT.jar to /home/bamboo/.m2/repository/org/codehaus/groovy/eclipse/org.codehaus.groovy.eclipse.tests/2.9.3-SNAPSHOT/org.codehaus.groovy.eclipse.tests-2.9.3-SNAPSHOT.jar
26-Jun-2018 00:41:59 [INFO] Installing /opt/bamboo-home/xml-data/build-dir/GRECLIPSE-GE47-JOB1/ide-test/org.codehaus.groovy.eclipse.tests/pom.xml to /home/bamboo/.m2/repository/org/codehaus/groovy/eclipse/org.codehaus.groovy.eclipse.tests/2.9.3-SNAPSHOT/org.codehaus.groovy.eclipse.tests-2.9.3-SNAPSHOT.pom
26-Jun-2018 00:41:59 [INFO] Installing /opt/bamboo-home/xml-data/build-dir/GRECLIPSE-GE47-JOB1/ide-test/org.codehaus.groovy.eclipse.tests/target/org.codehaus.groovy.eclipse.tests-2.9.3-SNAPSHOT-sources.jar to /home/bamboo/.m2/repository/org/codehaus/groovy/eclipse/org.codehaus.groovy.eclipse.tests/2.9.3-SNAPSHOT/org.codehaus.groovy.eclipse.tests-2.9.3-SNAPSHOT-sources.jar
26-Jun-2018 00:41:59 [INFO] Installing /opt/bamboo-home/xml-data/build-dir/GRECLIPSE-GE47-JOB1/ide-test/org.codehaus.groovy.eclipse.tests/target/p2content.xml to /home/bamboo/.m2/repository/org/codehaus/groovy/eclipse/org.codehaus.groovy.eclipse.tests/2.9.3-SNAPSHOT/org.codehaus.groovy.eclipse.tests-2.9.3-SNAPSHOT-p2metadata.xml
26-Jun-2018 00:41:59 [INFO] Installing /opt/bamboo-home/xml-data/build-dir/GRECLIPSE-GE47-JOB1/ide-test/org.codehaus.groovy.eclipse.tests/target/p2artifacts.xml to /home/bamboo/.m2/repository/org/codehaus/groovy/eclipse/org.codehaus.groovy.eclipse.tests/2.9.3-SNAPSHOT/org.codehaus.groovy.eclipse.tests-2.9.3-SNAPSHOT-p2artifacts.xml
26-Jun-2018 00:41:59 [INFO] Installing /opt/bamboo-home/xml-data/build-dir/GRECLIPSE-GE47-JOB1/ide-test/org.codehaus.groovy.eclipse.tests/target/p2content.xml to /home/bamboo/.m2/repository/org/codehaus/groovy/eclipse/org.codehaus.groovy.eclipse.tests/2.9.3-SNAPSHOT/org.codehaus.groovy.eclipse.tests-2.9.3-SNAPSHOT-p2metadata.xml
26-Jun-2018 00:41:59 [INFO] Installing /opt/bamboo-home/xml-data/build-dir/GRECLIPSE-GE47-JOB1/ide-test/org.codehaus.groovy.eclipse.tests/target/p2artifacts.xml to /home/bamboo/.m2/repository/org/codehaus/groovy/eclipse/org.codehaus.groovy.eclipse.tests/2.9.3-SNAPSHOT/org.codehaus.groovy.eclipse.tests-2.9.3-SNAPSHOT-p2artifacts.xml
26-Jun-2018 00:41:59 [INFO]
26-Jun-2018 00:41:59 [INFO] --- tycho-p2-plugin:0.24.0:update-local-index (default-update-local-index) @ org.codehaus.groovy.eclipse.tests ---
26-Jun-2018 00:41:59 [INFO]
26-Jun-2018 00:41:59 [INFO] --- maven-deploy-plugin:2.5:deploy (default-deploy) @ org.codehaus.groovy.eclipse.tests ---
26-Jun-2018 00:41:59 [INFO] Skipping artifact deployment
26-Jun-2018 00:41:59 [INFO]                                                                         
26-Jun-2018 00:41:59 [INFO] ------------------------------------------------------------------------
26-Jun-2018 00:41:59 [INFO] Building org.codehaus.groovy.eclipse.codeassist.completion.test 2.9.3-SNAPSHOT
26-Jun-2018 00:41:59 [INFO] ------------------------------------------------------------------------
26-Jun-2018 00:41:59 [INFO]
26-Jun-2018 00:41:59 [INFO] --- maven-clean-plugin:2.5:clean (default-clean) @ org.codehaus.groovy.eclipse.codeassist.completion.test ---
26-Jun-2018 00:41:59 [INFO]
26-Jun-2018 00:41:59 [INFO] --- tycho-packaging-plugin:0.24.0:build-qualifier (default-build-qualifier) @ org.codehaus.groovy.eclipse.codeassist.completion.test ---
26-Jun-2018 00:41:59 [INFO] The project's OSGi version is 2.9.3.xx-201806260040-e47
26-Jun-2018 00:41:59 [INFO]
26-Jun-2018 00:41:59 [INFO] --- tycho-packaging-plugin:0.24.0:validate-id (default-validate-id) @ org.codehaus.groovy.eclipse.codeassist.completion.test ---
26-Jun-2018 00:41:59 [INFO]
26-Jun-2018 00:41:59 [INFO] --- tycho-packaging-plugin:0.24.0:validate-version (default-validate-version) @ org.codehaus.groovy.eclipse.codeassist.completion.test ---
26-Jun-2018 00:41:59 [INFO]
26-Jun-2018 00:41:59 [INFO] --- properties-maven-plugin:1.0-alpha-2:read-project-properties (default) @ org.codehaus.groovy.eclipse.codeassist.completion.test ---
26-Jun-2018 00:41:59 [INFO]
26-Jun-2018 00:41:59 [INFO] --- maven-resources-plugin:2.4.3:resources (default-resources) @ org.codehaus.groovy.eclipse.codeassist.completion.test ---
26-Jun-2018 00:41:59 [WARNING] Using platform encoding (UTF-8 actually) to copy filtered resources, i.e. build is platform dependent!
26-Jun-2018 00:41:59 [INFO] skip non existing resourceDirectory /opt/bamboo-home/xml-data/build-dir/GRECLIPSE-GE47-JOB1/ide-test/org.codehaus.groovy.eclipse.codeassist.completion.test/src/main/resources
26-Jun-2018 00:41:59 [INFO]
26-Jun-2018 00:41:59 [INFO] --- tycho-compiler-plugin:0.24.0:compile (default-compile) @ org.codehaus.groovy.eclipse.codeassist.completion.test ---
26-Jun-2018 00:41:59 [INFO] Using Groovy-Eclipse compiler to compile both Java and Groovy files
26-Jun-2018 00:41:59 org.codehaus.groovy.control.messages.SyntaxErrorMessage@2b3ad874
26-Jun-2018 00:42:00 exception handling
26-Jun-2018 00:42:00 org.codehaus.groovy.control.MultipleCompilationErrorsException: startup failed:
26-Jun-2018 00:42:00 /opt/bamboo-home/xml-data/build-dir/GRECLIPSE-GE47-JOB1/ide-test/org.codehaus.groovy.eclipse.codeassist.completion.test/src/org/codehaus/groovy/eclipse/codeassist/tests/CompletionTestSuite.groovy: 337: The return type of VisitStatus acceptASTNode(org.codehaus.groovy.ast.ASTNode, org.eclipse.jdt.groovy.search.TypeLookupResult, org.eclipse.jdt.core.IJavaElement) in org.codehaus.groovy.eclipse.codeassist.tests.CompletionTestSuite$SearchRequestor is incompatible with org.eclipse.jdt.groovy.search.ITypeRequestor$VisitStatus acceptASTNode(org.codehaus.groovy.ast.ASTNode, org.eclipse.jdt.groovy.search.TypeLookupResult, org.eclipse.jdt.core.IJavaElement) in org.eclipse.jdt.groovy.search.ITypeRequestor
26-Jun-2018 00:42:00 . At [337:9]  @ line 337, column 9.
26-Jun-2018 00:42:00            public VisitStatus acceptASTNode(ASTNode visitorNode, TypeLookupResult visitorResult, IJavaElement enclosingElement) {
26-Jun-2018 00:42:00            ^
26-Jun-2018 00:42:00
26-Jun-2018 00:42:00 1 error
26-Jun-2018 00:42:00
26-Jun-2018 00:42:00         at org.codehaus.groovy.control.ErrorCollector.failIfErrors(ErrorCollector.java:313)
26-Jun-2018 00:42:00         at org.codehaus.groovy.control.CompilationUnit.applyToPrimaryClassNodes(CompilationUnit.java:1227)
26-Jun-2018 00:42:00         at org.codehaus.groovy.control.CompilationUnit.doPhaseOperation(CompilationUnit.java:631)
26-Jun-2018 00:42:00         at org.codehaus.groovy.control.CompilationUnit.processPhaseOperations(CompilationUnit.java:609)
26-Jun-2018 00:42:00         at org.codehaus.groovy.control.CompilationUnit.compile(CompilationUnit.java:586)
26-Jun-2018 00:42:00         at org.codehaus.jdt.groovy.internal.compiler.ast.GroovyCompilationUnitDeclaration.processToPhase(GroovyCompilationUnitDeclaration.java:184)
26-Jun-2018 00:42:00         at org.codehaus.jdt.groovy.internal.compiler.ast.GroovyCompilationUnitDeclaration.generateCode(GroovyCompilationUnitDeclaration.java:1632)
26-Jun-2018 00:42:00         at org.eclipse.jdt.internal.compiler.Compiler.process(Compiler.java:838)
26-Jun-2018 00:42:00         at org.eclipse.jdt.internal.compiler.ProcessTaskManager.run(ProcessTaskManager.java:137)
26-Jun-2018 00:42:00         at java.lang.Thread.run(Thread.java:748)
26-Jun-2018 00:42:00 /opt/bamboo-home/xml-data/build-dir/GRECLIPSE-GE47-JOB1/ide-test/org.codehaus.groovy.eclipse.codeassist.completion.test/src/org/codehaus/groovy/eclipse/codeassist/tests/FieldCompletionTests.groovy: 337 Groovy:The return type of VisitStatus acceptASTNode(org.codehaus.groovy.ast.ASTNode, org.eclipse.jdt.groovy.search.TypeLookupResult, org.eclipse.jdt.core.IJavaElement) in org.codehaus.groovy.eclipse.codeassist.tests.CompletionTestSuite$SearchRequestor is incompatible with org.eclipse.jdt.groovy.search.ITypeRequestor$VisitStatus acceptASTNode(org.codehaus.groovy.ast.ASTNode, org.eclipse.jdt.groovy.search.TypeLookupResult, org.eclipse.jdt.core.IJavaElement) in org.eclipse.jdt.groovy.search.ITypeRequestor
26-Jun-2018 00:42:00 exception handling
26-Jun-2018 00:42:00 org.codehaus.groovy.control.MultipleCompilationErrorsException: startup failed:
26-Jun-2018 00:42:00
26-Jun-2018 00:42:00         at org.codehaus.groovy.control.ErrorCollector.failIfErrors(ErrorCollector.java:313)
26-Jun-2018 00:42:00         at org.codehaus.groovy.control.CompilationUnit.applyToSourceUnits(CompilationUnit.java:1027)
26-Jun-2018 00:42:00         at org.codehaus.groovy.control.CompilationUnit.compile(CompilationUnit.java:592)
26-Jun-2018 00:42:00         at org.codehaus.jdt.groovy.internal.compiler.ast.GroovyCompilationUnitDeclaration.processToPhase(GroovyCompilationUnitDeclaration.java:184)
26-Jun-2018 00:42:00         at org.codehaus.jdt.groovy.internal.compiler.ast.GroovyCompilationUnitDeclaration.resolve(GroovyCompilationUnitDeclaration.java:2098)
26-Jun-2018 00:42:00         at org.eclipse.jdt.internal.compiler.Compiler.process(Compiler.java:827)
26-Jun-2018 00:42:00         at org.eclipse.jdt.internal.compiler.ProcessTaskManager.run(ProcessTaskManager.java:137)
26-Jun-2018 00:42:00         at java.lang.Thread.run(Thread.java:748)
26-Jun-2018 00:42:00 exception handling
26-Jun-2018 00:42:00 org.codehaus.groovy.control.MultipleCompilationErrorsException: startup failed:
26-Jun-2018 00:42:00
26-Jun-2018 00:42:00         at org.codehaus.groovy.control.ErrorCollector.failIfErrors(ErrorCollector.java:313)
26-Jun-2018 00:42:00         at org.codehaus.groovy.control.CompilationUnit.applyToSourceUnits(CompilationUnit.java:1027)
26-Jun-2018 00:42:00         at org.codehaus.groovy.control.CompilationUnit.compile(CompilationUnit.java:592)
26-Jun-2018 00:42:00         at org.codehaus.jdt.groovy.internal.compiler.ast.GroovyCompilationUnitDeclaration.processToPhase(GroovyCompilationUnitDeclaration.java:184)
26-Jun-2018 00:42:00         at org.codehaus.jdt.groovy.internal.compiler.ast.GroovyCompilationUnitDeclaration.analyseCode(GroovyCompilationUnitDeclaration.java:2181)
26-Jun-2018 00:42:00         at org.eclipse.jdt.internal.compiler.Compiler.process(Compiler.java:833)
26-Jun-2018 00:42:00         at org.eclipse.jdt.internal.compiler.ProcessTaskManager.run(ProcessTaskManager.java:137)
26-Jun-2018 00:42:00         at java.lang.Thread.run(Thread.java:748)
26-Jun-2018 00:42:00 exception handling
26-Jun-2018 00:42:00 org.codehaus.groovy.control.MultipleCompilationErrorsException: startup failed:
26-Jun-2018 00:42:00
26-Jun-2018 00:42:00         at org.codehaus.groovy.control.ErrorCollector.failIfErrors(ErrorCollector.java:313)
26-Jun-2018 00:42:00         at org.codehaus.groovy.control.CompilationUnit.applyToSourceUnits(CompilationUnit.java:1027)
26-Jun-2018 00:42:00         at org.codehaus.groovy.control.CompilationUnit.compile(CompilationUnit.java:592)
26-Jun-2018 00:42:00         at org.codehaus.jdt.groovy.internal.compiler.ast.GroovyCompilationUnitDeclaration.processToPhase(GroovyCompilationUnitDeclaration.java:184)
26-Jun-2018 00:42:00         at org.codehaus.jdt.groovy.internal.compiler.ast.GroovyCompilationUnitDeclaration.generateCode(GroovyCompilationUnitDeclaration.java:1632)
26-Jun-2018 00:42:00         at org.eclipse.jdt.internal.compiler.Compiler.process(Compiler.java:838)
26-Jun-2018 00:42:00         at org.eclipse.jdt.internal.compiler.ProcessTaskManager.run(ProcessTaskManager.java:137)
26-Jun-2018 00:42:00         at java.lang.Thread.run(Thread.java:748)
26-Jun-2018 00:42:00 exception handling
26-Jun-2018 00:42:00 org.codehaus.groovy.control.MultipleCompilationErrorsException: startup failed:
26-Jun-2018 00:42:00
26-Jun-2018 00:42:00         at org.codehaus.groovy.control.ErrorCollector.failIfErrors(ErrorCollector.java:313)
26-Jun-2018 00:42:00         at org.codehaus.groovy.control.CompilationUnit.applyToSourceUnits(CompilationUnit.java:1027)
26-Jun-2018 00:42:00         at org.codehaus.groovy.control.CompilationUnit.compile(CompilationUnit.java:592)
26-Jun-2018 00:42:00         at org.codehaus.jdt.groovy.internal.compiler.ast.GroovyCompilationUnitDeclaration.processToPhase(GroovyCompilationUnitDeclaration.java:184)
26-Jun-2018 00:42:00         at org.codehaus.jdt.groovy.internal.compiler.ast.GroovyCompilationUnitDeclaration.resolve(GroovyCompilationUnitDeclaration.java:2098)
26-Jun-2018 00:42:00         at org.eclipse.jdt.internal.compiler.Compiler.process(Compiler.java:827)
26-Jun-2018 00:42:00         at org.eclipse.jdt.internal.compiler.ProcessTaskManager.run(ProcessTaskManager.java:137)
26-Jun-2018 00:42:00         at java.lang.Thread.run(Thread.java:748)
26-Jun-2018 00:42:00 exception handling
26-Jun-2018 00:42:00 org.codehaus.groovy.control.MultipleCompilationErrorsException: startup failed:
26-Jun-2018 00:42:00
26-Jun-2018 00:42:00         at org.codehaus.groovy.control.ErrorCollector.failIfErrors(ErrorCollector.java:313)
26-Jun-2018 00:42:00         at org.codehaus.groovy.control.CompilationUnit.applyToSourceUnits(CompilationUnit.java:1027)
26-Jun-2018 00:42:00         at org.codehaus.groovy.control.CompilationUnit.compile(CompilationUnit.java:592)
26-Jun-2018 00:42:00         at org.codehaus.jdt.groovy.internal.compiler.ast.GroovyCompilationUnitDeclaration.processToPhase(GroovyCompilationUnitDeclaration.java:184)
26-Jun-2018 00:42:00         at org.codehaus.jdt.groovy.internal.compiler.ast.GroovyCompilationUnitDeclaration.analyseCode(GroovyCompilationUnitDeclaration.java:2181)
26-Jun-2018 00:42:00         at org.eclipse.jdt.internal.compiler.Compiler.process(Compiler.java:833)
26-Jun-2018 00:42:00         at org.eclipse.jdt.internal.compiler.ProcessTaskManager.run(ProcessTaskManager.java:137)
26-Jun-2018 00:42:00         at java.lang.Thread.run(Thread.java:748)
26-Jun-2018 00:42:00 exception handling
26-Jun-2018 00:42:00 org.codehaus.groovy.control.MultipleCompilationErrorsException: startup failed:
26-Jun-2018 00:42:00
26-Jun-2018 00:42:00         at org.codehaus.groovy.control.ErrorCollector.failIfErrors(ErrorCollector.java:313)
26-Jun-2018 00:42:00         at org.codehaus.groovy.control.CompilationUnit.applyToSourceUnits(CompilationUnit.java:1027)
26-Jun-2018 00:42:00         at org.codehaus.groovy.control.CompilationUnit.compile(CompilationUnit.java:592)
26-Jun-2018 00:42:00         at org.codehaus.jdt.groovy.internal.compiler.ast.GroovyCompilationUnitDeclaration.processToPhase(GroovyCompilationUnitDeclaration.java:184)
26-Jun-2018 00:42:00         at org.codehaus.jdt.groovy.internal.compiler.ast.GroovyCompilationUnitDeclaration.generateCode(GroovyCompilationUnitDeclaration.java:1632)
26-Jun-2018 00:42:00         at org.eclipse.jdt.internal.compiler.Compiler.process(Compiler.java:838)
26-Jun-2018 00:42:00         at org.eclipse.jdt.internal.compiler.ProcessTaskManager.run(ProcessTaskManager.java:137)
26-Jun-2018 00:42:00         at java.lang.Thread.run(Thread.java:748)
26-Jun-2018 00:42:00 exception handling
26-Jun-2018 00:42:00 org.codehaus.groovy.control.MultipleCompilationErrorsException: startup failed:
26-Jun-2018 00:42:00
26-Jun-2018 00:42:00         at org.codehaus.groovy.control.ErrorCollector.failIfErrors(ErrorCollector.java:313)
26-Jun-2018 00:42:00         at org.codehaus.groovy.control.CompilationUnit.applyToSourceUnits(CompilationUnit.java:1027)
26-Jun-2018 00:42:00         at org.codehaus.groovy.control.CompilationUnit.compile(CompilationUnit.java:592)
26-Jun-2018 00:42:00         at org.codehaus.jdt.groovy.internal.compiler.ast.GroovyCompilationUnitDeclaration.processToPhase(GroovyCompilationUnitDeclaration.java:184)
26-Jun-2018 00:42:00         at org.codehaus.jdt.groovy.internal.compiler.ast.GroovyCompilationUnitDeclaration.resolve(GroovyCompilationUnitDeclaration.java:2098)
26-Jun-2018 00:42:00         at org.eclipse.jdt.internal.compiler.Compiler.process(Compiler.java:827)
26-Jun-2018 00:42:00         at org.eclipse.jdt.internal.compiler.ProcessTaskManager.run(ProcessTaskManager.java:137)
26-Jun-2018 00:42:00         at java.lang.Thread.run(Thread.java:748)
26-Jun-2018 00:42:00 exception handling
26-Jun-2018 00:42:00 org.codehaus.groovy.control.MultipleCompilationErrorsException: startup failed:
26-Jun-2018 00:42:00
26-Jun-2018 00:42:00         at org.codehaus.groovy.control.ErrorCollector.failIfErrors(ErrorCollector.java:313)
26-Jun-2018 00:42:00         at org.codehaus.groovy.control.CompilationUnit.applyToSourceUnits(CompilationUnit.java:1027)
26-Jun-2018 00:42:00         at org.codehaus.groovy.control.CompilationUnit.compile(CompilationUnit.java:592)
26-Jun-2018 00:42:00         at org.codehaus.jdt.groovy.internal.compiler.ast.GroovyCompilationUnitDeclaration.processToPhase(GroovyCompilationUnitDeclaration.java:184)
26-Jun-2018 00:42:00         at org.codehaus.jdt.groovy.internal.compiler.ast.GroovyCompilationUnitDeclaration.analyseCode(GroovyCompilationUnitDeclaration.java:2181)
26-Jun-2018 00:42:00         at org.eclipse.jdt.internal.compiler.Compiler.process(Compiler.java:833)
26-Jun-2018 00:42:00         at org.eclipse.jdt.internal.compiler.ProcessTaskManager.run(ProcessTaskManager.java:137)
26-Jun-2018 00:42:00         at java.lang.Thread.run(Thread.java:748)
26-Jun-2018 00:42:00 exception handling
26-Jun-2018 00:42:00 org.codehaus.groovy.control.MultipleCompilationErrorsException: startup failed:
26-Jun-2018 00:42:00
26-Jun-2018 00:42:00         at org.codehaus.groovy.control.ErrorCollector.failIfErrors(ErrorCollector.java:313)
26-Jun-2018 00:42:00         at org.codehaus.groovy.control.CompilationUnit.applyToSourceUnits(CompilationUnit.java:1027)
26-Jun-2018 00:42:00         at org.codehaus.groovy.control.CompilationUnit.compile(CompilationUnit.java:592)
26-Jun-2018 00:42:00         at org.codehaus.jdt.groovy.internal.compiler.ast.GroovyCompilationUnitDeclaration.processToPhase(GroovyCompilationUnitDeclaration.java:184)
26-Jun-2018 00:42:00         at org.codehaus.jdt.groovy.internal.compiler.ast.GroovyCompilationUnitDeclaration.generateCode(GroovyCompilationUnitDeclaration.java:1632)
26-Jun-2018 00:42:00         at org.eclipse.jdt.internal.compiler.Compiler.process(Compiler.java:838)
26-Jun-2018 00:42:00         at org.eclipse.jdt.internal.compiler.ProcessTaskManager.run(ProcessTaskManager.java:137)
26-Jun-2018 00:42:00         at java.lang.Thread.run(Thread.java:748)
26-Jun-2018 00:42:00 exception handling
26-Jun-2018 00:42:00 org.codehaus.groovy.control.MultipleCompilationErrorsException: startup failed:
26-Jun-2018 00:42:00
26-Jun-2018 00:42:00         at org.codehaus.groovy.control.ErrorCollector.failIfErrors(ErrorCollector.java:313)
26-Jun-2018 00:42:00         at org.codehaus.groovy.control.CompilationUnit.applyToSourceUnits(CompilationUnit.java:1027)
26-Jun-2018 00:42:00         at org.codehaus.groovy.control.CompilationUnit.compile(CompilationUnit.java:592)
26-Jun-2018 00:42:00         at org.codehaus.jdt.groovy.internal.compiler.ast.GroovyCompilationUnitDeclaration.processToPhase(GroovyCompilationUnitDeclaration.java:184)
26-Jun-2018 00:42:00         at org.codehaus.jdt.groovy.internal.compiler.ast.GroovyCompilationUnitDeclaration.resolve(GroovyCompilationUnitDeclaration.java:2098)
26-Jun-2018 00:42:00         at org.eclipse.jdt.internal.compiler.Compiler.process(Compiler.java:827)
26-Jun-2018 00:42:00         at org.eclipse.jdt.internal.compiler.ProcessTaskManager.run(ProcessTaskManager.java:137)
26-Jun-2018 00:42:00         at java.lang.Thread.run(Thread.java:748)
26-Jun-2018 00:42:00 exception handling
26-Jun-2018 00:42:00 org.codehaus.groovy.control.MultipleCompilationErrorsException: startup failed:
26-Jun-2018 00:42:00
26-Jun-2018 00:42:00         at org.codehaus.groovy.control.ErrorCollector.failIfErrors(ErrorCollector.java:313)
26-Jun-2018 00:42:00         at org.codehaus.groovy.control.CompilationUnit.applyToSourceUnits(CompilationUnit.java:1027)
26-Jun-2018 00:42:00         at org.codehaus.groovy.control.CompilationUnit.compile(CompilationUnit.java:592)
26-Jun-2018 00:42:00         at org.codehaus.jdt.groovy.internal.compiler.ast.GroovyCompilationUnitDeclaration.processToPhase(GroovyCompilationUnitDeclaration.java:184)
26-Jun-2018 00:42:00         at org.codehaus.jdt.groovy.internal.compiler.ast.GroovyCompilationUnitDeclaration.analyseCode(GroovyCompilationUnitDeclaration.java:2181)
26-Jun-2018 00:42:00         at org.eclipse.jdt.internal.compiler.Compiler.process(Compiler.java:833)
26-Jun-2018 00:42:00         at org.eclipse.jdt.internal.compiler.ProcessTaskManager.run(ProcessTaskManager.java:137)
26-Jun-2018 00:42:00         at java.lang.Thread.run(Thread.java:748)
26-Jun-2018 00:42:00 exception handling
26-Jun-2018 00:42:00 org.codehaus.groovy.control.MultipleCompilationErrorsException: startup failed:
26-Jun-2018 00:42:00
26-Jun-2018 00:42:00         at org.codehaus.groovy.control.ErrorCollector.failIfErrors(ErrorCollector.java:313)
26-Jun-2018 00:42:00         at org.codehaus.groovy.control.CompilationUnit.applyToSourceUnits(CompilationUnit.java:1027)
26-Jun-2018 00:42:00         at org.codehaus.groovy.control.CompilationUnit.compile(CompilationUnit.java:592)
26-Jun-2018 00:42:00         at org.codehaus.jdt.groovy.internal.compiler.ast.GroovyCompilationUnitDeclaration.processToPhase(GroovyCompilationUnitDeclaration.java:184)
26-Jun-2018 00:42:00         at org.codehaus.jdt.groovy.internal.compiler.ast.GroovyCompilationUnitDeclaration.generateCode(GroovyCompilationUnitDeclaration.java:1632)
26-Jun-2018 00:42:00         at org.eclipse.jdt.internal.compiler.Compiler.process(Compiler.java:838)
26-Jun-2018 00:42:00         at org.eclipse.jdt.internal.compiler.ProcessTaskManager.run(ProcessTaskManager.java:137)
26-Jun-2018 00:42:00         at java.lang.Thread.run(Thread.java:748)
26-Jun-2018 00:42:00 exception handling
26-Jun-2018 00:42:00 org.codehaus.groovy.control.MultipleCompilationErrorsException: startup failed:
26-Jun-2018 00:42:00
26-Jun-2018 00:42:00         at org.codehaus.groovy.control.ErrorCollector.failIfErrors(ErrorCollector.java:313)
26-Jun-2018 00:42:00         at org.codehaus.groovy.control.CompilationUnit.applyToSourceUnits(CompilationUnit.java:1027)
26-Jun-2018 00:42:00         at org.codehaus.groovy.control.CompilationUnit.compile(CompilationUnit.java:592)
26-Jun-2018 00:42:00         at org.codehaus.jdt.groovy.internal.compiler.ast.GroovyCompilationUnitDeclaration.processToPhase(GroovyCompilationUnitDeclaration.java:184)
26-Jun-2018 00:42:00         at org.codehaus.jdt.groovy.internal.compiler.ast.GroovyCompilationUnitDeclaration.resolve(GroovyCompilationUnitDeclaration.java:2098)
26-Jun-2018 00:42:00         at org.eclipse.jdt.internal.compiler.Compiler.process(Compiler.java:827)
26-Jun-2018 00:42:00         at org.eclipse.jdt.internal.compiler.ProcessTaskManager.run(ProcessTaskManager.java:137)
26-Jun-2018 00:42:00         at java.lang.Thread.run(Thread.java:748)
26-Jun-2018 00:42:00 exception handling
26-Jun-2018 00:42:00 org.codehaus.groovy.control.MultipleCompilationErrorsException: startup failed:
26-Jun-2018 00:42:00
26-Jun-2018 00:42:00         at org.codehaus.groovy.control.ErrorCollector.failIfErrors(ErrorCollector.java:313)
26-Jun-2018 00:42:00         at org.codehaus.groovy.control.CompilationUnit.applyToSourceUnits(CompilationUnit.java:1027)
26-Jun-2018 00:42:00         at org.codehaus.groovy.control.CompilationUnit.compile(CompilationUnit.java:592)
26-Jun-2018 00:42:00         at org.codehaus.jdt.groovy.internal.compiler.ast.GroovyCompilationUnitDeclaration.processToPhase(GroovyCompilationUnitDeclaration.java:184)
26-Jun-2018 00:42:00         at org.codehaus.jdt.groovy.internal.compiler.ast.GroovyCompilationUnitDeclaration.analyseCode(GroovyCompilationUnitDeclaration.java:2181)
26-Jun-2018 00:42:00         at org.eclipse.jdt.internal.compiler.Compiler.process(Compiler.java:833)
26-Jun-2018 00:42:00         at org.eclipse.jdt.internal.compiler.ProcessTaskManager.run(ProcessTaskManager.java:137)
26-Jun-2018 00:42:00         at java.lang.Thread.run(Thread.java:748)
26-Jun-2018 00:42:00 exception handling
26-Jun-2018 00:42:00 org.codehaus.groovy.control.MultipleCompilationErrorsException: startup failed:
26-Jun-2018 00:42:00
26-Jun-2018 00:42:00         at org.codehaus.groovy.control.ErrorCollector.failIfErrors(ErrorCollector.java:313)
26-Jun-2018 00:42:00         at org.codehaus.groovy.control.CompilationUnit.applyToSourceUnits(CompilationUnit.java:1027)
26-Jun-2018 00:42:00         at org.codehaus.groovy.control.CompilationUnit.compile(CompilationUnit.java:592)
26-Jun-2018 00:42:00         at org.codehaus.jdt.groovy.internal.compiler.ast.GroovyCompilationUnitDeclaration.processToPhase(GroovyCompilationUnitDeclaration.java:184)
26-Jun-2018 00:42:00         at org.codehaus.jdt.groovy.internal.compiler.ast.GroovyCompilationUnitDeclaration.generateCode(GroovyCompilationUnitDeclaration.java:1632)
26-Jun-2018 00:42:00         at org.eclipse.jdt.internal.compiler.Compiler.process(Compiler.java:838)
26-Jun-2018 00:42:00         at org.eclipse.jdt.internal.compiler.ProcessTaskManager.run(ProcessTaskManager.java:137)
26-Jun-2018 00:42:00         at java.lang.Thread.run(Thread.java:748)
26-Jun-2018 00:42:00 exception handling
26-Jun-2018 00:42:00 org.codehaus.groovy.control.MultipleCompilationErrorsException: startup failed:
26-Jun-2018 00:42:00
26-Jun-2018 00:42:00         at org.codehaus.groovy.control.ErrorCollector.failIfErrors(ErrorCollector.java:313)
26-Jun-2018 00:42:00         at org.codehaus.groovy.control.CompilationUnit.applyToSourceUnits(CompilationUnit.java:1027)
26-Jun-2018 00:42:00         at org.codehaus.groovy.control.CompilationUnit.compile(CompilationUnit.java:592)
26-Jun-2018 00:42:00         at org.codehaus.jdt.groovy.internal.compiler.ast.GroovyCompilationUnitDeclaration.processToPhase(GroovyCompilationUnitDeclaration.java:184)
26-Jun-2018 00:42:00         at org.codehaus.jdt.groovy.internal.compiler.ast.GroovyCompilationUnitDeclaration.resolve(GroovyCompilationUnitDeclaration.java:2098)
26-Jun-2018 00:42:00         at org.eclipse.jdt.internal.compiler.Compiler.process(Compiler.java:827)
26-Jun-2018 00:42:00         at org.eclipse.jdt.internal.compiler.ProcessTaskManager.run(ProcessTaskManager.java:137)
26-Jun-2018 00:42:00         at java.lang.Thread.run(Thread.java:748)
26-Jun-2018 00:42:00 exception handling
26-Jun-2018 00:42:00 org.codehaus.groovy.control.MultipleCompilationErrorsException: startup failed:
26-Jun-2018 00:42:00
26-Jun-2018 00:42:00         at org.codehaus.groovy.control.ErrorCollector.failIfErrors(ErrorCollector.java:313)
26-Jun-2018 00:42:00         at org.codehaus.groovy.control.CompilationUnit.applyToSourceUnits(CompilationUnit.java:1027)
26-Jun-2018 00:42:00         at org.codehaus.groovy.control.CompilationUnit.compile(CompilationUnit.java:592)
26-Jun-2018 00:42:00         at org.codehaus.jdt.groovy.internal.compiler.ast.GroovyCompilationUnitDeclaration.processToPhase(GroovyCompilationUnitDeclaration.java:184)
26-Jun-2018 00:42:00         at org.codehaus.jdt.groovy.internal.compiler.ast.GroovyCompilationUnitDeclaration.analyseCode(GroovyCompilationUnitDeclaration.java:2181)
26-Jun-2018 00:42:00         at org.eclipse.jdt.internal.compiler.Compiler.process(Compiler.java:833)
26-Jun-2018 00:42:00         at org.eclipse.jdt.internal.compiler.ProcessTaskManager.run(ProcessTaskManager.java:137)
26-Jun-2018 00:42:00         at java.lang.Thread.run(Thread.java:748)
26-Jun-2018 00:42:00 exception handling
26-Jun-2018 00:42:00 org.codehaus.groovy.control.MultipleCompilationErrorsException: startup failed:
26-Jun-2018 00:42:00
26-Jun-2018 00:42:00         at org.codehaus.groovy.control.ErrorCollector.failIfErrors(ErrorCollector.java:313)
26-Jun-2018 00:42:00         at org.codehaus.groovy.control.CompilationUnit.applyToSourceUnits(CompilationUnit.java:1027)
26-Jun-2018 00:42:00         at org.codehaus.groovy.control.CompilationUnit.compile(CompilationUnit.java:592)
26-Jun-2018 00:42:00         at org.codehaus.jdt.groovy.internal.compiler.ast.GroovyCompilationUnitDeclaration.processToPhase(GroovyCompilationUnitDeclaration.java:184)
26-Jun-2018 00:42:00         at org.codehaus.jdt.groovy.internal.compiler.ast.GroovyCompilationUnitDeclaration.generateCode(GroovyCompilationUnitDeclaration.java:1632)
26-Jun-2018 00:42:00         at org.eclipse.jdt.internal.compiler.Compiler.process(Compiler.java:838)
26-Jun-2018 00:42:00         at org.eclipse.jdt.internal.compiler.ProcessTaskManager.run(ProcessTaskManager.java:137)
26-Jun-2018 00:42:00         at java.lang.Thread.run(Thread.java:748)
26-Jun-2018 00:42:00 exception handling
26-Jun-2018 00:42:00 org.codehaus.groovy.control.MultipleCompilationErrorsException: startup failed:
26-Jun-2018 00:42:00
26-Jun-2018 00:42:00         at org.codehaus.groovy.control.ErrorCollector.failIfErrors(ErrorCollector.java:313)
26-Jun-2018 00:42:00         at org.codehaus.groovy.control.CompilationUnit.applyToSourceUnits(CompilationUnit.java:1027)
26-Jun-2018 00:42:00         at org.codehaus.groovy.control.CompilationUnit.compile(CompilationUnit.java:592)
26-Jun-2018 00:42:00         at org.codehaus.jdt.groovy.internal.compiler.ast.GroovyCompilationUnitDeclaration.processToPhase(GroovyCompilationUnitDeclaration.java:184)
26-Jun-2018 00:42:00         at org.codehaus.jdt.groovy.internal.compiler.ast.GroovyCompilationUnitDeclaration.resolve(GroovyCompilationUnitDeclaration.java:2098)
26-Jun-2018 00:42:00         at org.eclipse.jdt.internal.compiler.Compiler.process(Compiler.java:827)
26-Jun-2018 00:42:00         at org.eclipse.jdt.internal.compiler.ProcessTaskManager.run(ProcessTaskManager.java:137)
26-Jun-2018 00:42:00         at java.lang.Thread.run(Thread.java:748)
26-Jun-2018 00:42:00 exception handling
26-Jun-2018 00:42:00 org.codehaus.groovy.control.MultipleCompilationErrorsException: startup failed:
26-Jun-2018 00:42:00
26-Jun-2018 00:42:00         at org.codehaus.groovy.control.ErrorCollector.failIfErrors(ErrorCollector.java:313)
26-Jun-2018 00:42:00         at org.codehaus.groovy.control.CompilationUnit.applyToSourceUnits(CompilationUnit.java:1027)
26-Jun-2018 00:42:00         at org.codehaus.groovy.control.CompilationUnit.compile(CompilationUnit.java:592)
26-Jun-2018 00:42:00         at org.codehaus.jdt.groovy.internal.compiler.ast.GroovyCompilationUnitDeclaration.processToPhase(GroovyCompilationUnitDeclaration.java:184)
26-Jun-2018 00:42:00         at org.codehaus.jdt.groovy.internal.compiler.ast.GroovyCompilationUnitDeclaration.analyseCode(GroovyCompilationUnitDeclaration.java:2181)
26-Jun-2018 00:42:00         at org.eclipse.jdt.internal.compiler.Compiler.process(Compiler.java:833)
26-Jun-2018 00:42:00         at org.eclipse.jdt.internal.compiler.ProcessTaskManager.run(ProcessTaskManager.java:137)
26-Jun-2018 00:42:00         at java.lang.Thread.run(Thread.java:748)
26-Jun-2018 00:42:00 exception handling
26-Jun-2018 00:42:00 org.codehaus.groovy.control.MultipleCompilationErrorsException: startup failed:
26-Jun-2018 00:42:00
26-Jun-2018 00:42:00         at org.codehaus.groovy.control.ErrorCollector.failIfErrors(ErrorCollector.java:313)
26-Jun-2018 00:42:00         at org.codehaus.groovy.control.CompilationUnit.applyToSourceUnits(CompilationUnit.java:1027)
26-Jun-2018 00:42:00         at org.codehaus.groovy.control.CompilationUnit.compile(CompilationUnit.java:592)
26-Jun-2018 00:42:00         at org.codehaus.jdt.groovy.internal.compiler.ast.GroovyCompilationUnitDeclaration.processToPhase(GroovyCompilationUnitDeclaration.java:184)
26-Jun-2018 00:42:00         at org.codehaus.jdt.groovy.internal.compiler.ast.GroovyCompilationUnitDeclaration.generateCode(GroovyCompilationUnitDeclaration.java:1632)
26-Jun-2018 00:42:00         at org.eclipse.jdt.internal.compiler.Compiler.process(Compiler.java:838)
26-Jun-2018 00:42:00         at org.eclipse.jdt.internal.compiler.ProcessTaskManager.run(ProcessTaskManager.java:137)
26-Jun-2018 00:42:00         at java.lang.Thread.run(Thread.java:748)
26-Jun-2018 00:42:00 exception handling
26-Jun-2018 00:42:00 org.codehaus.groovy.control.MultipleCompilationErrorsException: startup failed:
26-Jun-2018 00:42:00
26-Jun-2018 00:42:00         at org.codehaus.groovy.control.ErrorCollector.failIfErrors(ErrorCollector.java:313)
26-Jun-2018 00:42:00         at org.codehaus.groovy.control.CompilationUnit.applyToSourceUnits(CompilationUnit.java:1027)
26-Jun-2018 00:42:00         at org.codehaus.groovy.control.CompilationUnit.compile(CompilationUnit.java:592)
26-Jun-2018 00:42:00         at org.codehaus.jdt.groovy.internal.compiler.ast.GroovyCompilationUnitDeclaration.processToPhase(GroovyCompilationUnitDeclaration.java:184)
26-Jun-2018 00:42:00         at org.codehaus.jdt.groovy.internal.compiler.ast.GroovyCompilationUnitDeclaration.resolve(GroovyCompilationUnitDeclaration.java:2098)
26-Jun-2018 00:42:00         at org.eclipse.jdt.internal.compiler.Compiler.process(Compiler.java:827)
26-Jun-2018 00:42:00         at org.eclipse.jdt.internal.compiler.ProcessTaskManager.run(ProcessTaskManager.java:137)
26-Jun-2018 00:42:00         at java.lang.Thread.run(Thread.java:748)
26-Jun-2018 00:42:00 exception handling
26-Jun-2018 00:42:00 org.codehaus.groovy.control.MultipleCompilationErrorsException: startup failed:
26-Jun-2018 00:42:00
26-Jun-2018 00:42:00         at org.codehaus.groovy.control.ErrorCollector.failIfErrors(ErrorCollector.java:313)
26-Jun-2018 00:42:00         at org.codehaus.groovy.control.CompilationUnit.applyToSourceUnits(CompilationUnit.java:1027)
26-Jun-2018 00:42:00         at org.codehaus.groovy.control.CompilationUnit.compile(CompilationUnit.java:592)
26-Jun-2018 00:42:00         at org.codehaus.jdt.groovy.internal.compiler.ast.GroovyCompilationUnitDeclaration.processToPhase(GroovyCompilationUnitDeclaration.java:184)
26-Jun-2018 00:42:00         at org.codehaus.jdt.groovy.internal.compiler.ast.GroovyCompilationUnitDeclaration.analyseCode(GroovyCompilationUnitDeclaration.java:2181)
26-Jun-2018 00:42:00         at org.eclipse.jdt.internal.compiler.Compiler.process(Compiler.java:833)
26-Jun-2018 00:42:00         at org.eclipse.jdt.internal.compiler.ProcessTaskManager.run(ProcessTaskManager.java:137)
26-Jun-2018 00:42:00         at java.lang.Thread.run(Thread.java:748)
26-Jun-2018 00:42:00 exception handling
26-Jun-2018 00:42:00 org.codehaus.groovy.control.MultipleCompilationErrorsException: startup failed:
26-Jun-2018 00:42:00
26-Jun-2018 00:42:00         at org.codehaus.groovy.control.ErrorCollector.failIfErrors(ErrorCollector.java:313)
26-Jun-2018 00:42:00         at org.codehaus.groovy.control.CompilationUnit.applyToSourceUnits(CompilationUnit.java:1027)
26-Jun-2018 00:42:00         at org.codehaus.groovy.control.CompilationUnit.compile(CompilationUnit.java:592)
26-Jun-2018 00:42:00         at org.codehaus.jdt.groovy.internal.compiler.ast.GroovyCompilationUnitDeclaration.processToPhase(GroovyCompilationUnitDeclaration.java:184)
26-Jun-2018 00:42:00         at org.codehaus.jdt.groovy.internal.compiler.ast.GroovyCompilationUnitDeclaration.generateCode(GroovyCompilationUnitDeclaration.java:1632)
26-Jun-2018 00:42:00         at org.eclipse.jdt.internal.compiler.Compiler.process(Compiler.java:838)
26-Jun-2018 00:42:00         at org.eclipse.jdt.internal.compiler.ProcessTaskManager.run(ProcessTaskManager.java:137)
26-Jun-2018 00:42:00         at java.lang.Thread.run(Thread.java:748)
26-Jun-2018 00:42:00 exception handling
26-Jun-2018 00:42:00 org.codehaus.groovy.control.MultipleCompilationErrorsException: startup failed:
26-Jun-2018 00:42:00
26-Jun-2018 00:42:00         at org.codehaus.groovy.control.ErrorCollector.failIfErrors(ErrorCollector.java:313)
26-Jun-2018 00:42:00         at org.codehaus.groovy.control.CompilationUnit.applyToSourceUnits(CompilationUnit.java:1027)
26-Jun-2018 00:42:00         at org.codehaus.groovy.control.CompilationUnit.compile(CompilationUnit.java:592)
26-Jun-2018 00:42:00         at org.codehaus.jdt.groovy.internal.compiler.ast.GroovyCompilationUnitDeclaration.processToPhase(GroovyCompilationUnitDeclaration.java:184)
26-Jun-2018 00:42:00         at org.codehaus.jdt.groovy.internal.compiler.ast.GroovyCompilationUnitDeclaration.resolve(GroovyCompilationUnitDeclaration.java:2098)
26-Jun-2018 00:42:00         at org.eclipse.jdt.internal.compiler.Compiler.process(Compiler.java:827)
26-Jun-2018 00:42:00         at org.eclipse.jdt.internal.compiler.ProcessTaskManager.run(ProcessTaskManager.java:137)
26-Jun-2018 00:42:00         at java.lang.Thread.run(Thread.java:748)
26-Jun-2018 00:42:00 exception handling
26-Jun-2018 00:42:00 org.codehaus.groovy.control.MultipleCompilationErrorsException: startup failed:
26-Jun-2018 00:42:00
26-Jun-2018 00:42:00         at org.codehaus.groovy.control.ErrorCollector.failIfErrors(ErrorCollector.java:313)
26-Jun-2018 00:42:00         at org.codehaus.groovy.control.CompilationUnit.applyToSourceUnits(CompilationUnit.java:1027)
26-Jun-2018 00:42:00         at org.codehaus.groovy.control.CompilationUnit.compile(CompilationUnit.java:592)
26-Jun-2018 00:42:00         at org.codehaus.jdt.groovy.internal.compiler.ast.GroovyCompilationUnitDeclaration.processToPhase(GroovyCompilationUnitDeclaration.java:184)
26-Jun-2018 00:42:00         at org.codehaus.jdt.groovy.internal.compiler.ast.GroovyCompilationUnitDeclaration.analyseCode(GroovyCompilationUnitDeclaration.java:2181)
26-Jun-2018 00:42:00         at org.eclipse.jdt.internal.compiler.Compiler.process(Compiler.java:833)
26-Jun-2018 00:42:00         at org.eclipse.jdt.internal.compiler.ProcessTaskManager.run(ProcessTaskManager.java:137)
26-Jun-2018 00:42:00         at java.lang.Thread.run(Thread.java:748)
26-Jun-2018 00:42:00 exception handling
26-Jun-2018 00:42:00 org.codehaus.groovy.control.MultipleCompilationErrorsException: startup failed:
26-Jun-2018 00:42:00
26-Jun-2018 00:42:00         at org.codehaus.groovy.control.ErrorCollector.failIfErrors(ErrorCollector.java:313)
26-Jun-2018 00:42:00         at org.codehaus.groovy.control.CompilationUnit.applyToSourceUnits(CompilationUnit.java:1027)
26-Jun-2018 00:42:00         at org.codehaus.groovy.control.CompilationUnit.compile(CompilationUnit.java:592)
26-Jun-2018 00:42:00         at org.codehaus.jdt.groovy.internal.compiler.ast.GroovyCompilationUnitDeclaration.processToPhase(GroovyCompilationUnitDeclaration.java:184)
26-Jun-2018 00:42:00         at org.codehaus.jdt.groovy.internal.compiler.ast.GroovyCompilationUnitDeclaration.generateCode(GroovyCompilationUnitDeclaration.java:1632)
26-Jun-2018 00:42:00         at org.eclipse.jdt.internal.compiler.Compiler.process(Compiler.java:838)
26-Jun-2018 00:42:00         at org.eclipse.jdt.internal.compiler.ProcessTaskManager.run(ProcessTaskManager.java:137)
26-Jun-2018 00:42:00         at java.lang.Thread.run(Thread.java:748)
26-Jun-2018 00:42:00 exception handling
26-Jun-2018 00:42:00 org.codehaus.groovy.control.MultipleCompilationErrorsException: startup failed:
26-Jun-2018 00:42:00
26-Jun-2018 00:42:00         at org.codehaus.groovy.control.ErrorCollector.failIfErrors(ErrorCollector.java:313)
26-Jun-2018 00:42:00         at org.codehaus.groovy.control.CompilationUnit.applyToSourceUnits(CompilationUnit.java:1027)
26-Jun-2018 00:42:00         at org.codehaus.groovy.control.CompilationUnit.compile(CompilationUnit.java:592)
26-Jun-2018 00:42:00         at org.codehaus.jdt.groovy.internal.compiler.ast.GroovyCompilationUnitDeclaration.processToPhase(GroovyCompilationUnitDeclaration.java:184)
26-Jun-2018 00:42:00         at org.codehaus.jdt.groovy.internal.compiler.ast.GroovyCompilationUnitDeclaration.resolve(GroovyCompilationUnitDeclaration.java:2098)
26-Jun-2018 00:42:00         at org.eclipse.jdt.internal.compiler.Compiler.process(Compiler.java:827)
26-Jun-2018 00:42:00         at org.eclipse.jdt.internal.compiler.ProcessTaskManager.run(ProcessTaskManager.java:137)
26-Jun-2018 00:42:00         at java.lang.Thread.run(Thread.java:748)
26-Jun-2018 00:42:00 exception handling
26-Jun-2018 00:42:00 org.codehaus.groovy.control.MultipleCompilationErrorsException: startup failed:
26-Jun-2018 00:42:00
26-Jun-2018 00:42:00         at org.codehaus.groovy.control.ErrorCollector.failIfErrors(ErrorCollector.java:313)
26-Jun-2018 00:42:00         at org.codehaus.groovy.control.CompilationUnit.applyToSourceUnits(CompilationUnit.java:1027)
26-Jun-2018 00:42:00         at org.codehaus.groovy.control.CompilationUnit.compile(CompilationUnit.java:592)
26-Jun-2018 00:42:00         at org.codehaus.jdt.groovy.internal.compiler.ast.GroovyCompilationUnitDeclaration.processToPhase(GroovyCompilationUnitDeclaration.java:184)
26-Jun-2018 00:42:00         at org.codehaus.jdt.groovy.internal.compiler.ast.GroovyCompilationUnitDeclaration.analyseCode(GroovyCompilationUnitDeclaration.java:2181)
26-Jun-2018 00:42:00         at org.eclipse.jdt.internal.compiler.Compiler.process(Compiler.java:833)
26-Jun-2018 00:42:00         at org.eclipse.jdt.internal.compiler.ProcessTaskManager.run(ProcessTaskManager.java:137)
26-Jun-2018 00:42:00         at java.lang.Thread.run(Thread.java:748)
26-Jun-2018 00:42:00 exception handling
26-Jun-2018 00:42:00 org.codehaus.groovy.control.MultipleCompilationErrorsException: startup failed:
26-Jun-2018 00:42:00
26-Jun-2018 00:42:00         at org.codehaus.groovy.control.ErrorCollector.failIfErrors(ErrorCollector.java:313)
26-Jun-2018 00:42:00         at org.codehaus.groovy.control.CompilationUnit.applyToSourceUnits(CompilationUnit.java:1027)
26-Jun-2018 00:42:00         at org.codehaus.groovy.control.CompilationUnit.compile(CompilationUnit.java:592)
26-Jun-2018 00:42:00         at org.codehaus.jdt.groovy.internal.compiler.ast.GroovyCompilationUnitDeclaration.processToPhase(GroovyCompilationUnitDeclaration.java:184)
26-Jun-2018 00:42:00         at org.codehaus.jdt.groovy.internal.compiler.ast.GroovyCompilationUnitDeclaration.generateCode(GroovyCompilationUnitDeclaration.java:1632)
26-Jun-2018 00:42:00         at org.eclipse.jdt.internal.compiler.Compiler.process(Compiler.java:838)
26-Jun-2018 00:42:00         at org.eclipse.jdt.internal.compiler.ProcessTaskManager.run(ProcessTaskManager.java:137)
26-Jun-2018 00:42:00         at java.lang.Thread.run(Thread.java:748)
26-Jun-2018 00:42:00 exception handling
26-Jun-2018 00:42:00 org.codehaus.groovy.control.MultipleCompilationErrorsException: startup failed:
26-Jun-2018 00:42:00
26-Jun-2018 00:42:00         at org.codehaus.groovy.control.ErrorCollector.failIfErrors(ErrorCollector.java:313)
26-Jun-2018 00:42:00         at org.codehaus.groovy.control.CompilationUnit.applyToSourceUnits(CompilationUnit.java:1027)
26-Jun-2018 00:42:00         at org.codehaus.groovy.control.CompilationUnit.compile(CompilationUnit.java:592)
26-Jun-2018 00:42:00         at org.codehaus.jdt.groovy.internal.compiler.ast.GroovyCompilationUnitDeclaration.processToPhase(GroovyCompilationUnitDeclaration.java:184)
26-Jun-2018 00:42:00         at org.codehaus.jdt.groovy.internal.compiler.ast.GroovyCompilationUnitDeclaration.resolve(GroovyCompilationUnitDeclaration.java:2098)
26-Jun-2018 00:42:00         at org.eclipse.jdt.internal.compiler.Compiler.process(Compiler.java:827)
26-Jun-2018 00:42:00         at org.eclipse.jdt.internal.compiler.ProcessTaskManager.run(ProcessTaskManager.java:137)
26-Jun-2018 00:42:00         at java.lang.Thread.run(Thread.java:748)
26-Jun-2018 00:42:00 exception handling
26-Jun-2018 00:42:00 org.codehaus.groovy.control.MultipleCompilationErrorsException: startup failed:
26-Jun-2018 00:42:00
26-Jun-2018 00:42:00         at org.codehaus.groovy.control.ErrorCollector.failIfErrors(ErrorCollector.java:313)
26-Jun-2018 00:42:00         at org.codehaus.groovy.control.CompilationUnit.applyToSourceUnits(CompilationUnit.java:1027)
26-Jun-2018 00:42:00         at org.codehaus.groovy.control.CompilationUnit.compile(CompilationUnit.java:592)
26-Jun-2018 00:42:00         at org.codehaus.jdt.groovy.internal.compiler.ast.GroovyCompilationUnitDeclaration.processToPhase(GroovyCompilationUnitDeclaration.java:184)
26-Jun-2018 00:42:00         at org.codehaus.jdt.groovy.internal.compiler.ast.GroovyCompilationUnitDeclaration.analyseCode(GroovyCompilationUnitDeclaration.java:2181)
26-Jun-2018 00:42:00         at org.eclipse.jdt.internal.compiler.Compiler.process(Compiler.java:833)
26-Jun-2018 00:42:00         at org.eclipse.jdt.internal.compiler.ProcessTaskManager.run(ProcessTaskManager.java:137)
26-Jun-2018 00:42:00         at java.lang.Thread.run(Thread.java:748)
26-Jun-2018 00:42:00 exception handling
26-Jun-2018 00:42:00 org.codehaus.groovy.control.MultipleCompilationErrorsException: startup failed:
26-Jun-2018 00:42:00
26-Jun-2018 00:42:00         at org.codehaus.groovy.control.ErrorCollector.failIfErrors(ErrorCollector.java:313)
26-Jun-2018 00:42:00         at org.codehaus.groovy.control.CompilationUnit.applyToSourceUnits(CompilationUnit.java:1027)
26-Jun-2018 00:42:00         at org.codehaus.groovy.control.CompilationUnit.compile(CompilationUnit.java:592)
26-Jun-2018 00:42:00         at org.codehaus.jdt.groovy.internal.compiler.ast.GroovyCompilationUnitDeclaration.processToPhase(GroovyCompilationUnitDeclaration.java:184)
26-Jun-2018 00:42:00         at org.codehaus.jdt.groovy.internal.compiler.ast.GroovyCompilationUnitDeclaration.generateCode(GroovyCompilationUnitDeclaration.java:1632)
26-Jun-2018 00:42:00         at org.eclipse.jdt.internal.compiler.Compiler.process(Compiler.java:838)
26-Jun-2018 00:42:00         at org.eclipse.jdt.internal.compiler.ProcessTaskManager.run(ProcessTaskManager.java:137)
26-Jun-2018 00:42:00         at java.lang.Thread.run(Thread.java:748)
26-Jun-2018 00:42:00 exception handling
26-Jun-2018 00:42:00 org.codehaus.groovy.control.MultipleCompilationErrorsException: startup failed:
26-Jun-2018 00:42:00
26-Jun-2018 00:42:00         at org.codehaus.groovy.control.ErrorCollector.failIfErrors(ErrorCollector.java:313)
26-Jun-2018 00:42:00         at org.codehaus.groovy.control.CompilationUnit.applyToSourceUnits(CompilationUnit.java:1027)
26-Jun-2018 00:42:00         at org.codehaus.groovy.control.CompilationUnit.compile(CompilationUnit.java:592)
26-Jun-2018 00:42:00         at org.codehaus.jdt.groovy.internal.compiler.ast.GroovyCompilationUnitDeclaration.processToPhase(GroovyCompilationUnitDeclaration.java:184)
26-Jun-2018 00:42:00         at org.codehaus.jdt.groovy.internal.compiler.ast.GroovyCompilationUnitDeclaration.resolve(GroovyCompilationUnitDeclaration.java:2098)
26-Jun-2018 00:42:00         at org.eclipse.jdt.internal.compiler.Compiler.process(Compiler.java:827)
26-Jun-2018 00:42:00         at org.eclipse.jdt.internal.compiler.ProcessTaskManager.run(ProcessTaskManager.java:137)
26-Jun-2018 00:42:00         at java.lang.Thread.run(Thread.java:748)
26-Jun-2018 00:42:00 exception handling
26-Jun-2018 00:42:00 org.codehaus.groovy.control.MultipleCompilationErrorsException: startup failed:
26-Jun-2018 00:42:00
26-Jun-2018 00:42:00         at org.codehaus.groovy.control.ErrorCollector.failIfErrors(ErrorCollector.java:313)
26-Jun-2018 00:42:00         at org.codehaus.groovy.control.CompilationUnit.applyToSourceUnits(CompilationUnit.java:1027)
26-Jun-2018 00:42:00         at org.codehaus.groovy.control.CompilationUnit.compile(CompilationUnit.java:592)
26-Jun-2018 00:42:00         at org.codehaus.jdt.groovy.internal.compiler.ast.GroovyCompilationUnitDeclaration.processToPhase(GroovyCompilationUnitDeclaration.java:184)
26-Jun-2018 00:42:00         at org.codehaus.jdt.groovy.internal.compiler.ast.GroovyCompilationUnitDeclaration.analyseCode(GroovyCompilationUnitDeclaration.java:2181)
26-Jun-2018 00:42:00         at org.eclipse.jdt.internal.compiler.Compiler.process(Compiler.java:833)
26-Jun-2018 00:42:00         at org.eclipse.jdt.internal.compiler.ProcessTaskManager.run(ProcessTaskManager.java:137)
26-Jun-2018 00:42:00         at java.lang.Thread.run(Thread.java:748)
26-Jun-2018 00:42:00 exception handling
26-Jun-2018 00:42:00 org.codehaus.groovy.control.MultipleCompilationErrorsException: startup failed:
26-Jun-2018 00:42:00
26-Jun-2018 00:42:00         at org.codehaus.groovy.control.ErrorCollector.failIfErrors(ErrorCollector.java:313)
26-Jun-2018 00:42:00         at org.codehaus.groovy.control.CompilationUnit.applyToSourceUnits(CompilationUnit.java:1027)
26-Jun-2018 00:42:00         at org.codehaus.groovy.control.CompilationUnit.compile(CompilationUnit.java:592)
26-Jun-2018 00:42:00         at org.codehaus.jdt.groovy.internal.compiler.ast.GroovyCompilationUnitDeclaration.processToPhase(GroovyCompilationUnitDeclaration.java:184)
26-Jun-2018 00:42:00         at org.codehaus.jdt.groovy.internal.compiler.ast.GroovyCompilationUnitDeclaration.generateCode(GroovyCompilationUnitDeclaration.java:1632)
26-Jun-2018 00:42:00         at org.eclipse.jdt.internal.compiler.Compiler.process(Compiler.java:838)
26-Jun-2018 00:42:00         at org.eclipse.jdt.internal.compiler.ProcessTaskManager.run(ProcessTaskManager.java:137)
26-Jun-2018 00:42:00         at java.lang.Thread.run(Thread.java:748)
26-Jun-2018 00:42:00 exception handling
26-Jun-2018 00:42:00 org.codehaus.groovy.control.MultipleCompilationErrorsException: startup failed:
26-Jun-2018 00:42:00
26-Jun-2018 00:42:00         at org.codehaus.groovy.control.ErrorCollector.failIfErrors(ErrorCollector.java:313)
26-Jun-2018 00:42:00         at org.codehaus.groovy.control.CompilationUnit.applyToSourceUnits(CompilationUnit.java:1027)
26-Jun-2018 00:42:00         at org.codehaus.groovy.control.CompilationUnit.compile(CompilationUnit.java:592)
26-Jun-2018 00:42:00         at org.codehaus.jdt.groovy.internal.compiler.ast.GroovyCompilationUnitDeclaration.processToPhase(GroovyCompilationUnitDeclaration.java:184)
26-Jun-2018 00:42:00         at org.codehaus.jdt.groovy.internal.compiler.ast.GroovyCompilationUnitDeclaration.resolve(GroovyCompilationUnitDeclaration.java:2098)
26-Jun-2018 00:42:00         at org.eclipse.jdt.internal.compiler.Compiler.process(Compiler.java:827)
26-Jun-2018 00:42:00         at org.eclipse.jdt.internal.compiler.ProcessTaskManager.run(ProcessTaskManager.java:137)
26-Jun-2018 00:42:00         at java.lang.Thread.run(Thread.java:748)
26-Jun-2018 00:42:00 exception handling
26-Jun-2018 00:42:00 org.codehaus.groovy.control.MultipleCompilationErrorsException: startup failed:
26-Jun-2018 00:42:00
26-Jun-2018 00:42:00         at org.codehaus.groovy.control.ErrorCollector.failIfErrors(ErrorCollector.java:313)
26-Jun-2018 00:42:00         at org.codehaus.groovy.control.CompilationUnit.applyToSourceUnits(CompilationUnit.java:1027)
26-Jun-2018 00:42:00         at org.codehaus.groovy.control.CompilationUnit.compile(CompilationUnit.java:592)
26-Jun-2018 00:42:00         at org.codehaus.jdt.groovy.internal.compiler.ast.GroovyCompilationUnitDeclaration.processToPhase(GroovyCompilationUnitDeclaration.java:184)
26-Jun-2018 00:42:00         at org.codehaus.jdt.groovy.internal.compiler.ast.GroovyCompilationUnitDeclaration.analyseCode(GroovyCompilationUnitDeclaration.java:2181)
26-Jun-2018 00:42:00         at org.eclipse.jdt.internal.compiler.Compiler.process(Compiler.java:833)
26-Jun-2018 00:42:00         at org.eclipse.jdt.internal.compiler.ProcessTaskManager.run(ProcessTaskManager.java:137)
26-Jun-2018 00:42:00         at java.lang.Thread.run(Thread.java:748)
26-Jun-2018 00:42:00 exception handling
26-Jun-2018 00:42:00 org.codehaus.groovy.control.MultipleCompilationErrorsException: startup failed:
26-Jun-2018 00:42:00
26-Jun-2018 00:42:00         at org.codehaus.groovy.control.ErrorCollector.failIfErrors(ErrorCollector.java:313)
26-Jun-2018 00:42:00         at org.codehaus.groovy.control.CompilationUnit.applyToSourceUnits(CompilationUnit.java:1027)
26-Jun-2018 00:42:00         at org.codehaus.groovy.control.CompilationUnit.compile(CompilationUnit.java:592)
26-Jun-2018 00:42:00         at org.codehaus.jdt.groovy.internal.compiler.ast.GroovyCompilationUnitDeclaration.processToPhase(GroovyCompilationUnitDeclaration.java:184)
26-Jun-2018 00:42:00         at org.codehaus.jdt.groovy.internal.compiler.ast.GroovyCompilationUnitDeclaration.generateCode(GroovyCompilationUnitDeclaration.java:1632)
26-Jun-2018 00:42:00         at org.eclipse.jdt.internal.compiler.Compiler.process(Compiler.java:838)
26-Jun-2018 00:42:00         at org.eclipse.jdt.internal.compiler.ProcessTaskManager.run(ProcessTaskManager.java:137)
26-Jun-2018 00:42:00         at java.lang.Thread.run(Thread.java:748)
26-Jun-2018 00:42:00 exception handling
26-Jun-2018 00:42:00 org.codehaus.groovy.control.MultipleCompilationErrorsException: startup failed:
26-Jun-2018 00:42:00
26-Jun-2018 00:42:00         at org.codehaus.groovy.control.ErrorCollector.failIfErrors(ErrorCollector.java:313)
26-Jun-2018 00:42:00         at org.codehaus.groovy.control.CompilationUnit.applyToSourceUnits(CompilationUnit.java:1027)
26-Jun-2018 00:42:00         at org.codehaus.groovy.control.CompilationUnit.compile(CompilationUnit.java:592)
26-Jun-2018 00:42:00         at org.codehaus.jdt.groovy.internal.compiler.ast.GroovyCompilationUnitDeclaration.processToPhase(GroovyCompilationUnitDeclaration.java:184)
26-Jun-2018 00:42:00         at org.codehaus.jdt.groovy.internal.compiler.ast.GroovyCompilationUnitDeclaration.resolve(GroovyCompilationUnitDeclaration.java:2098)
26-Jun-2018 00:42:00         at org.eclipse.jdt.internal.compiler.Compiler.process(Compiler.java:827)
26-Jun-2018 00:42:00         at org.eclipse.jdt.internal.compiler.ProcessTaskManager.run(ProcessTaskManager.java:137)
26-Jun-2018 00:42:00         at java.lang.Thread.run(Thread.java:748)
26-Jun-2018 00:42:00 exception handling
26-Jun-2018 00:42:00 org.codehaus.groovy.control.MultipleCompilationErrorsException: startup failed:
26-Jun-2018 00:42:00
26-Jun-2018 00:42:00         at org.codehaus.groovy.control.ErrorCollector.failIfErrors(ErrorCollector.java:313)
26-Jun-2018 00:42:00         at org.codehaus.groovy.control.CompilationUnit.applyToSourceUnits(CompilationUnit.java:1027)
26-Jun-2018 00:42:00         at org.codehaus.groovy.control.CompilationUnit.compile(CompilationUnit.java:592)
26-Jun-2018 00:42:00         at org.codehaus.jdt.groovy.internal.compiler.ast.GroovyCompilationUnitDeclaration.processToPhase(GroovyCompilationUnitDeclaration.java:184)
26-Jun-2018 00:42:00         at org.codehaus.jdt.groovy.internal.compiler.ast.GroovyCompilationUnitDeclaration.analyseCode(GroovyCompilationUnitDeclaration.java:2181)
26-Jun-2018 00:42:00         at org.eclipse.jdt.internal.compiler.Compiler.process(Compiler.java:833)
26-Jun-2018 00:42:00         at org.eclipse.jdt.internal.compiler.ProcessTaskManager.run(ProcessTaskManager.java:137)
26-Jun-2018 00:42:00         at java.lang.Thread.run(Thread.java:748)
26-Jun-2018 00:42:00 exception handling
26-Jun-2018 00:42:00 org.codehaus.groovy.control.MultipleCompilationErrorsException: startup failed:
26-Jun-2018 00:42:00
26-Jun-2018 00:42:00         at org.codehaus.groovy.control.ErrorCollector.failIfErrors(ErrorCollector.java:313)
26-Jun-2018 00:42:00         at org.codehaus.groovy.control.CompilationUnit.applyToSourceUnits(CompilationUnit.java:1027)
26-Jun-2018 00:42:00         at org.codehaus.groovy.control.CompilationUnit.compile(CompilationUnit.java:592)
26-Jun-2018 00:42:00         at org.codehaus.jdt.groovy.internal.compiler.ast.GroovyCompilationUnitDeclaration.processToPhase(GroovyCompilationUnitDeclaration.java:184)
26-Jun-2018 00:42:00         at org.codehaus.jdt.groovy.internal.compiler.ast.GroovyCompilationUnitDeclaration.generateCode(GroovyCompilationUnitDeclaration.java:1632)
26-Jun-2018 00:42:00         at org.eclipse.jdt.internal.compiler.Compiler.process(Compiler.java:838)
26-Jun-2018 00:42:00         at org.eclipse.jdt.internal.compiler.ProcessTaskManager.run(ProcessTaskManager.java:137)
26-Jun-2018 00:42:00         at java.lang.Thread.run(Thread.java:748)
26-Jun-2018 00:42:00 exception handling
26-Jun-2018 00:42:00 org.codehaus.groovy.control.MultipleCompilationErrorsException: startup failed:
26-Jun-2018 00:42:00
26-Jun-2018 00:42:00         at org.codehaus.groovy.control.ErrorCollector.failIfErrors(ErrorCollector.java:313)
26-Jun-2018 00:42:00         at org.codehaus.groovy.control.CompilationUnit.applyToSourceUnits(CompilationUnit.java:1027)
26-Jun-2018 00:42:00         at org.codehaus.groovy.control.CompilationUnit.compile(CompilationUnit.java:592)
26-Jun-2018 00:42:00         at org.codehaus.jdt.groovy.internal.compiler.ast.GroovyCompilationUnitDeclaration.processToPhase(GroovyCompilationUnitDeclaration.java:184)
26-Jun-2018 00:42:00         at org.codehaus.jdt.groovy.internal.compiler.ast.GroovyCompilationUnitDeclaration.resolve(GroovyCompilationUnitDeclaration.java:2098)
26-Jun-2018 00:42:00         at org.eclipse.jdt.internal.compiler.Compiler.process(Compiler.java:827)
26-Jun-2018 00:42:00         at org.eclipse.jdt.internal.compiler.ProcessTaskManager.run(ProcessTaskManager.java:137)
26-Jun-2018 00:42:00         at java.lang.Thread.run(Thread.java:748)
26-Jun-2018 00:42:00 exception handling
26-Jun-2018 00:42:00 org.codehaus.groovy.control.MultipleCompilationErrorsException: startup failed:
26-Jun-2018 00:42:00
26-Jun-2018 00:42:00         at org.codehaus.groovy.control.ErrorCollector.failIfErrors(ErrorCollector.java:313)
26-Jun-2018 00:42:00         at org.codehaus.groovy.control.CompilationUnit.applyToSourceUnits(CompilationUnit.java:1027)
26-Jun-2018 00:42:00         at org.codehaus.groovy.control.CompilationUnit.compile(CompilationUnit.java:592)
26-Jun-2018 00:42:00         at org.codehaus.jdt.groovy.internal.compiler.ast.GroovyCompilationUnitDeclaration.processToPhase(GroovyCompilationUnitDeclaration.java:184)
26-Jun-2018 00:42:00         at org.codehaus.jdt.groovy.internal.compiler.ast.GroovyCompilationUnitDeclaration.analyseCode(GroovyCompilationUnitDeclaration.java:2181)
26-Jun-2018 00:42:00         at org.eclipse.jdt.internal.compiler.Compiler.process(Compiler.java:833)
26-Jun-2018 00:42:00         at org.eclipse.jdt.internal.compiler.ProcessTaskManager.run(ProcessTaskManager.java:137)
26-Jun-2018 00:42:00         at java.lang.Thread.run(Thread.java:748)
26-Jun-2018 00:42:00 exception handling
26-Jun-2018 00:42:00 org.codehaus.groovy.control.MultipleCompilationErrorsException: startup failed:
26-Jun-2018 00:42:00
26-Jun-2018 00:42:00         at org.codehaus.groovy.control.ErrorCollector.failIfErrors(ErrorCollector.java:313)
26-Jun-2018 00:42:00         at org.codehaus.groovy.control.CompilationUnit.applyToSourceUnits(CompilationUnit.java:1027)
26-Jun-2018 00:42:00         at org.codehaus.groovy.control.CompilationUnit.compile(CompilationUnit.java:592)
26-Jun-2018 00:42:00         at org.codehaus.jdt.groovy.internal.compiler.ast.GroovyCompilationUnitDeclaration.processToPhase(GroovyCompilationUnitDeclaration.java:184)
26-Jun-2018 00:42:00         at org.codehaus.jdt.groovy.internal.compiler.ast.GroovyCompilationUnitDeclaration.generateCode(GroovyCompilationUnitDeclaration.java:1632)
26-Jun-2018 00:42:00         at org.eclipse.jdt.internal.compiler.Compiler.process(Compiler.java:838)
26-Jun-2018 00:42:00         at org.eclipse.jdt.internal.compiler.ProcessTaskManager.run(ProcessTaskManager.java:137)
26-Jun-2018 00:42:00         at java.lang.Thread.run(Thread.java:748)
26-Jun-2018 00:42:00 exception handling
26-Jun-2018 00:42:00 org.codehaus.groovy.control.MultipleCompilationErrorsException: startup failed:
26-Jun-2018 00:42:00
26-Jun-2018 00:42:00         at org.codehaus.groovy.control.ErrorCollector.failIfErrors(ErrorCollector.java:313)
26-Jun-2018 00:42:00         at org.codehaus.groovy.control.CompilationUnit.applyToSourceUnits(CompilationUnit.java:1027)
26-Jun-2018 00:42:00         at org.codehaus.groovy.control.CompilationUnit.compile(CompilationUnit.java:592)
26-Jun-2018 00:42:00         at org.codehaus.jdt.groovy.internal.compiler.ast.GroovyCompilationUnitDeclaration.processToPhase(GroovyCompilationUnitDeclaration.java:184)
26-Jun-2018 00:42:00         at org.codehaus.jdt.groovy.internal.compiler.ast.GroovyCompilationUnitDeclaration.resolve(GroovyCompilationUnitDeclaration.java:2098)
26-Jun-2018 00:42:00         at org.eclipse.jdt.internal.compiler.Compiler.process(Compiler.java:827)
26-Jun-2018 00:42:00         at org.eclipse.jdt.internal.compiler.ProcessTaskManager.run(ProcessTaskManager.java:137)
26-Jun-2018 00:42:00         at java.lang.Thread.run(Thread.java:748)
26-Jun-2018 00:42:00 exception handling
26-Jun-2018 00:42:00 org.codehaus.groovy.control.MultipleCompilationErrorsException: startup failed:
26-Jun-2018 00:42:00
26-Jun-2018 00:42:00         at org.codehaus.groovy.control.ErrorCollector.failIfErrors(ErrorCollector.java:313)
26-Jun-2018 00:42:00         at org.codehaus.groovy.control.CompilationUnit.applyToSourceUnits(CompilationUnit.java:1027)
26-Jun-2018 00:42:00         at org.codehaus.groovy.control.CompilationUnit.compile(CompilationUnit.java:592)
26-Jun-2018 00:42:00         at org.codehaus.jdt.groovy.internal.compiler.ast.GroovyCompilationUnitDeclaration.processToPhase(GroovyCompilationUnitDeclaration.java:184)
26-Jun-2018 00:42:00         at org.codehaus.jdt.groovy.internal.compiler.ast.GroovyCompilationUnitDeclaration.analyseCode(GroovyCompilationUnitDeclaration.java:2181)
26-Jun-2018 00:42:00         at org.eclipse.jdt.internal.compiler.Compiler.process(Compiler.java:833)
26-Jun-2018 00:42:00         at org.eclipse.jdt.internal.compiler.ProcessTaskManager.run(ProcessTaskManager.java:137)
26-Jun-2018 00:42:00         at java.lang.Thread.run(Thread.java:748)
26-Jun-2018 00:42:00 exception handling
26-Jun-2018 00:42:00 org.codehaus.groovy.control.MultipleCompilationErrorsException: startup failed:
26-Jun-2018 00:42:00
26-Jun-2018 00:42:00         at org.codehaus.groovy.control.ErrorCollector.failIfErrors(ErrorCollector.java:313)
26-Jun-2018 00:42:00         at org.codehaus.groovy.control.CompilationUnit.applyToSourceUnits(CompilationUnit.java:1027)
26-Jun-2018 00:42:00         at org.codehaus.groovy.control.CompilationUnit.compile(CompilationUnit.java:592)
26-Jun-2018 00:42:00         at org.codehaus.jdt.groovy.internal.compiler.ast.GroovyCompilationUnitDeclaration.processToPhase(GroovyCompilationUnitDeclaration.java:184)
26-Jun-2018 00:42:00         at org.codehaus.jdt.groovy.internal.compiler.ast.GroovyCompilationUnitDeclaration.generateCode(GroovyCompilationUnitDeclaration.java:1632)
26-Jun-2018 00:42:00         at org.eclipse.jdt.internal.compiler.Compiler.process(Compiler.java:838)
26-Jun-2018 00:42:00         at org.eclipse.jdt.internal.compiler.ProcessTaskManager.run(ProcessTaskManager.java:137)
26-Jun-2018 00:42:00         at java.lang.Thread.run(Thread.java:748)
26-Jun-2018 00:42:00 exception handling
26-Jun-2018 00:42:00 org.codehaus.groovy.control.MultipleCompilationErrorsException: startup failed:
26-Jun-2018 00:42:00
26-Jun-2018 00:42:00         at org.codehaus.groovy.control.ErrorCollector.failIfErrors(ErrorCollector.java:313)
26-Jun-2018 00:42:00         at org.codehaus.groovy.control.CompilationUnit.applyToSourceUnits(CompilationUnit.java:1027)
26-Jun-2018 00:42:00         at org.codehaus.groovy.control.CompilationUnit.compile(CompilationUnit.java:592)
26-Jun-2018 00:42:00         at org.codehaus.jdt.groovy.internal.compiler.ast.GroovyCompilationUnitDeclaration.processToPhase(GroovyCompilationUnitDeclaration.java:184)
26-Jun-2018 00:42:00         at org.codehaus.jdt.groovy.internal.compiler.ast.GroovyCompilationUnitDeclaration.resolve(GroovyCompilationUnitDeclaration.java:2098)
26-Jun-2018 00:42:00         at org.eclipse.jdt.internal.compiler.Compiler.process(Compiler.java:827)
26-Jun-2018 00:42:00         at org.eclipse.jdt.internal.compiler.ProcessTaskManager.run(ProcessTaskManager.java:137)
26-Jun-2018 00:42:00         at java.lang.Thread.run(Thread.java:748)
26-Jun-2018 00:42:00 exception handling
26-Jun-2018 00:42:00 org.codehaus.groovy.control.MultipleCompilationErrorsException: startup failed:
26-Jun-2018 00:42:00
26-Jun-2018 00:42:00         at org.codehaus.groovy.control.ErrorCollector.failIfErrors(ErrorCollector.java:313)
26-Jun-2018 00:42:00         at org.codehaus.groovy.control.CompilationUnit.applyToSourceUnits(CompilationUnit.java:1027)
26-Jun-2018 00:42:00         at org.codehaus.groovy.control.CompilationUnit.compile(CompilationUnit.java:592)
26-Jun-2018 00:42:00         at org.codehaus.jdt.groovy.internal.compiler.ast.GroovyCompilationUnitDeclaration.processToPhase(GroovyCompilationUnitDeclaration.java:184)
26-Jun-2018 00:42:00         at org.codehaus.jdt.groovy.internal.compiler.ast.GroovyCompilationUnitDeclaration.analyseCode(GroovyCompilationUnitDeclaration.java:2181)
26-Jun-2018 00:42:00         at org.eclipse.jdt.internal.compiler.Compiler.process(Compiler.java:833)
26-Jun-2018 00:42:00         at org.eclipse.jdt.internal.compiler.ProcessTaskManager.run(ProcessTaskManager.java:137)
26-Jun-2018 00:42:00         at java.lang.Thread.run(Thread.java:748)
26-Jun-2018 00:42:00 exception handling
26-Jun-2018 00:42:00 org.codehaus.groovy.control.MultipleCompilationErrorsException: startup failed:
26-Jun-2018 00:42:00
26-Jun-2018 00:42:00         at org.codehaus.groovy.control.ErrorCollector.failIfErrors(ErrorCollector.java:313)
26-Jun-2018 00:42:00         at org.codehaus.groovy.control.CompilationUnit.applyToSourceUnits(CompilationUnit.java:1027)
26-Jun-2018 00:42:00         at org.codehaus.groovy.control.CompilationUnit.compile(CompilationUnit.java:592)
26-Jun-2018 00:42:00         at org.codehaus.jdt.groovy.internal.compiler.ast.GroovyCompilationUnitDeclaration.processToPhase(GroovyCompilationUnitDeclaration.java:184)
26-Jun-2018 00:42:00         at org.codehaus.jdt.groovy.internal.compiler.ast.GroovyCompilationUnitDeclaration.generateCode(GroovyCompilationUnitDeclaration.java:1632)
26-Jun-2018 00:42:00         at org.eclipse.jdt.internal.compiler.Compiler.process(Compiler.java:838)
26-Jun-2018 00:42:00         at org.eclipse.jdt.internal.compiler.ProcessTaskManager.run(ProcessTaskManager.java:137)
26-Jun-2018 00:42:00         at java.lang.Thread.run(Thread.java:748)
26-Jun-2018 00:42:00 exception handling
26-Jun-2018 00:42:00 org.codehaus.groovy.control.MultipleCompilationErrorsException: startup failed:
26-Jun-2018 00:42:00
26-Jun-2018 00:42:00         at org.codehaus.groovy.control.ErrorCollector.failIfErrors(ErrorCollector.java:313)
26-Jun-2018 00:42:00         at org.codehaus.groovy.control.CompilationUnit.applyToSourceUnits(CompilationUnit.java:1027)
26-Jun-2018 00:42:00         at org.codehaus.groovy.control.CompilationUnit.compile(CompilationUnit.java:592)
26-Jun-2018 00:42:00         at org.codehaus.jdt.groovy.internal.compiler.ast.GroovyCompilationUnitDeclaration.processToPhase(GroovyCompilationUnitDeclaration.java:184)
26-Jun-2018 00:42:00         at org.codehaus.jdt.groovy.internal.compiler.ast.GroovyCompilationUnitDeclaration.resolve(GroovyCompilationUnitDeclaration.java:2098)
26-Jun-2018 00:42:00         at org.eclipse.jdt.internal.compiler.Compiler.process(Compiler.java:827)
26-Jun-2018 00:42:00         at org.eclipse.jdt.internal.compiler.ProcessTaskManager.run(ProcessTaskManager.java:137)
26-Jun-2018 00:42:00         at java.lang.Thread.run(Thread.java:748)
26-Jun-2018 00:42:00 exception handling
26-Jun-2018 00:42:00 org.codehaus.groovy.control.MultipleCompilationErrorsException: startup failed:
26-Jun-2018 00:42:00
26-Jun-2018 00:42:00         at org.codehaus.groovy.control.ErrorCollector.failIfErrors(ErrorCollector.java:313)
26-Jun-2018 00:42:00         at org.codehaus.groovy.control.CompilationUnit.applyToSourceUnits(CompilationUnit.java:1027)
26-Jun-2018 00:42:00         at org.codehaus.groovy.control.CompilationUnit.compile(CompilationUnit.java:592)
26-Jun-2018 00:42:00         at org.codehaus.jdt.groovy.internal.compiler.ast.GroovyCompilationUnitDeclaration.processToPhase(GroovyCompilationUnitDeclaration.java:184)
26-Jun-2018 00:42:00         at org.codehaus.jdt.groovy.internal.compiler.ast.GroovyCompilationUnitDeclaration.analyseCode(GroovyCompilationUnitDeclaration.java:2181)
26-Jun-2018 00:42:00         at org.eclipse.jdt.internal.compiler.Compiler.process(Compiler.java:833)
26-Jun-2018 00:42:00         at org.eclipse.jdt.internal.compiler.ProcessTaskManager.run(ProcessTaskManager.java:137)
26-Jun-2018 00:42:00         at java.lang.Thread.run(Thread.java:748)
26-Jun-2018 00:42:00 exception handling
26-Jun-2018 00:42:00 org.codehaus.groovy.control.MultipleCompilationErrorsException: startup failed:
26-Jun-2018 00:42:00
26-Jun-2018 00:42:00         at org.codehaus.groovy.control.ErrorCollector.failIfErrors(ErrorCollector.java:313)
26-Jun-2018 00:42:00         at org.codehaus.groovy.control.CompilationUnit.applyToSourceUnits(CompilationUnit.java:1027)
26-Jun-2018 00:42:00         at org.codehaus.groovy.control.CompilationUnit.compile(CompilationUnit.java:592)
26-Jun-2018 00:42:00         at org.codehaus.jdt.groovy.internal.compiler.ast.GroovyCompilationUnitDeclaration.processToPhase(GroovyCompilationUnitDeclaration.java:184)
26-Jun-2018 00:42:00         at org.codehaus.jdt.groovy.internal.compiler.ast.GroovyCompilationUnitDeclaration.generateCode(GroovyCompilationUnitDeclaration.java:1632)
26-Jun-2018 00:42:00         at org.eclipse.jdt.internal.compiler.Compiler.process(Compiler.java:838)
26-Jun-2018 00:42:00         at org.eclipse.jdt.internal.compiler.ProcessTaskManager.run(ProcessTaskManager.java:137)
26-Jun-2018 00:42:00         at java.lang.Thread.run(Thread.java:748)
26-Jun-2018 00:42:00 exception handling
26-Jun-2018 00:42:00 org.codehaus.groovy.control.MultipleCompilationErrorsException: startup failed:
26-Jun-2018 00:42:00
26-Jun-2018 00:42:00         at org.codehaus.groovy.control.ErrorCollector.failIfErrors(ErrorCollector.java:313)
26-Jun-2018 00:42:00         at org.codehaus.groovy.control.CompilationUnit.applyToSourceUnits(CompilationUnit.java:1027)
26-Jun-2018 00:42:00         at org.codehaus.groovy.control.CompilationUnit.compile(CompilationUnit.java:592)
26-Jun-2018 00:42:00         at org.codehaus.jdt.groovy.internal.compiler.ast.GroovyCompilationUnitDeclaration.processToPhase(GroovyCompilationUnitDeclaration.java:184)
26-Jun-2018 00:42:00         at org.codehaus.jdt.groovy.internal.compiler.ast.GroovyCompilationUnitDeclaration.resolve(GroovyCompilationUnitDeclaration.java:2098)
26-Jun-2018 00:42:00         at org.eclipse.jdt.internal.compiler.Compiler.process(Compiler.java:827)
26-Jun-2018 00:42:00         at org.eclipse.jdt.internal.compiler.ProcessTaskManager.run(ProcessTaskManager.java:137)
26-Jun-2018 00:42:00         at java.lang.Thread.run(Thread.java:748)
26-Jun-2018 00:42:00 exception handling
26-Jun-2018 00:42:00 org.codehaus.groovy.control.MultipleCompilationErrorsException: startup failed:
26-Jun-2018 00:42:00
26-Jun-2018 00:42:00         at org.codehaus.groovy.control.ErrorCollector.failIfErrors(ErrorCollector.java:313)
26-Jun-2018 00:42:00         at org.codehaus.groovy.control.CompilationUnit.applyToSourceUnits(CompilationUnit.java:1027)
26-Jun-2018 00:42:00         at org.codehaus.groovy.control.CompilationUnit.compile(CompilationUnit.java:592)
26-Jun-2018 00:42:00         at org.codehaus.jdt.groovy.internal.compiler.ast.GroovyCompilationUnitDeclaration.processToPhase(GroovyCompilationUnitDeclaration.java:184)
26-Jun-2018 00:42:00         at org.codehaus.jdt.groovy.internal.compiler.ast.GroovyCompilationUnitDeclaration.analyseCode(GroovyCompilationUnitDeclaration.java:2181)
26-Jun-2018 00:42:00         at org.eclipse.jdt.internal.compiler.Compiler.process(Compiler.java:833)
26-Jun-2018 00:42:00         at org.eclipse.jdt.internal.compiler.ProcessTaskManager.run(ProcessTaskManager.java:137)
26-Jun-2018 00:42:00         at java.lang.Thread.run(Thread.java:748)
26-Jun-2018 00:42:00 exception handling
26-Jun-2018 00:42:00 org.codehaus.groovy.control.MultipleCompilationErrorsException: startup failed:
26-Jun-2018 00:42:00
26-Jun-2018 00:42:00         at org.codehaus.groovy.control.ErrorCollector.failIfErrors(ErrorCollector.java:313)
26-Jun-2018 00:42:00         at org.codehaus.groovy.control.CompilationUnit.applyToSourceUnits(CompilationUnit.java:1027)
26-Jun-2018 00:42:00         at org.codehaus.groovy.control.CompilationUnit.compile(CompilationUnit.java:592)
26-Jun-2018 00:42:00         at org.codehaus.jdt.groovy.internal.compiler.ast.GroovyCompilationUnitDeclaration.processToPhase(GroovyCompilationUnitDeclaration.java:184)
26-Jun-2018 00:42:00         at org.codehaus.jdt.groovy.internal.compiler.ast.GroovyCompilationUnitDeclaration.generateCode(GroovyCompilationUnitDeclaration.java:1632)
26-Jun-2018 00:42:00         at org.eclipse.jdt.internal.compiler.Compiler.process(Compiler.java:838)
26-Jun-2018 00:42:00         at org.eclipse.jdt.internal.compiler.ProcessTaskManager.run(ProcessTaskManager.java:137)
26-Jun-2018 00:42:00         at java.lang.Thread.run(Thread.java:748)
26-Jun-2018 00:42:00 exception handling
26-Jun-2018 00:42:00 org.codehaus.groovy.control.MultipleCompilationErrorsException: startup failed:
26-Jun-2018 00:42:00
26-Jun-2018 00:42:00         at org.codehaus.groovy.control.ErrorCollector.failIfErrors(ErrorCollector.java:313)
26-Jun-2018 00:42:00         at org.codehaus.groovy.control.CompilationUnit.applyToSourceUnits(CompilationUnit.java:1027)
26-Jun-2018 00:42:00         at org.codehaus.groovy.control.CompilationUnit.compile(CompilationUnit.java:592)
26-Jun-2018 00:42:00         at org.codehaus.jdt.groovy.internal.compiler.ast.GroovyCompilationUnitDeclaration.processToPhase(GroovyCompilationUnitDeclaration.java:184)
26-Jun-2018 00:42:00         at org.codehaus.jdt.groovy.internal.compiler.ast.GroovyCompilationUnitDeclaration.resolve(GroovyCompilationUnitDeclaration.java:2098)
26-Jun-2018 00:42:00         at org.eclipse.jdt.internal.compiler.Compiler.process(Compiler.java:827)
26-Jun-2018 00:42:00         at org.eclipse.jdt.internal.compiler.ProcessTaskManager.run(ProcessTaskManager.java:137)
26-Jun-2018 00:42:00         at java.lang.Thread.run(Thread.java:748)
26-Jun-2018 00:42:00 exception handling
26-Jun-2018 00:42:00 org.codehaus.groovy.control.MultipleCompilationErrorsException: startup failed:
26-Jun-2018 00:42:00
26-Jun-2018 00:42:00         at org.codehaus.groovy.control.ErrorCollector.failIfErrors(ErrorCollector.java:313)
26-Jun-2018 00:42:00         at org.codehaus.groovy.control.CompilationUnit.applyToSourceUnits(CompilationUnit.java:1027)
26-Jun-2018 00:42:00         at org.codehaus.groovy.control.CompilationUnit.compile(CompilationUnit.java:592)
26-Jun-2018 00:42:00         at org.codehaus.jdt.groovy.internal.compiler.ast.GroovyCompilationUnitDeclaration.processToPhase(GroovyCompilationUnitDeclaration.java:184)
26-Jun-2018 00:42:00         at org.codehaus.jdt.groovy.internal.compiler.ast.GroovyCompilationUnitDeclaration.analyseCode(GroovyCompilationUnitDeclaration.java:2181)
26-Jun-2018 00:42:00         at org.eclipse.jdt.internal.compiler.Compiler.process(Compiler.java:833)
26-Jun-2018 00:42:00         at org.eclipse.jdt.internal.compiler.ProcessTaskManager.run(ProcessTaskManager.java:137)
26-Jun-2018 00:42:00         at java.lang.Thread.run(Thread.java:748)
26-Jun-2018 00:42:00 exception handling
26-Jun-2018 00:42:00 org.codehaus.groovy.control.MultipleCompilationErrorsException: startup failed:
26-Jun-2018 00:42:00
26-Jun-2018 00:42:00         at org.codehaus.groovy.control.ErrorCollector.failIfErrors(ErrorCollector.java:313)
26-Jun-2018 00:42:00         at org.codehaus.groovy.control.CompilationUnit.applyToSourceUnits(CompilationUnit.java:1027)
26-Jun-2018 00:42:00         at org.codehaus.groovy.control.CompilationUnit.compile(CompilationUnit.java:592)
26-Jun-2018 00:42:00         at org.codehaus.jdt.groovy.internal.compiler.ast.GroovyCompilationUnitDeclaration.processToPhase(GroovyCompilationUnitDeclaration.java:184)
26-Jun-2018 00:42:00         at org.codehaus.jdt.groovy.internal.compiler.ast.GroovyCompilationUnitDeclaration.generateCode(GroovyCompilationUnitDeclaration.java:1632)
26-Jun-2018 00:42:00         at org.eclipse.jdt.internal.compiler.Compiler.process(Compiler.java:838)
26-Jun-2018 00:42:00         at org.eclipse.jdt.internal.compiler.ProcessTaskManager.run(ProcessTaskManager.java:137)
26-Jun-2018 00:42:00         at java.lang.Thread.run(Thread.java:748)
26-Jun-2018 00:42:00 exception handling
26-Jun-2018 00:42:00 org.codehaus.groovy.control.MultipleCompilationErrorsException: startup failed:
26-Jun-2018 00:42:00
26-Jun-2018 00:42:00         at org.codehaus.groovy.control.ErrorCollector.failIfErrors(ErrorCollector.java:313)
26-Jun-2018 00:42:00         at org.codehaus.groovy.control.CompilationUnit.applyToSourceUnits(CompilationUnit.java:1027)
26-Jun-2018 00:42:00         at org.codehaus.groovy.control.CompilationUnit.compile(CompilationUnit.java:592)
26-Jun-2018 00:42:00         at org.codehaus.jdt.groovy.internal.compiler.ast.GroovyCompilationUnitDeclaration.processToPhase(GroovyCompilationUnitDeclaration.java:184)
26-Jun-2018 00:42:00         at org.codehaus.jdt.groovy.internal.compiler.ast.GroovyCompilationUnitDeclaration.resolve(GroovyCompilationUnitDeclaration.java:2098)
26-Jun-2018 00:42:00         at org.eclipse.jdt.internal.compiler.Compiler.process(Compiler.java:827)
26-Jun-2018 00:42:00         at org.eclipse.jdt.internal.compiler.ProcessTaskManager.run(ProcessTaskManager.java:137)
26-Jun-2018 00:42:00         at java.lang.Thread.run(Thread.java:748)
26-Jun-2018 00:42:00 exception handling
26-Jun-2018 00:42:00 org.codehaus.groovy.control.MultipleCompilationErrorsException: startup failed:
26-Jun-2018 00:42:00
26-Jun-2018 00:42:00         at org.codehaus.groovy.control.ErrorCollector.failIfErrors(ErrorCollector.java:313)
26-Jun-2018 00:42:00         at org.codehaus.groovy.control.CompilationUnit.applyToSourceUnits(CompilationUnit.java:1027)
26-Jun-2018 00:42:00         at org.codehaus.groovy.control.CompilationUnit.compile(CompilationUnit.java:592)
26-Jun-2018 00:42:00         at org.codehaus.jdt.groovy.internal.compiler.ast.GroovyCompilationUnitDeclaration.processToPhase(GroovyCompilationUnitDeclaration.java:184)
26-Jun-2018 00:42:00         at org.codehaus.jdt.groovy.internal.compiler.ast.GroovyCompilationUnitDeclaration.analyseCode(GroovyCompilationUnitDeclaration.java:2181)
26-Jun-2018 00:42:00         at org.eclipse.jdt.internal.compiler.Compiler.process(Compiler.java:833)
26-Jun-2018 00:42:00         at org.eclipse.jdt.internal.compiler.ProcessTaskManager.run(ProcessTaskManager.java:137)
26-Jun-2018 00:42:00         at java.lang.Thread.run(Thread.java:748)
26-Jun-2018 00:42:00 exception handling
26-Jun-2018 00:42:00 org.codehaus.groovy.control.MultipleCompilationErrorsException: startup failed:
26-Jun-2018 00:42:00
26-Jun-2018 00:42:00         at org.codehaus.groovy.control.ErrorCollector.failIfErrors(ErrorCollector.java:313)
26-Jun-2018 00:42:00         at org.codehaus.groovy.control.CompilationUnit.applyToSourceUnits(CompilationUnit.java:1027)
26-Jun-2018 00:42:00         at org.codehaus.groovy.control.CompilationUnit.compile(CompilationUnit.java:592)
26-Jun-2018 00:42:00         at org.codehaus.jdt.groovy.internal.compiler.ast.GroovyCompilationUnitDeclaration.processToPhase(GroovyCompilationUnitDeclaration.java:184)
26-Jun-2018 00:42:00         at org.codehaus.jdt.groovy.internal.compiler.ast.GroovyCompilationUnitDeclaration.generateCode(GroovyCompilationUnitDeclaration.java:1632)
26-Jun-2018 00:42:00         at org.eclipse.jdt.internal.compiler.Compiler.process(Compiler.java:838)
26-Jun-2018 00:42:00         at org.eclipse.jdt.internal.compiler.ProcessTaskManager.run(ProcessTaskManager.java:137)
26-Jun-2018 00:42:00         at java.lang.Thread.run(Thread.java:748)
26-Jun-2018 00:42:00 exception handling
26-Jun-2018 00:42:00 org.codehaus.groovy.control.MultipleCompilationErrorsException: startup failed:
26-Jun-2018 00:42:00
26-Jun-2018 00:42:00         at org.codehaus.groovy.control.ErrorCollector.failIfErrors(ErrorCollector.java:313)
26-Jun-2018 00:42:00         at org.codehaus.groovy.control.CompilationUnit.applyToSourceUnits(CompilationUnit.java:1027)
26-Jun-2018 00:42:00         at org.codehaus.groovy.control.CompilationUnit.compile(CompilationUnit.java:592)
26-Jun-2018 00:42:00         at org.codehaus.jdt.groovy.internal.compiler.ast.GroovyCompilationUnitDeclaration.processToPhase(GroovyCompilationUnitDeclaration.java:184)
26-Jun-2018 00:42:00         at org.codehaus.jdt.groovy.internal.compiler.ast.GroovyCompilationUnitDeclaration.resolve(GroovyCompilationUnitDeclaration.java:2098)
26-Jun-2018 00:42:00         at org.eclipse.jdt.internal.compiler.Compiler.process(Compiler.java:827)
26-Jun-2018 00:42:00         at org.eclipse.jdt.internal.compiler.ProcessTaskManager.run(ProcessTaskManager.java:137)
26-Jun-2018 00:42:00         at java.lang.Thread.run(Thread.java:748)
26-Jun-2018 00:42:00 exception handling
26-Jun-2018 00:42:00 org.codehaus.groovy.control.MultipleCompilationErrorsException: startup failed:
26-Jun-2018 00:42:00
26-Jun-2018 00:42:00         at org.codehaus.groovy.control.ErrorCollector.failIfErrors(ErrorCollector.java:313)
26-Jun-2018 00:42:00         at org.codehaus.groovy.control.CompilationUnit.applyToSourceUnits(CompilationUnit.java:1027)
26-Jun-2018 00:42:00         at org.codehaus.groovy.control.CompilationUnit.compile(CompilationUnit.java:592)
26-Jun-2018 00:42:00         at org.codehaus.jdt.groovy.internal.compiler.ast.GroovyCompilationUnitDeclaration.processToPhase(GroovyCompilationUnitDeclaration.java:184)
26-Jun-2018 00:42:00         at org.codehaus.jdt.groovy.internal.compiler.ast.GroovyCompilationUnitDeclaration.analyseCode(GroovyCompilationUnitDeclaration.java:2181)
26-Jun-2018 00:42:00         at org.eclipse.jdt.internal.compiler.Compiler.process(Compiler.java:833)
26-Jun-2018 00:42:00         at org.eclipse.jdt.internal.compiler.ProcessTaskManager.run(ProcessTaskManager.java:137)
26-Jun-2018 00:42:00         at java.lang.Thread.run(Thread.java:748)
26-Jun-2018 00:42:00 exception handling
26-Jun-2018 00:42:00 org.codehaus.groovy.control.MultipleCompilationErrorsException: startup failed:
26-Jun-2018 00:42:00
26-Jun-2018 00:42:00         at org.codehaus.groovy.control.ErrorCollector.failIfErrors(ErrorCollector.java:313)
26-Jun-2018 00:42:00         at org.codehaus.groovy.control.CompilationUnit.applyToSourceUnits(CompilationUnit.java:1027)
26-Jun-2018 00:42:00         at org.codehaus.groovy.control.CompilationUnit.compile(CompilationUnit.java:592)
26-Jun-2018 00:42:00         at org.codehaus.jdt.groovy.internal.compiler.ast.GroovyCompilationUnitDeclaration.processToPhase(GroovyCompilationUnitDeclaration.java:184)
26-Jun-2018 00:42:00         at org.codehaus.jdt.groovy.internal.compiler.ast.GroovyCompilationUnitDeclaration.generateCode(GroovyCompilationUnitDeclaration.java:1632)
26-Jun-2018 00:42:00         at org.eclipse.jdt.internal.compiler.Compiler.process(Compiler.java:838)
26-Jun-2018 00:42:00         at org.eclipse.jdt.internal.compiler.ProcessTaskManager.run(ProcessTaskManager.java:137)
26-Jun-2018 00:42:00         at java.lang.Thread.run(Thread.java:748)
26-Jun-2018 00:42:00 exception handling
26-Jun-2018 00:42:00 org.codehaus.groovy.control.MultipleCompilationErrorsException: startup failed:
26-Jun-2018 00:42:00
26-Jun-2018 00:42:00         at org.codehaus.groovy.control.ErrorCollector.failIfErrors(ErrorCollector.java:313)
26-Jun-2018 00:42:00         at org.codehaus.groovy.control.CompilationUnit.applyToSourceUnits(CompilationUnit.java:1027)
26-Jun-2018 00:42:00         at org.codehaus.groovy.control.CompilationUnit.compile(CompilationUnit.java:592)
26-Jun-2018 00:42:00         at org.codehaus.jdt.groovy.internal.compiler.ast.GroovyCompilationUnitDeclaration.processToPhase(GroovyCompilationUnitDeclaration.java:184)
26-Jun-2018 00:42:00         at org.codehaus.jdt.groovy.internal.compiler.ast.GroovyCompilationUnitDeclaration.resolve(GroovyCompilationUnitDeclaration.java:2098)
26-Jun-2018 00:42:00         at org.eclipse.jdt.internal.compiler.Compiler.process(Compiler.java:827)
26-Jun-2018 00:42:00         at org.eclipse.jdt.internal.compiler.ProcessTaskManager.run(ProcessTaskManager.java:137)
26-Jun-2018 00:42:00         at java.lang.Thread.run(Thread.java:748)
26-Jun-2018 00:42:00 exception handling
26-Jun-2018 00:42:00 org.codehaus.groovy.control.MultipleCompilationErrorsException: startup failed:
26-Jun-2018 00:42:00
26-Jun-2018 00:42:00         at org.codehaus.groovy.control.ErrorCollector.failIfErrors(ErrorCollector.java:313)
26-Jun-2018 00:42:00         at org.codehaus.groovy.control.CompilationUnit.applyToSourceUnits(CompilationUnit.java:1027)
26-Jun-2018 00:42:00         at org.codehaus.groovy.control.CompilationUnit.compile(CompilationUnit.java:592)
26-Jun-2018 00:42:00         at org.codehaus.jdt.groovy.internal.compiler.ast.GroovyCompilationUnitDeclaration.processToPhase(GroovyCompilationUnitDeclaration.java:184)
26-Jun-2018 00:42:00         at org.codehaus.jdt.groovy.internal.compiler.ast.GroovyCompilationUnitDeclaration.analyseCode(GroovyCompilationUnitDeclaration.java:2181)
26-Jun-2018 00:42:00         at org.eclipse.jdt.internal.compiler.Compiler.process(Compiler.java:833)
26-Jun-2018 00:42:00         at org.eclipse.jdt.internal.compiler.ProcessTaskManager.run(ProcessTaskManager.java:137)
26-Jun-2018 00:42:00         at java.lang.Thread.run(Thread.java:748)
26-Jun-2018 00:42:00 exception handling
26-Jun-2018 00:42:00 org.codehaus.groovy.control.MultipleCompilationErrorsException: startup failed:
26-Jun-2018 00:42:00
26-Jun-2018 00:42:00         at org.codehaus.groovy.control.ErrorCollector.failIfErrors(ErrorCollector.java:313)
26-Jun-2018 00:42:00         at org.codehaus.groovy.control.CompilationUnit.applyToSourceUnits(CompilationUnit.java:1027)
26-Jun-2018 00:42:00         at org.codehaus.groovy.control.CompilationUnit.compile(CompilationUnit.java:592)
26-Jun-2018 00:42:00         at org.codehaus.jdt.groovy.internal.compiler.ast.GroovyCompilationUnitDeclaration.processToPhase(GroovyCompilationUnitDeclaration.java:184)
26-Jun-2018 00:42:00         at org.codehaus.jdt.groovy.internal.compiler.ast.GroovyCompilationUnitDeclaration.generateCode(GroovyCompilationUnitDeclaration.java:1632)
26-Jun-2018 00:42:00         at org.eclipse.jdt.internal.compiler.Compiler.process(Compiler.java:838)
26-Jun-2018 00:42:00         at org.eclipse.jdt.internal.compiler.ProcessTaskManager.run(ProcessTaskManager.java:137)
26-Jun-2018 00:42:00         at java.lang.Thread.run(Thread.java:748)
26-Jun-2018 00:42:00 exception handling
26-Jun-2018 00:42:00 org.codehaus.groovy.control.MultipleCompilationErrorsException: startup failed:
26-Jun-2018 00:42:00
26-Jun-2018 00:42:00         at org.codehaus.groovy.control.ErrorCollector.failIfErrors(ErrorCollector.java:313)
26-Jun-2018 00:42:00         at org.codehaus.groovy.control.CompilationUnit.applyToSourceUnits(CompilationUnit.java:1027)
26-Jun-2018 00:42:00         at org.codehaus.groovy.control.CompilationUnit.compile(CompilationUnit.java:592)
26-Jun-2018 00:42:00         at org.codehaus.jdt.groovy.internal.compiler.ast.GroovyCompilationUnitDeclaration.processToPhase(GroovyCompilationUnitDeclaration.java:184)
26-Jun-2018 00:42:00         at org.codehaus.jdt.groovy.internal.compiler.ast.GroovyCompilationUnitDeclaration.resolve(GroovyCompilationUnitDeclaration.java:2098)
26-Jun-2018 00:42:00         at org.eclipse.jdt.internal.compiler.Compiler.process(Compiler.java:827)
26-Jun-2018 00:42:00         at org.eclipse.jdt.internal.compiler.ProcessTaskManager.run(ProcessTaskManager.java:137)
26-Jun-2018 00:42:00         at java.lang.Thread.run(Thread.java:748)
26-Jun-2018 00:42:00 exception handling
26-Jun-2018 00:42:00 org.codehaus.groovy.control.MultipleCompilationErrorsException: startup failed:
26-Jun-2018 00:42:00
26-Jun-2018 00:42:00         at org.codehaus.groovy.control.ErrorCollector.failIfErrors(ErrorCollector.java:313)
26-Jun-2018 00:42:00         at org.codehaus.groovy.control.CompilationUnit.applyToSourceUnits(CompilationUnit.java:1027)
26-Jun-2018 00:42:00         at org.codehaus.groovy.control.CompilationUnit.compile(CompilationUnit.java:592)
26-Jun-2018 00:42:00         at org.codehaus.jdt.groovy.internal.compiler.ast.GroovyCompilationUnitDeclaration.processToPhase(GroovyCompilationUnitDeclaration.java:184)
26-Jun-2018 00:42:00         at org.codehaus.jdt.groovy.internal.compiler.ast.GroovyCompilationUnitDeclaration.analyseCode(GroovyCompilationUnitDeclaration.java:2181)
26-Jun-2018 00:42:00         at org.eclipse.jdt.internal.compiler.Compiler.process(Compiler.java:833)
26-Jun-2018 00:42:00         at org.eclipse.jdt.internal.compiler.ProcessTaskManager.run(ProcessTaskManager.java:137)
26-Jun-2018 00:42:00         at java.lang.Thread.run(Thread.java:748)
26-Jun-2018 00:42:00 exception handling
26-Jun-2018 00:42:00 org.codehaus.groovy.control.MultipleCompilationErrorsException: startup failed:
26-Jun-2018 00:42:00
26-Jun-2018 00:42:00         at org.codehaus.groovy.control.ErrorCollector.failIfErrors(ErrorCollector.java:313)
26-Jun-2018 00:42:00         at org.codehaus.groovy.control.CompilationUnit.applyToSourceUnits(CompilationUnit.java:1027)
26-Jun-2018 00:42:00         at org.codehaus.groovy.control.CompilationUnit.compile(CompilationUnit.java:592)
26-Jun-2018 00:42:00         at org.codehaus.jdt.groovy.internal.compiler.ast.GroovyCompilationUnitDeclaration.processToPhase(GroovyCompilationUnitDeclaration.java:184)
26-Jun-2018 00:42:00         at org.codehaus.jdt.groovy.internal.compiler.ast.GroovyCompilationUnitDeclaration.generateCode(GroovyCompilationUnitDeclaration.java:1632)
26-Jun-2018 00:42:00         at org.eclipse.jdt.internal.compiler.Compiler.process(Compiler.java:838)
26-Jun-2018 00:42:00         at org.eclipse.jdt.internal.compiler.ProcessTaskManager.run(ProcessTaskManager.java:137)
26-Jun-2018 00:42:00         at java.lang.Thread.run(Thread.java:748)
26-Jun-2018 00:42:00 [INFO] ------------------------------------------------------------------------
26-Jun-2018 00:42:00 [INFO] Reactor Summary:
26-Jun-2018 00:42:00 [INFO]
26-Jun-2018 00:42:00 [INFO] org.codehaus.groovy.eclipse.parent ................. SUCCESS [  0.317 s]
26-Jun-2018 00:42:00 [INFO] org.codehaus.groovy ................................ SUCCESS [  6.729 s]
26-Jun-2018 00:42:00 [INFO] org.codehaus.groovy ................................ SUCCESS [  4.612 s]
26-Jun-2018 00:42:00 [INFO] org.codehaus.groovy ................................ SUCCESS [  4.383 s]
26-Jun-2018 00:42:00 [INFO] org.codehaus.groovy ................................ SUCCESS [  4.204 s]
26-Jun-2018 00:42:00 [INFO] org.codehaus.groovy ................................ SUCCESS [  4.833 s]
26-Jun-2018 00:42:00 [INFO] org.codehaus.groovy ................................ SUCCESS [  4.493 s]
26-Jun-2018 00:42:00 [INFO] org.codehaus.groovy ................................ SUCCESS [  5.855 s]
26-Jun-2018 00:42:00 [INFO] org.codehaus.groovy.eclipse.compilerResolver ....... SUCCESS [  1.182 s]
26-Jun-2018 00:42:00 [INFO] org.eclipse.jdt.core ............................... SUCCESS [ 17.873 s]
26-Jun-2018 00:42:00 [INFO] org.eclipse.jdt.groovy.core ........................ SUCCESS [  2.176 s]
26-Jun-2018 00:42:00 [INFO] org.codehaus.groovy.eclipse ........................ SUCCESS [  0.597 s]
26-Jun-2018 00:42:00 [INFO] org.codehaus.groovy.eclipse.core ................... SUCCESS [  1.559 s]
26-Jun-2018 00:42:00 [INFO] org.codehaus.groovy.eclipse.ant .................... SUCCESS [  1.164 s]
26-Jun-2018 00:42:00 [INFO] org.codehaus.groovy.eclipse.codebrowsing ........... SUCCESS [  1.381 s]
26-Jun-2018 00:42:00 [INFO] org.codehaus.groovy.eclipse.refactoring ............ SUCCESS [  2.380 s]
26-Jun-2018 00:42:00 [INFO] org.codehaus.groovy.eclipse.ui ..................... SUCCESS [  2.890 s]
26-Jun-2018 00:42:00 [INFO] org.codehaus.groovy.eclipse.astviews ............... SUCCESS [  5.825 s]
26-Jun-2018 00:42:00 [INFO] org.codehaus.groovy.eclipse.codeassist.completion .. SUCCESS [  1.921 s]
26-Jun-2018 00:42:00 [INFO] org.codehaus.groovy.eclipse.dsl .................... SUCCESS [  2.321 s]
26-Jun-2018 00:42:00 [INFO] org.codehaus.groovy.eclipse.quickfix ............... SUCCESS [  1.645 s]
26-Jun-2018 00:42:00 [INFO] org.codehaus.groovy18.feature ...................... SUCCESS [  0.705 s]
26-Jun-2018 00:42:00 [INFO] org.codehaus.groovy20.feature ...................... SUCCESS [  0.592 s]
26-Jun-2018 00:42:00 [INFO] org.codehaus.groovy21.feature ...................... SUCCESS [  0.600 s]
26-Jun-2018 00:42:00 [INFO] org.codehaus.groovy22.feature ...................... SUCCESS [  0.573 s]
26-Jun-2018 00:42:00 [INFO] org.codehaus.groovy23.feature ...................... SUCCESS [  0.579 s]
26-Jun-2018 00:42:00 [INFO] org.codehaus.groovy24.feature ...................... SUCCESS [  0.589 s]
26-Jun-2018 00:42:00 [INFO] org.codehaus.groovy25.feature ...................... SUCCESS [  0.593 s]
26-Jun-2018 00:42:00 [INFO] org.codehaus.groovy.jdt.patch ...................... SUCCESS [  0.572 s]
26-Jun-2018 00:42:00 [INFO] org.codehaus.groovy.headless.feature ............... SUCCESS [  0.660 s]
26-Jun-2018 00:42:00 [INFO] org.codehaus.groovy.compilerless.feature ........... SUCCESS [  0.766 s]
26-Jun-2018 00:42:00 [INFO] org.codehaus.groovy.eclipse.feature ................ SUCCESS [  0.674 s]
26-Jun-2018 00:42:00 [INFO] org.eclipse.jdt.core.tests.compiler ................ SUCCESS [  7.032 s]
26-Jun-2018 00:42:00 [INFO] org.eclipse.jdt.core.tests.builder ................. SUCCESS [  1.422 s]
26-Jun-2018 00:42:00 [INFO] org.eclipse.jdt.groovy.core.tests.compiler ......... SUCCESS [  1.257 s]
26-Jun-2018 00:42:00 [INFO] org.eclipse.jdt.groovy.core.tests.builder .......... SUCCESS [  1.778 s]
26-Jun-2018 00:42:00 [INFO] org.codehaus.groovy.eclipse.tests .................. SUCCESS [  4.341 s]
26-Jun-2018 00:42:00 [INFO] org.codehaus.groovy.eclipse.codeassist.completion.test FAILURE [  1.078 s]
26-Jun-2018 00:42:00 [INFO] org.codehaus.groovy.eclipse.codebrowsing.test ...... SKIPPED
26-Jun-2018 00:42:00 [INFO] org.codehaus.groovy.eclipse.core.test .............. SKIPPED
26-Jun-2018 00:42:00 [INFO] org.codehaus.groovy.eclipse.dsl.tests .............. SKIPPED
26-Jun-2018 00:42:00 [INFO] org.codehaus.groovy.eclipse.junit.test ............. SKIPPED
26-Jun-2018 00:42:00 [INFO] org.codehaus.groovy.eclipse.refactoring.test ....... SKIPPED
26-Jun-2018 00:42:00 [INFO] org.codehaus.groovy.eclipse.quickfix.test .......... SKIPPED
26-Jun-2018 00:42:00 [INFO] org.codehaus.groovy.alltests ....................... SKIPPED
26-Jun-2018 00:42:00 [INFO] org.codehaus.groovy.alltests.feature ............... SKIPPED
26-Jun-2018 00:42:00 [INFO] org.codehaus.groovy.m2eclipse ...................... SKIPPED
26-Jun-2018 00:42:00 [INFO] org.codehaus.groovy.m2eclipse.feature .............. SKIPPED
26-Jun-2018 00:42:00 [INFO] org.codehaus.groovy.eclipse.site ................... SKIPPED
26-Jun-2018 00:42:00 [INFO] ------------------------------------------------------------------------
26-Jun-2018 00:42:00 [INFO] BUILD FAILURE
26-Jun-2018 00:42:00 [INFO] ------------------------------------------------------------------------
26-Jun-2018 00:42:00 [INFO] Total time: 03:11 min
26-Jun-2018 00:42:00 [INFO] Finished at: 2018-06-26T00:42:00+00:00
26-Jun-2018 00:42:01 [INFO] Final Memory: 159M/907M
26-Jun-2018 00:42:01 [INFO] ------------------------------------------------------------------------
26-Jun-2018 00:42:01 [ERROR] Failed to execute goal org.eclipse.tycho:tycho-compiler-plugin:0.24.0:compile (default-compile) on project org.codehaus.groovy.eclipse.codeassist.completion.test: Compilation failure: Compilation failure:
26-Jun-2018 00:42:01 [ERROR] /opt/bamboo-home/xml-data/build-dir/GRECLIPSE-GE47-JOB1/ide-test/org.codehaus.groovy.eclipse.codeassist.completion.test/src/org/codehaus/groovy/eclipse/codeassist/tests/FieldCompletionTests.groovy:[337,1] 1. ERROR in /opt/bamboo-home/xml-data/build-dir/GRECLIPSE-GE47-JOB1/ide-test/org.codehaus.groovy.eclipse.codeassist.completion.test/src/org/codehaus/groovy/eclipse/codeassist/tests/FieldCompletionTests.groovy (at line 337)
26-Jun-2018 00:42:01 [ERROR] }
26-Jun-2018 00:42:01 [ERROR] ^
26-Jun-2018 00:42:01 [ERROR] Groovy:The return type of VisitStatus acceptASTNode(org.codehaus.groovy.ast.ASTNode, org.eclipse.jdt.groovy.search.TypeLookupResult, org.eclipse.jdt.core.IJavaElement) in org.codehaus.groovy.eclipse.codeassist.tests.CompletionTestSuite$SearchRequestor is incompatible with org.eclipse.jdt.groovy.search.ITypeRequestor$VisitStatus acceptASTNode(org.codehaus.groovy.ast.ASTNode, org.eclipse.jdt.groovy.search.TypeLookupResult, org.eclipse.jdt.core.IJavaElement) in org.eclipse.jdt.groovy.search.ITypeRequestor
26-Jun-2018 00:42:01 [ERROR]
26-Jun-2018 00:42:01 [ERROR] Found 1 error and 0 warnings.
26-Jun-2018 00:42:01 [ERROR] -> [Help 1]
26-Jun-2018 00:42:01 [ERROR]
26-Jun-2018 00:42:01 [ERROR] To see the full stack trace of the errors, re-run Maven with the -e switch.
26-Jun-2018 00:42:01 [ERROR] Re-run Maven using the -X switch to enable full debug logging.
26-Jun-2018 00:42:01 [ERROR]
26-Jun-2018 00:42:01 [ERROR] For more information about the errors and possible solutions, please read the following articles:
26-Jun-2018 00:42:01 [ERROR] [Help 1] http://cwiki.apache.org/confluence/display/MAVEN/MojoFailureException
26-Jun-2018 00:42:01 [ERROR]
26-Jun-2018 00:42:01 [ERROR] After correcting the problems, you can resume the build with the command
26-Jun-2018 00:42:01 [ERROR]   mvn <goals> -rf :org.codehaus.groovy.eclipse.codeassist.completion.test
26-Jun-2018 00:42:01 Failing task since return code of [/opt/maven-3.3/bin/mvn --batch-mode -Djava.io.tmpdir=/tmp/GRECLIPSE-GE47-JOB1 -Pe47 clean deploy -Psnapshot] was 1 while expected 0
26-Jun-2018 00:42:01 Parsing test results under /opt/bamboo-home/xml-data/build-dir/GRECLIPSE-GE47-JOB1...
26-Jun-2018 00:42:02 Finished task 'Maven 3.x' with result: Failed
26-Jun-2018 00:42:02 Running post build plugin 'Docker Container Cleanup'
26-Jun-2018 00:42:02 Running post build plugin 'NCover Results Collector'
26-Jun-2018 00:42:02 Running post build plugin 'Artifactory Release Management Staging'
26-Jun-2018 00:42:02 Running post build plugin 'Artifactory Build Info Copier'
26-Jun-2018 00:42:02 Running post build plugin 'Artifactory Gradle Properties Info Copier'
26-Jun-2018 00:42:02 Running post build plugin 'Clover Results Collector'
26-Jun-2018 00:42:02 Running post build plugin 'npm Cache Cleanup'
26-Jun-2018 00:42:02 Running post build plugin 'Artifact Copier'
26-Jun-2018 00:42:02 Publishing an artifact: surefire-reports
26-Jun-2018 00:42:03 Finished publishing of artifact Job artifact: [surefire-reports], pattern: [**/target/TEST-*.xml] in 1.589 s
26-Jun-2018 00:42:03 Publishing an artifact: Zipped Update Site
26-Jun-2018 00:42:03 Unable to publish artifact [Zipped Update Site]: the source directory /opt/bamboo-home/xml-data/build-dir/GRECLIPSE-GE47-JOB1/Site-org.codehaus.groovy.eclipse/target/site does not exist.
26-Jun-2018 00:42:03 The artifact hasn't been successfully published after 800.1 μs
26-Jun-2018 00:42:04 Successfully removed working directory at '/opt/bamboo-home/xml-data/build-dir/GRECLIPSE-GE47-JOB1'
26-Jun-2018 00:42:04 Finalising the build...
26-Jun-2018 00:42:04 Stopping timer.
26-Jun-2018 00:42:04 Build GRECLIPSE-GE47-JOB1-510 completed.
26-Jun-2018 00:42:04 Running on server: post build plugin 'NCover Results Collector'
26-Jun-2018 00:42:04 Running on server: post build plugin 'Build Hanging Detection Configuration'
26-Jun-2018 00:42:04 Running on server: post build plugin 'Clover Delta Calculator'
26-Jun-2018 00:42:04 Running on server: post build plugin 'Maven Dependencies Postprocessor'
26-Jun-2018 00:42:04 All post build plugins have finished
26-Jun-2018 00:42:04 Generating build results summary...
26-Jun-2018 00:42:04 Saving build results to disk...
26-Jun-2018 00:42:05 Logging substituted variables...
26-Jun-2018 00:42:05 Indexing build results...
26-Jun-2018 00:42:05 Finished building GRECLIPSE-GE47-JOB1-510.