Build and test Groovy-Eclipse on Eclipse 4.7 (Oxygen)

Build: #512 failed

Job: Default Job failed

Stages & jobs

  1. Default Stage

Build log

The build generated 3,339 lines of output.The output is too long and has been truncated to the last 1,000 lines. Download or view full build log

26-Jun-2018 01:25:00 [INFO] --- tycho-packaging-plugin:0.24.0:validate-id (default-validate-id) @ org.codehaus.groovy.compilerless.feature ---
26-Jun-2018 01:25:00 [INFO]
26-Jun-2018 01:25:00 [INFO] --- tycho-packaging-plugin:0.24.0:validate-version (default-validate-version) @ org.codehaus.groovy.compilerless.feature ---
26-Jun-2018 01:25:00 [INFO]
26-Jun-2018 01:25:00 [INFO] --- properties-maven-plugin:1.0-alpha-2:read-project-properties (default) @ org.codehaus.groovy.compilerless.feature ---
26-Jun-2018 01:25:00 [INFO]
26-Jun-2018 01:25:00 [INFO] --- tycho-source-plugin:0.24.0:plugin-source (plugin-source) @ org.codehaus.groovy.compilerless.feature ---
26-Jun-2018 01:25:00 [INFO]
26-Jun-2018 01:25:00 [INFO] --- target-platform-configuration:0.24.0:target-platform (default-target-platform) @ org.codehaus.groovy.compilerless.feature ---
26-Jun-2018 01:25:00 [INFO]
26-Jun-2018 01:25:00 [INFO] --- tycho-packaging-plugin:0.24.0:package-feature (default-package-feature) @ org.codehaus.groovy.compilerless.feature ---
26-Jun-2018 01:25:00 [INFO] Building jar: /opt/bamboo-home/xml-data/build-dir/GRECLIPSE-GE47-JOB1/ide/Feature-org.codehaus.groovy.compilerless.feature/target/org.codehaus.groovy.compilerless.feature-2.9.3-SNAPSHOT.jar
26-Jun-2018 01:25:00 [INFO]
26-Jun-2018 01:25:00 [INFO] --- tycho-p2-plugin:0.24.0:p2-metadata-default (default-p2-metadata-default) @ org.codehaus.groovy.compilerless.feature ---
26-Jun-2018 01:25:00 [INFO]
26-Jun-2018 01:25:00 [INFO] --- tycho-p2-plugin:0.24.0:feature-p2-metadata (default-feature-p2-metadata) @ org.codehaus.groovy.compilerless.feature ---
26-Jun-2018 01:25:00 [INFO]
26-Jun-2018 01:25:00 [INFO] --- maven-jarsigner-plugin:1.2:sign (sign) @ org.codehaus.groovy.compilerless.feature ---
26-Jun-2018 01:25:01 [INFO] 1 archive(s) processed
26-Jun-2018 01:25:01 [INFO]
26-Jun-2018 01:25:01 [INFO] --- tycho-source-feature-plugin:0.24.0:source-feature (source-feature) @ org.codehaus.groovy.compilerless.feature ---
26-Jun-2018 01:25:01 [INFO] Building jar: /opt/bamboo-home/xml-data/build-dir/GRECLIPSE-GE47-JOB1/ide/Feature-org.codehaus.groovy.compilerless.feature/target/org.codehaus.groovy.compilerless.feature-2.9.3-SNAPSHOT-sources-feature.jar
26-Jun-2018 01:25:01 [INFO]
26-Jun-2018 01:25:01 [INFO] --- tycho-p2-plugin:0.24.0:p2-metadata (attach-p2-metadata) @ org.codehaus.groovy.compilerless.feature ---
26-Jun-2018 01:25:01 [INFO]
26-Jun-2018 01:25:01 [INFO] --- maven-install-plugin:2.3.1:install (default-install) @ org.codehaus.groovy.compilerless.feature ---
26-Jun-2018 01:25:01 [INFO] Installing /opt/bamboo-home/xml-data/build-dir/GRECLIPSE-GE47-JOB1/ide/Feature-org.codehaus.groovy.compilerless.feature/target/org.codehaus.groovy.compilerless.feature-2.9.3-SNAPSHOT.jar to /home/bamboo/.m2/repository/org/codehaus/groovy/eclipse/org.codehaus.groovy.compilerless.feature/2.9.3-SNAPSHOT/org.codehaus.groovy.compilerless.feature-2.9.3-SNAPSHOT.jar
26-Jun-2018 01:25:01 [INFO] Installing /opt/bamboo-home/xml-data/build-dir/GRECLIPSE-GE47-JOB1/ide/Feature-org.codehaus.groovy.compilerless.feature/pom.xml to /home/bamboo/.m2/repository/org/codehaus/groovy/eclipse/org.codehaus.groovy.compilerless.feature/2.9.3-SNAPSHOT/org.codehaus.groovy.compilerless.feature-2.9.3-SNAPSHOT.pom
26-Jun-2018 01:25:01 [INFO] Installing /opt/bamboo-home/xml-data/build-dir/GRECLIPSE-GE47-JOB1/ide/Feature-org.codehaus.groovy.compilerless.feature/target/p2content.xml to /home/bamboo/.m2/repository/org/codehaus/groovy/eclipse/org.codehaus.groovy.compilerless.feature/2.9.3-SNAPSHOT/org.codehaus.groovy.compilerless.feature-2.9.3-SNAPSHOT-p2metadata.xml
26-Jun-2018 01:25:01 [INFO] Installing /opt/bamboo-home/xml-data/build-dir/GRECLIPSE-GE47-JOB1/ide/Feature-org.codehaus.groovy.compilerless.feature/target/p2artifacts.xml to /home/bamboo/.m2/repository/org/codehaus/groovy/eclipse/org.codehaus.groovy.compilerless.feature/2.9.3-SNAPSHOT/org.codehaus.groovy.compilerless.feature-2.9.3-SNAPSHOT-p2artifacts.xml
26-Jun-2018 01:25:01 [INFO] Installing /opt/bamboo-home/xml-data/build-dir/GRECLIPSE-GE47-JOB1/ide/Feature-org.codehaus.groovy.compilerless.feature/target/org.codehaus.groovy.compilerless.feature-2.9.3-SNAPSHOT-sources-feature.jar to /home/bamboo/.m2/repository/org/codehaus/groovy/eclipse/org.codehaus.groovy.compilerless.feature/2.9.3-SNAPSHOT/org.codehaus.groovy.compilerless.feature-2.9.3-SNAPSHOT-sources-feature.jar
26-Jun-2018 01:25:01 [INFO] Installing /opt/bamboo-home/xml-data/build-dir/GRECLIPSE-GE47-JOB1/ide/Feature-org.codehaus.groovy.compilerless.feature/target/p2content.xml to /home/bamboo/.m2/repository/org/codehaus/groovy/eclipse/org.codehaus.groovy.compilerless.feature/2.9.3-SNAPSHOT/org.codehaus.groovy.compilerless.feature-2.9.3-SNAPSHOT-p2metadata.xml
26-Jun-2018 01:25:01 [INFO] Installing /opt/bamboo-home/xml-data/build-dir/GRECLIPSE-GE47-JOB1/ide/Feature-org.codehaus.groovy.compilerless.feature/target/p2artifacts.xml to /home/bamboo/.m2/repository/org/codehaus/groovy/eclipse/org.codehaus.groovy.compilerless.feature/2.9.3-SNAPSHOT/org.codehaus.groovy.compilerless.feature-2.9.3-SNAPSHOT-p2artifacts.xml
26-Jun-2018 01:25:01 [INFO]
26-Jun-2018 01:25:01 [INFO] --- tycho-p2-plugin:0.24.0:update-local-index (default-update-local-index) @ org.codehaus.groovy.compilerless.feature ---
26-Jun-2018 01:25:01 [INFO]
26-Jun-2018 01:25:01 [INFO] --- maven-deploy-plugin:2.5:deploy (default-deploy) @ org.codehaus.groovy.compilerless.feature ---
26-Jun-2018 01:25:01 [INFO] Skipping artifact deployment
26-Jun-2018 01:25:01 [INFO]                                                                         
26-Jun-2018 01:25:01 [INFO] ------------------------------------------------------------------------
26-Jun-2018 01:25:01 [INFO] Building org.codehaus.groovy.eclipse.feature 2.9.3-SNAPSHOT
26-Jun-2018 01:25:01 [INFO] ------------------------------------------------------------------------
26-Jun-2018 01:25:01 [INFO]
26-Jun-2018 01:25:01 [INFO] --- maven-clean-plugin:2.5:clean (default-clean) @ org.codehaus.groovy.eclipse.feature ---
26-Jun-2018 01:25:01 [INFO] Deleting /opt/bamboo-home/xml-data/build-dir/GRECLIPSE-GE47-JOB1/ide/Feature-org.codehaus.groovy.eclipse.feature/target
26-Jun-2018 01:25:01 [INFO]
26-Jun-2018 01:25:01 [INFO] --- tycho-packaging-plugin:0.24.0:build-qualifier-aggregator (default-build-qualifier-aggregator) @ org.codehaus.groovy.eclipse.feature ---
26-Jun-2018 01:25:01 [INFO] The project's OSGi version is 2.9.3.xx-201806260123-e47
26-Jun-2018 01:25:01 [INFO]
26-Jun-2018 01:25:01 [INFO] --- tycho-packaging-plugin:0.24.0:validate-id (default-validate-id) @ org.codehaus.groovy.eclipse.feature ---
26-Jun-2018 01:25:01 [INFO]
26-Jun-2018 01:25:01 [INFO] --- tycho-packaging-plugin:0.24.0:validate-version (default-validate-version) @ org.codehaus.groovy.eclipse.feature ---
26-Jun-2018 01:25:01 [INFO]
26-Jun-2018 01:25:01 [INFO] --- properties-maven-plugin:1.0-alpha-2:read-project-properties (default) @ org.codehaus.groovy.eclipse.feature ---
26-Jun-2018 01:25:01 [INFO]
26-Jun-2018 01:25:01 [INFO] --- tycho-source-plugin:0.24.0:plugin-source (plugin-source) @ org.codehaus.groovy.eclipse.feature ---
26-Jun-2018 01:25:01 [INFO]
26-Jun-2018 01:25:01 [INFO] --- target-platform-configuration:0.24.0:target-platform (default-target-platform) @ org.codehaus.groovy.eclipse.feature ---
26-Jun-2018 01:25:01 [INFO]
26-Jun-2018 01:25:01 [INFO] --- tycho-packaging-plugin:0.24.0:package-feature (default-package-feature) @ org.codehaus.groovy.eclipse.feature ---
26-Jun-2018 01:25:01 [INFO] Building jar: /opt/bamboo-home/xml-data/build-dir/GRECLIPSE-GE47-JOB1/ide/Feature-org.codehaus.groovy.eclipse.feature/target/org.codehaus.groovy.eclipse.feature-2.9.3-SNAPSHOT.jar
26-Jun-2018 01:25:01 [INFO]
26-Jun-2018 01:25:01 [INFO] --- tycho-p2-plugin:0.24.0:p2-metadata-default (default-p2-metadata-default) @ org.codehaus.groovy.eclipse.feature ---
26-Jun-2018 01:25:01 [INFO]
26-Jun-2018 01:25:01 [INFO] --- tycho-p2-plugin:0.24.0:feature-p2-metadata (default-feature-p2-metadata) @ org.codehaus.groovy.eclipse.feature ---
26-Jun-2018 01:25:01 [INFO]
26-Jun-2018 01:25:01 [INFO] --- maven-jarsigner-plugin:1.2:sign (sign) @ org.codehaus.groovy.eclipse.feature ---
26-Jun-2018 01:25:01 [INFO] 1 archive(s) processed
26-Jun-2018 01:25:01 [INFO]
26-Jun-2018 01:25:01 [INFO] --- tycho-source-feature-plugin:0.24.0:source-feature (source-feature) @ org.codehaus.groovy.eclipse.feature ---
26-Jun-2018 01:25:02 [INFO] Building jar: /opt/bamboo-home/xml-data/build-dir/GRECLIPSE-GE47-JOB1/ide/Feature-org.codehaus.groovy.eclipse.feature/target/org.codehaus.groovy.eclipse.feature-2.9.3-SNAPSHOT-sources-feature.jar
26-Jun-2018 01:25:02 [INFO]
26-Jun-2018 01:25:02 [INFO] --- tycho-p2-plugin:0.24.0:p2-metadata (attach-p2-metadata) @ org.codehaus.groovy.eclipse.feature ---
26-Jun-2018 01:25:02 [INFO]
26-Jun-2018 01:25:02 [INFO] --- maven-install-plugin:2.3.1:install (default-install) @ org.codehaus.groovy.eclipse.feature ---
26-Jun-2018 01:25:02 [INFO] Installing /opt/bamboo-home/xml-data/build-dir/GRECLIPSE-GE47-JOB1/ide/Feature-org.codehaus.groovy.eclipse.feature/target/org.codehaus.groovy.eclipse.feature-2.9.3-SNAPSHOT.jar to /home/bamboo/.m2/repository/org/codehaus/groovy/eclipse/org.codehaus.groovy.eclipse.feature/2.9.3-SNAPSHOT/org.codehaus.groovy.eclipse.feature-2.9.3-SNAPSHOT.jar
26-Jun-2018 01:25:02 [INFO] Installing /opt/bamboo-home/xml-data/build-dir/GRECLIPSE-GE47-JOB1/ide/Feature-org.codehaus.groovy.eclipse.feature/pom.xml to /home/bamboo/.m2/repository/org/codehaus/groovy/eclipse/org.codehaus.groovy.eclipse.feature/2.9.3-SNAPSHOT/org.codehaus.groovy.eclipse.feature-2.9.3-SNAPSHOT.pom
26-Jun-2018 01:25:02 [INFO] Installing /opt/bamboo-home/xml-data/build-dir/GRECLIPSE-GE47-JOB1/ide/Feature-org.codehaus.groovy.eclipse.feature/target/p2content.xml to /home/bamboo/.m2/repository/org/codehaus/groovy/eclipse/org.codehaus.groovy.eclipse.feature/2.9.3-SNAPSHOT/org.codehaus.groovy.eclipse.feature-2.9.3-SNAPSHOT-p2metadata.xml
26-Jun-2018 01:25:02 [INFO] Installing /opt/bamboo-home/xml-data/build-dir/GRECLIPSE-GE47-JOB1/ide/Feature-org.codehaus.groovy.eclipse.feature/target/p2artifacts.xml to /home/bamboo/.m2/repository/org/codehaus/groovy/eclipse/org.codehaus.groovy.eclipse.feature/2.9.3-SNAPSHOT/org.codehaus.groovy.eclipse.feature-2.9.3-SNAPSHOT-p2artifacts.xml
26-Jun-2018 01:25:02 [INFO] Installing /opt/bamboo-home/xml-data/build-dir/GRECLIPSE-GE47-JOB1/ide/Feature-org.codehaus.groovy.eclipse.feature/target/org.codehaus.groovy.eclipse.feature-2.9.3-SNAPSHOT-sources-feature.jar to /home/bamboo/.m2/repository/org/codehaus/groovy/eclipse/org.codehaus.groovy.eclipse.feature/2.9.3-SNAPSHOT/org.codehaus.groovy.eclipse.feature-2.9.3-SNAPSHOT-sources-feature.jar
26-Jun-2018 01:25:02 [INFO] Installing /opt/bamboo-home/xml-data/build-dir/GRECLIPSE-GE47-JOB1/ide/Feature-org.codehaus.groovy.eclipse.feature/target/p2content.xml to /home/bamboo/.m2/repository/org/codehaus/groovy/eclipse/org.codehaus.groovy.eclipse.feature/2.9.3-SNAPSHOT/org.codehaus.groovy.eclipse.feature-2.9.3-SNAPSHOT-p2metadata.xml
26-Jun-2018 01:25:02 [INFO] Installing /opt/bamboo-home/xml-data/build-dir/GRECLIPSE-GE47-JOB1/ide/Feature-org.codehaus.groovy.eclipse.feature/target/p2artifacts.xml to /home/bamboo/.m2/repository/org/codehaus/groovy/eclipse/org.codehaus.groovy.eclipse.feature/2.9.3-SNAPSHOT/org.codehaus.groovy.eclipse.feature-2.9.3-SNAPSHOT-p2artifacts.xml
26-Jun-2018 01:25:02 [INFO]
26-Jun-2018 01:25:02 [INFO] --- tycho-p2-plugin:0.24.0:update-local-index (default-update-local-index) @ org.codehaus.groovy.eclipse.feature ---
26-Jun-2018 01:25:02 [INFO]
26-Jun-2018 01:25:02 [INFO] --- maven-deploy-plugin:2.5:deploy (default-deploy) @ org.codehaus.groovy.eclipse.feature ---
26-Jun-2018 01:25:02 [INFO] Skipping artifact deployment
26-Jun-2018 01:25:02 [INFO]                                                                         
26-Jun-2018 01:25:02 [INFO] ------------------------------------------------------------------------
26-Jun-2018 01:25:02 [INFO] Building org.eclipse.jdt.core.tests.compiler 3.12.360-SNAPSHOT
26-Jun-2018 01:25:02 [INFO] ------------------------------------------------------------------------
26-Jun-2018 01:25:02 [INFO]
26-Jun-2018 01:25:02 [INFO] --- maven-clean-plugin:2.5:clean (default-clean) @ org.eclipse.jdt.core.tests.compiler ---
26-Jun-2018 01:25:02 [INFO] Deleting /opt/bamboo-home/xml-data/build-dir/GRECLIPSE-GE47-JOB1/jdt-patch/e47/org.eclipse.jdt.core.tests.compiler (includes = [test.dat], excludes = [])
26-Jun-2018 01:25:02 [INFO]
26-Jun-2018 01:25:02 [INFO] --- tycho-packaging-plugin:0.24.0:build-qualifier (default-build-qualifier) @ org.eclipse.jdt.core.tests.compiler ---
26-Jun-2018 01:25:02 [INFO] The project's OSGi version is 3.12.360.xx-201806260123-e47
26-Jun-2018 01:25:02 [INFO]
26-Jun-2018 01:25:02 [INFO] --- tycho-packaging-plugin:0.24.0:validate-id (default-validate-id) @ org.eclipse.jdt.core.tests.compiler ---
26-Jun-2018 01:25:02 [INFO]
26-Jun-2018 01:25:02 [INFO] --- tycho-packaging-plugin:0.24.0:validate-version (default-validate-version) @ org.eclipse.jdt.core.tests.compiler ---
26-Jun-2018 01:25:02 [INFO]
26-Jun-2018 01:25:02 [INFO] --- properties-maven-plugin:1.0-alpha-2:read-project-properties (default) @ org.eclipse.jdt.core.tests.compiler ---
26-Jun-2018 01:25:02 [INFO]
26-Jun-2018 01:25:02 [INFO] --- maven-resources-plugin:2.4.3:resources (default-resources) @ org.eclipse.jdt.core.tests.compiler ---
26-Jun-2018 01:25:02 [WARNING] Using platform encoding (UTF-8 actually) to copy filtered resources, i.e. build is platform dependent!
26-Jun-2018 01:25:02 [INFO] skip non existing resourceDirectory /opt/bamboo-home/xml-data/build-dir/GRECLIPSE-GE47-JOB1/jdt-patch/e47/org.eclipse.jdt.core.tests.compiler/src/main/resources
26-Jun-2018 01:25:02 [INFO]
26-Jun-2018 01:25:02 [INFO] --- tycho-compiler-plugin:0.24.0:compile (default-compile) @ org.eclipse.jdt.core.tests.compiler ---
26-Jun-2018 01:25:02 [INFO] Compiling 243 source files to /opt/bamboo-home/xml-data/build-dir/GRECLIPSE-GE47-JOB1/jdt-patch/e47/org.eclipse.jdt.core.tests.compiler/target/classes
26-Jun-2018 01:25:05 [INFO]
26-Jun-2018 01:25:05 [INFO] --- maven-resources-plugin:2.4.3:testResources (default-testResources) @ org.eclipse.jdt.core.tests.compiler ---
26-Jun-2018 01:25:05 [WARNING] Using platform encoding (UTF-8 actually) to copy filtered resources, i.e. build is platform dependent!
26-Jun-2018 01:25:05 [INFO] skip non existing resourceDirectory /opt/bamboo-home/xml-data/build-dir/GRECLIPSE-GE47-JOB1/jdt-patch/e47/org.eclipse.jdt.core.tests.compiler/src/test/resources
26-Jun-2018 01:25:05 [INFO]
26-Jun-2018 01:25:05 [INFO] --- tycho-source-plugin:0.24.0:plugin-source (plugin-source) @ org.eclipse.jdt.core.tests.compiler ---
26-Jun-2018 01:25:05 [INFO] Building jar: /opt/bamboo-home/xml-data/build-dir/GRECLIPSE-GE47-JOB1/jdt-patch/e47/org.eclipse.jdt.core.tests.compiler/target/org.eclipse.jdt.core.tests.compiler-3.12.360-SNAPSHOT-sources.jar
26-Jun-2018 01:25:06 [INFO]
26-Jun-2018 01:25:06 [INFO] --- target-platform-configuration:0.24.0:target-platform (default-target-platform) @ org.eclipse.jdt.core.tests.compiler ---
26-Jun-2018 01:25:06 [INFO]
26-Jun-2018 01:25:06 [INFO] --- tycho-packaging-plugin:0.24.0:package-plugin (default-package-plugin) @ org.eclipse.jdt.core.tests.compiler ---
26-Jun-2018 01:25:06 [INFO] Building jar: /opt/bamboo-home/xml-data/build-dir/GRECLIPSE-GE47-JOB1/jdt-patch/e47/org.eclipse.jdt.core.tests.compiler/target/org.eclipse.jdt.core.tests.compiler-3.12.360-SNAPSHOT.jar
26-Jun-2018 01:25:07 [INFO]
26-Jun-2018 01:25:07 [INFO] --- tycho-p2-plugin:0.24.0:p2-metadata-default (default-p2-metadata-default) @ org.eclipse.jdt.core.tests.compiler ---
26-Jun-2018 01:25:07 [INFO]
26-Jun-2018 01:25:07 [INFO] --- maven-jarsigner-plugin:1.2:sign (sign) @ org.eclipse.jdt.core.tests.compiler ---
26-Jun-2018 01:25:10 [INFO] 2 archive(s) processed
26-Jun-2018 01:25:10 [INFO]
26-Jun-2018 01:25:10 [INFO] --- tycho-source-feature-plugin:0.24.0:source-feature (source-feature) @ org.eclipse.jdt.core.tests.compiler ---
26-Jun-2018 01:25:10 [INFO]
26-Jun-2018 01:25:10 [INFO] --- tycho-p2-plugin:0.24.0:p2-metadata (attach-p2-metadata) @ org.eclipse.jdt.core.tests.compiler ---
26-Jun-2018 01:25:10 [INFO]
26-Jun-2018 01:25:10 [INFO] --- maven-install-plugin:2.3.1:install (default-install) @ org.eclipse.jdt.core.tests.compiler ---
26-Jun-2018 01:25:10 [INFO] Installing /opt/bamboo-home/xml-data/build-dir/GRECLIPSE-GE47-JOB1/jdt-patch/e47/org.eclipse.jdt.core.tests.compiler/target/org.eclipse.jdt.core.tests.compiler-3.12.360-SNAPSHOT.jar to /home/bamboo/.m2/repository/org/eclipse/jdt/org.eclipse.jdt.core.tests.compiler/3.12.360-SNAPSHOT/org.eclipse.jdt.core.tests.compiler-3.12.360-SNAPSHOT.jar
26-Jun-2018 01:25:10 [INFO] Installing /opt/bamboo-home/xml-data/build-dir/GRECLIPSE-GE47-JOB1/jdt-patch/e47/org.eclipse.jdt.core.tests.compiler/pom.xml to /home/bamboo/.m2/repository/org/eclipse/jdt/org.eclipse.jdt.core.tests.compiler/3.12.360-SNAPSHOT/org.eclipse.jdt.core.tests.compiler-3.12.360-SNAPSHOT.pom
26-Jun-2018 01:25:10 [INFO] Installing /opt/bamboo-home/xml-data/build-dir/GRECLIPSE-GE47-JOB1/jdt-patch/e47/org.eclipse.jdt.core.tests.compiler/target/org.eclipse.jdt.core.tests.compiler-3.12.360-SNAPSHOT-sources.jar to /home/bamboo/.m2/repository/org/eclipse/jdt/org.eclipse.jdt.core.tests.compiler/3.12.360-SNAPSHOT/org.eclipse.jdt.core.tests.compiler-3.12.360-SNAPSHOT-sources.jar
26-Jun-2018 01:25:10 [INFO] Installing /opt/bamboo-home/xml-data/build-dir/GRECLIPSE-GE47-JOB1/jdt-patch/e47/org.eclipse.jdt.core.tests.compiler/target/p2content.xml to /home/bamboo/.m2/repository/org/eclipse/jdt/org.eclipse.jdt.core.tests.compiler/3.12.360-SNAPSHOT/org.eclipse.jdt.core.tests.compiler-3.12.360-SNAPSHOT-p2metadata.xml
26-Jun-2018 01:25:10 [INFO] Installing /opt/bamboo-home/xml-data/build-dir/GRECLIPSE-GE47-JOB1/jdt-patch/e47/org.eclipse.jdt.core.tests.compiler/target/p2artifacts.xml to /home/bamboo/.m2/repository/org/eclipse/jdt/org.eclipse.jdt.core.tests.compiler/3.12.360-SNAPSHOT/org.eclipse.jdt.core.tests.compiler-3.12.360-SNAPSHOT-p2artifacts.xml
26-Jun-2018 01:25:10 [INFO] Installing /opt/bamboo-home/xml-data/build-dir/GRECLIPSE-GE47-JOB1/jdt-patch/e47/org.eclipse.jdt.core.tests.compiler/target/p2content.xml to /home/bamboo/.m2/repository/org/eclipse/jdt/org.eclipse.jdt.core.tests.compiler/3.12.360-SNAPSHOT/org.eclipse.jdt.core.tests.compiler-3.12.360-SNAPSHOT-p2metadata.xml
26-Jun-2018 01:25:10 [INFO] Installing /opt/bamboo-home/xml-data/build-dir/GRECLIPSE-GE47-JOB1/jdt-patch/e47/org.eclipse.jdt.core.tests.compiler/target/p2artifacts.xml to /home/bamboo/.m2/repository/org/eclipse/jdt/org.eclipse.jdt.core.tests.compiler/3.12.360-SNAPSHOT/org.eclipse.jdt.core.tests.compiler-3.12.360-SNAPSHOT-p2artifacts.xml
26-Jun-2018 01:25:10 [INFO]
26-Jun-2018 01:25:10 [INFO] --- tycho-p2-plugin:0.24.0:update-local-index (default-update-local-index) @ org.eclipse.jdt.core.tests.compiler ---
26-Jun-2018 01:25:10 [INFO]
26-Jun-2018 01:25:10 [INFO] --- maven-deploy-plugin:2.5:deploy (default-deploy) @ org.eclipse.jdt.core.tests.compiler ---
26-Jun-2018 01:25:10 [INFO] Skipping artifact deployment
26-Jun-2018 01:25:10 [INFO]                                                                         
26-Jun-2018 01:25:10 [INFO] ------------------------------------------------------------------------
26-Jun-2018 01:25:10 [INFO] Building org.eclipse.jdt.core.tests.builder 3.10.60-SNAPSHOT
26-Jun-2018 01:25:10 [INFO] ------------------------------------------------------------------------
26-Jun-2018 01:25:10 [INFO]
26-Jun-2018 01:25:10 [INFO] --- maven-clean-plugin:2.5:clean (default-clean) @ org.eclipse.jdt.core.tests.builder ---
26-Jun-2018 01:25:10 [INFO]
26-Jun-2018 01:25:10 [INFO] --- tycho-packaging-plugin:0.24.0:build-qualifier (default-build-qualifier) @ org.eclipse.jdt.core.tests.builder ---
26-Jun-2018 01:25:10 [INFO] The project's OSGi version is 3.10.60.xx-201806260123-e47
26-Jun-2018 01:25:10 [INFO]
26-Jun-2018 01:25:10 [INFO] --- tycho-packaging-plugin:0.24.0:validate-id (default-validate-id) @ org.eclipse.jdt.core.tests.builder ---
26-Jun-2018 01:25:10 [INFO]
26-Jun-2018 01:25:10 [INFO] --- tycho-packaging-plugin:0.24.0:validate-version (default-validate-version) @ org.eclipse.jdt.core.tests.builder ---
26-Jun-2018 01:25:10 [INFO]
26-Jun-2018 01:25:10 [INFO] --- properties-maven-plugin:1.0-alpha-2:read-project-properties (default) @ org.eclipse.jdt.core.tests.builder ---
26-Jun-2018 01:25:10 [INFO]
26-Jun-2018 01:25:10 [INFO] --- maven-resources-plugin:2.4.3:resources (default-resources) @ org.eclipse.jdt.core.tests.builder ---
26-Jun-2018 01:25:10 [WARNING] Using platform encoding (UTF-8 actually) to copy filtered resources, i.e. build is platform dependent!
26-Jun-2018 01:25:10 [INFO] skip non existing resourceDirectory /opt/bamboo-home/xml-data/build-dir/GRECLIPSE-GE47-JOB1/jdt-patch/e47/org.eclipse.jdt.core.tests.builder/src/main/resources
26-Jun-2018 01:25:10 [INFO]
26-Jun-2018 01:25:10 [INFO] --- tycho-compiler-plugin:0.24.0:compile (default-compile) @ org.eclipse.jdt.core.tests.builder ---
26-Jun-2018 01:25:10 [INFO] Compiling 26 source files to /opt/bamboo-home/xml-data/build-dir/GRECLIPSE-GE47-JOB1/jdt-patch/e47/org.eclipse.jdt.core.tests.builder/target/classes
26-Jun-2018 01:25:10 [INFO]
26-Jun-2018 01:25:10 [INFO] --- maven-resources-plugin:2.4.3:testResources (default-testResources) @ org.eclipse.jdt.core.tests.builder ---
26-Jun-2018 01:25:10 [WARNING] Using platform encoding (UTF-8 actually) to copy filtered resources, i.e. build is platform dependent!
26-Jun-2018 01:25:10 [INFO] skip non existing resourceDirectory /opt/bamboo-home/xml-data/build-dir/GRECLIPSE-GE47-JOB1/jdt-patch/e47/org.eclipse.jdt.core.tests.builder/src/test/resources
26-Jun-2018 01:25:10 [INFO]
26-Jun-2018 01:25:10 [INFO] --- tycho-source-plugin:0.24.0:plugin-source (plugin-source) @ org.eclipse.jdt.core.tests.builder ---
26-Jun-2018 01:25:10 [INFO] Building jar: /opt/bamboo-home/xml-data/build-dir/GRECLIPSE-GE47-JOB1/jdt-patch/e47/org.eclipse.jdt.core.tests.builder/target/org.eclipse.jdt.core.tests.builder-3.10.60-SNAPSHOT-sources.jar
26-Jun-2018 01:25:10 [INFO]
26-Jun-2018 01:25:10 [INFO] --- target-platform-configuration:0.24.0:target-platform (default-target-platform) @ org.eclipse.jdt.core.tests.builder ---
26-Jun-2018 01:25:10 [INFO]
26-Jun-2018 01:25:10 [INFO] --- tycho-packaging-plugin:0.24.0:package-plugin (default-package-plugin) @ org.eclipse.jdt.core.tests.builder ---
26-Jun-2018 01:25:10 [INFO] Building jar: /opt/bamboo-home/xml-data/build-dir/GRECLIPSE-GE47-JOB1/jdt-patch/e47/org.eclipse.jdt.core.tests.builder/target/org.eclipse.jdt.core.tests.builder-3.10.60-SNAPSHOT.jar
26-Jun-2018 01:25:10 [INFO]
26-Jun-2018 01:25:10 [INFO] --- tycho-p2-plugin:0.24.0:p2-metadata-default (default-p2-metadata-default) @ org.eclipse.jdt.core.tests.builder ---
26-Jun-2018 01:25:10 [INFO]
26-Jun-2018 01:25:10 [INFO] --- maven-jarsigner-plugin:1.2:sign (sign) @ org.eclipse.jdt.core.tests.builder ---
26-Jun-2018 01:25:11 [INFO] 2 archive(s) processed
26-Jun-2018 01:25:11 [INFO]
26-Jun-2018 01:25:11 [INFO] --- tycho-source-feature-plugin:0.24.0:source-feature (source-feature) @ org.eclipse.jdt.core.tests.builder ---
26-Jun-2018 01:25:11 [INFO]
26-Jun-2018 01:25:11 [INFO] --- tycho-p2-plugin:0.24.0:p2-metadata (attach-p2-metadata) @ org.eclipse.jdt.core.tests.builder ---
26-Jun-2018 01:25:11 [INFO]
26-Jun-2018 01:25:11 [INFO] --- maven-install-plugin:2.3.1:install (default-install) @ org.eclipse.jdt.core.tests.builder ---
26-Jun-2018 01:25:11 [INFO] Installing /opt/bamboo-home/xml-data/build-dir/GRECLIPSE-GE47-JOB1/jdt-patch/e47/org.eclipse.jdt.core.tests.builder/target/org.eclipse.jdt.core.tests.builder-3.10.60-SNAPSHOT.jar to /home/bamboo/.m2/repository/org/eclipse/jdt/org.eclipse.jdt.core.tests.builder/3.10.60-SNAPSHOT/org.eclipse.jdt.core.tests.builder-3.10.60-SNAPSHOT.jar
26-Jun-2018 01:25:11 [INFO] Installing /opt/bamboo-home/xml-data/build-dir/GRECLIPSE-GE47-JOB1/jdt-patch/e47/org.eclipse.jdt.core.tests.builder/pom.xml to /home/bamboo/.m2/repository/org/eclipse/jdt/org.eclipse.jdt.core.tests.builder/3.10.60-SNAPSHOT/org.eclipse.jdt.core.tests.builder-3.10.60-SNAPSHOT.pom
26-Jun-2018 01:25:11 [INFO] Installing /opt/bamboo-home/xml-data/build-dir/GRECLIPSE-GE47-JOB1/jdt-patch/e47/org.eclipse.jdt.core.tests.builder/target/org.eclipse.jdt.core.tests.builder-3.10.60-SNAPSHOT-sources.jar to /home/bamboo/.m2/repository/org/eclipse/jdt/org.eclipse.jdt.core.tests.builder/3.10.60-SNAPSHOT/org.eclipse.jdt.core.tests.builder-3.10.60-SNAPSHOT-sources.jar
26-Jun-2018 01:25:11 [INFO] Installing /opt/bamboo-home/xml-data/build-dir/GRECLIPSE-GE47-JOB1/jdt-patch/e47/org.eclipse.jdt.core.tests.builder/target/p2content.xml to /home/bamboo/.m2/repository/org/eclipse/jdt/org.eclipse.jdt.core.tests.builder/3.10.60-SNAPSHOT/org.eclipse.jdt.core.tests.builder-3.10.60-SNAPSHOT-p2metadata.xml
26-Jun-2018 01:25:11 [INFO] Installing /opt/bamboo-home/xml-data/build-dir/GRECLIPSE-GE47-JOB1/jdt-patch/e47/org.eclipse.jdt.core.tests.builder/target/p2artifacts.xml to /home/bamboo/.m2/repository/org/eclipse/jdt/org.eclipse.jdt.core.tests.builder/3.10.60-SNAPSHOT/org.eclipse.jdt.core.tests.builder-3.10.60-SNAPSHOT-p2artifacts.xml
26-Jun-2018 01:25:11 [INFO] Installing /opt/bamboo-home/xml-data/build-dir/GRECLIPSE-GE47-JOB1/jdt-patch/e47/org.eclipse.jdt.core.tests.builder/target/p2content.xml to /home/bamboo/.m2/repository/org/eclipse/jdt/org.eclipse.jdt.core.tests.builder/3.10.60-SNAPSHOT/org.eclipse.jdt.core.tests.builder-3.10.60-SNAPSHOT-p2metadata.xml
26-Jun-2018 01:25:11 [INFO] Installing /opt/bamboo-home/xml-data/build-dir/GRECLIPSE-GE47-JOB1/jdt-patch/e47/org.eclipse.jdt.core.tests.builder/target/p2artifacts.xml to /home/bamboo/.m2/repository/org/eclipse/jdt/org.eclipse.jdt.core.tests.builder/3.10.60-SNAPSHOT/org.eclipse.jdt.core.tests.builder-3.10.60-SNAPSHOT-p2artifacts.xml
26-Jun-2018 01:25:11 [INFO]
26-Jun-2018 01:25:11 [INFO] --- tycho-p2-plugin:0.24.0:update-local-index (default-update-local-index) @ org.eclipse.jdt.core.tests.builder ---
26-Jun-2018 01:25:11 [INFO]
26-Jun-2018 01:25:11 [INFO] --- maven-deploy-plugin:2.5:deploy (default-deploy) @ org.eclipse.jdt.core.tests.builder ---
26-Jun-2018 01:25:11 [INFO] Skipping artifact deployment
26-Jun-2018 01:25:11 [INFO]                                                                         
26-Jun-2018 01:25:11 [INFO] ------------------------------------------------------------------------
26-Jun-2018 01:25:11 [INFO] Building org.eclipse.jdt.groovy.core.tests.compiler 2.9.3-SNAPSHOT
26-Jun-2018 01:25:11 [INFO] ------------------------------------------------------------------------
26-Jun-2018 01:25:11 [INFO]
26-Jun-2018 01:25:11 [INFO] --- maven-clean-plugin:2.5:clean (default-clean) @ org.eclipse.jdt.groovy.core.tests.compiler ---
26-Jun-2018 01:25:11 [INFO]
26-Jun-2018 01:25:11 [INFO] --- tycho-packaging-plugin:0.24.0:build-qualifier (default-build-qualifier) @ org.eclipse.jdt.groovy.core.tests.compiler ---
26-Jun-2018 01:25:11 [INFO] The project's OSGi version is 2.9.3.xx-201806260123-e47
26-Jun-2018 01:25:11 [INFO]
26-Jun-2018 01:25:11 [INFO] --- tycho-packaging-plugin:0.24.0:validate-id (default-validate-id) @ org.eclipse.jdt.groovy.core.tests.compiler ---
26-Jun-2018 01:25:11 [INFO]
26-Jun-2018 01:25:11 [INFO] --- tycho-packaging-plugin:0.24.0:validate-version (default-validate-version) @ org.eclipse.jdt.groovy.core.tests.compiler ---
26-Jun-2018 01:25:11 [INFO]
26-Jun-2018 01:25:11 [INFO] --- properties-maven-plugin:1.0-alpha-2:read-project-properties (default) @ org.eclipse.jdt.groovy.core.tests.compiler ---
26-Jun-2018 01:25:11 [INFO]
26-Jun-2018 01:25:11 [INFO] --- maven-resources-plugin:2.4.3:resources (default-resources) @ org.eclipse.jdt.groovy.core.tests.compiler ---
26-Jun-2018 01:25:11 [WARNING] Using platform encoding (UTF-8 actually) to copy filtered resources, i.e. build is platform dependent!
26-Jun-2018 01:25:11 [INFO] skip non existing resourceDirectory /opt/bamboo-home/xml-data/build-dir/GRECLIPSE-GE47-JOB1/base-test/org.eclipse.jdt.groovy.core.tests.compiler/src/main/resources
26-Jun-2018 01:25:11 [INFO]
26-Jun-2018 01:25:11 [INFO] --- tycho-compiler-plugin:0.24.0:compile (default-compile) @ org.eclipse.jdt.groovy.core.tests.compiler ---
26-Jun-2018 01:25:11 [INFO] Compiling 10 source files to /opt/bamboo-home/xml-data/build-dir/GRECLIPSE-GE47-JOB1/base-test/org.eclipse.jdt.groovy.core.tests.compiler/target/classes
26-Jun-2018 01:25:12 [INFO]
26-Jun-2018 01:25:12 [INFO] --- maven-resources-plugin:2.4.3:testResources (default-testResources) @ org.eclipse.jdt.groovy.core.tests.compiler ---
26-Jun-2018 01:25:12 [WARNING] Using platform encoding (UTF-8 actually) to copy filtered resources, i.e. build is platform dependent!
26-Jun-2018 01:25:12 [INFO] skip non existing resourceDirectory /opt/bamboo-home/xml-data/build-dir/GRECLIPSE-GE47-JOB1/base-test/org.eclipse.jdt.groovy.core.tests.compiler/src/test/resources
26-Jun-2018 01:25:12 [INFO]
26-Jun-2018 01:25:12 [INFO] --- tycho-source-plugin:0.24.0:plugin-source (plugin-source) @ org.eclipse.jdt.groovy.core.tests.compiler ---
26-Jun-2018 01:25:12 [WARNING] bundle localization file /opt/bamboo-home/xml-data/build-dir/GRECLIPSE-GE47-JOB1/base-test/org.eclipse.jdt.groovy.core.tests.compiler/plugin.properties not found
26-Jun-2018 01:25:12 [INFO] Building jar: /opt/bamboo-home/xml-data/build-dir/GRECLIPSE-GE47-JOB1/base-test/org.eclipse.jdt.groovy.core.tests.compiler/target/org.eclipse.jdt.groovy.core.tests.compiler-2.9.3-SNAPSHOT-sources.jar
26-Jun-2018 01:25:12 [INFO]
26-Jun-2018 01:25:12 [INFO] --- target-platform-configuration:0.24.0:target-platform (default-target-platform) @ org.eclipse.jdt.groovy.core.tests.compiler ---
26-Jun-2018 01:25:12 [INFO]
26-Jun-2018 01:25:12 [INFO] --- tycho-packaging-plugin:0.24.0:package-plugin (default-package-plugin) @ org.eclipse.jdt.groovy.core.tests.compiler ---
26-Jun-2018 01:25:12 [INFO] Building jar: /opt/bamboo-home/xml-data/build-dir/GRECLIPSE-GE47-JOB1/base-test/org.eclipse.jdt.groovy.core.tests.compiler/target/org.eclipse.jdt.groovy.core.tests.compiler-2.9.3-SNAPSHOT.jar
26-Jun-2018 01:25:12 [INFO]
26-Jun-2018 01:25:12 [INFO] --- tycho-p2-plugin:0.24.0:p2-metadata-default (default-p2-metadata-default) @ org.eclipse.jdt.groovy.core.tests.compiler ---
26-Jun-2018 01:25:12 [INFO]
26-Jun-2018 01:25:12 [INFO] --- maven-jarsigner-plugin:1.2:sign (sign) @ org.eclipse.jdt.groovy.core.tests.compiler ---
26-Jun-2018 01:25:13 [INFO] 2 archive(s) processed
26-Jun-2018 01:25:13 [INFO]
26-Jun-2018 01:25:13 [INFO] --- tycho-source-feature-plugin:0.24.0:source-feature (source-feature) @ org.eclipse.jdt.groovy.core.tests.compiler ---
26-Jun-2018 01:25:13 [INFO]
26-Jun-2018 01:25:13 [INFO] --- tycho-p2-plugin:0.24.0:p2-metadata (attach-p2-metadata) @ org.eclipse.jdt.groovy.core.tests.compiler ---
26-Jun-2018 01:25:13 [INFO]
26-Jun-2018 01:25:13 [INFO] --- maven-install-plugin:2.3.1:install (default-install) @ org.eclipse.jdt.groovy.core.tests.compiler ---
26-Jun-2018 01:25:13 [INFO] Installing /opt/bamboo-home/xml-data/build-dir/GRECLIPSE-GE47-JOB1/base-test/org.eclipse.jdt.groovy.core.tests.compiler/target/org.eclipse.jdt.groovy.core.tests.compiler-2.9.3-SNAPSHOT.jar to /home/bamboo/.m2/repository/org/codehaus/groovy/eclipse/org.eclipse.jdt.groovy.core.tests.compiler/2.9.3-SNAPSHOT/org.eclipse.jdt.groovy.core.tests.compiler-2.9.3-SNAPSHOT.jar
26-Jun-2018 01:25:13 [INFO] Installing /opt/bamboo-home/xml-data/build-dir/GRECLIPSE-GE47-JOB1/base-test/org.eclipse.jdt.groovy.core.tests.compiler/pom.xml to /home/bamboo/.m2/repository/org/codehaus/groovy/eclipse/org.eclipse.jdt.groovy.core.tests.compiler/2.9.3-SNAPSHOT/org.eclipse.jdt.groovy.core.tests.compiler-2.9.3-SNAPSHOT.pom
26-Jun-2018 01:25:13 [INFO] Installing /opt/bamboo-home/xml-data/build-dir/GRECLIPSE-GE47-JOB1/base-test/org.eclipse.jdt.groovy.core.tests.compiler/target/org.eclipse.jdt.groovy.core.tests.compiler-2.9.3-SNAPSHOT-sources.jar to /home/bamboo/.m2/repository/org/codehaus/groovy/eclipse/org.eclipse.jdt.groovy.core.tests.compiler/2.9.3-SNAPSHOT/org.eclipse.jdt.groovy.core.tests.compiler-2.9.3-SNAPSHOT-sources.jar
26-Jun-2018 01:25:13 [INFO] Installing /opt/bamboo-home/xml-data/build-dir/GRECLIPSE-GE47-JOB1/base-test/org.eclipse.jdt.groovy.core.tests.compiler/target/p2content.xml to /home/bamboo/.m2/repository/org/codehaus/groovy/eclipse/org.eclipse.jdt.groovy.core.tests.compiler/2.9.3-SNAPSHOT/org.eclipse.jdt.groovy.core.tests.compiler-2.9.3-SNAPSHOT-p2metadata.xml
26-Jun-2018 01:25:13 [INFO] Installing /opt/bamboo-home/xml-data/build-dir/GRECLIPSE-GE47-JOB1/base-test/org.eclipse.jdt.groovy.core.tests.compiler/target/p2artifacts.xml to /home/bamboo/.m2/repository/org/codehaus/groovy/eclipse/org.eclipse.jdt.groovy.core.tests.compiler/2.9.3-SNAPSHOT/org.eclipse.jdt.groovy.core.tests.compiler-2.9.3-SNAPSHOT-p2artifacts.xml
26-Jun-2018 01:25:13 [INFO] Installing /opt/bamboo-home/xml-data/build-dir/GRECLIPSE-GE47-JOB1/base-test/org.eclipse.jdt.groovy.core.tests.compiler/target/p2content.xml to /home/bamboo/.m2/repository/org/codehaus/groovy/eclipse/org.eclipse.jdt.groovy.core.tests.compiler/2.9.3-SNAPSHOT/org.eclipse.jdt.groovy.core.tests.compiler-2.9.3-SNAPSHOT-p2metadata.xml
26-Jun-2018 01:25:13 [INFO] Installing /opt/bamboo-home/xml-data/build-dir/GRECLIPSE-GE47-JOB1/base-test/org.eclipse.jdt.groovy.core.tests.compiler/target/p2artifacts.xml to /home/bamboo/.m2/repository/org/codehaus/groovy/eclipse/org.eclipse.jdt.groovy.core.tests.compiler/2.9.3-SNAPSHOT/org.eclipse.jdt.groovy.core.tests.compiler-2.9.3-SNAPSHOT-p2artifacts.xml
26-Jun-2018 01:25:13 [INFO]
26-Jun-2018 01:25:13 [INFO] --- tycho-p2-plugin:0.24.0:update-local-index (default-update-local-index) @ org.eclipse.jdt.groovy.core.tests.compiler ---
26-Jun-2018 01:25:13 [INFO]
26-Jun-2018 01:25:13 [INFO] --- maven-deploy-plugin:2.5:deploy (default-deploy) @ org.eclipse.jdt.groovy.core.tests.compiler ---
26-Jun-2018 01:25:13 [INFO] Skipping artifact deployment
26-Jun-2018 01:25:13 [INFO]                                                                         
26-Jun-2018 01:25:13 [INFO] ------------------------------------------------------------------------
26-Jun-2018 01:25:13 [INFO] Building org.eclipse.jdt.groovy.core.tests.builder 2.9.3-SNAPSHOT
26-Jun-2018 01:25:13 [INFO] ------------------------------------------------------------------------
26-Jun-2018 01:25:13 [INFO]
26-Jun-2018 01:25:13 [INFO] --- maven-clean-plugin:2.5:clean (default-clean) @ org.eclipse.jdt.groovy.core.tests.builder ---
26-Jun-2018 01:25:13 [INFO]
26-Jun-2018 01:25:13 [INFO] --- tycho-packaging-plugin:0.24.0:build-qualifier (default-build-qualifier) @ org.eclipse.jdt.groovy.core.tests.builder ---
26-Jun-2018 01:25:13 [INFO] The project's OSGi version is 2.9.3.xx-201806260123-e47
26-Jun-2018 01:25:13 [INFO]
26-Jun-2018 01:25:13 [INFO] --- tycho-packaging-plugin:0.24.0:validate-id (default-validate-id) @ org.eclipse.jdt.groovy.core.tests.builder ---
26-Jun-2018 01:25:13 [INFO]
26-Jun-2018 01:25:13 [INFO] --- tycho-packaging-plugin:0.24.0:validate-version (default-validate-version) @ org.eclipse.jdt.groovy.core.tests.builder ---
26-Jun-2018 01:25:13 [INFO]
26-Jun-2018 01:25:13 [INFO] --- properties-maven-plugin:1.0-alpha-2:read-project-properties (default) @ org.eclipse.jdt.groovy.core.tests.builder ---
26-Jun-2018 01:25:13 [INFO]
26-Jun-2018 01:25:13 [INFO] --- maven-resources-plugin:2.4.3:resources (default-resources) @ org.eclipse.jdt.groovy.core.tests.builder ---
26-Jun-2018 01:25:13 [WARNING] Using platform encoding (UTF-8 actually) to copy filtered resources, i.e. build is platform dependent!
26-Jun-2018 01:25:13 [INFO] skip non existing resourceDirectory /opt/bamboo-home/xml-data/build-dir/GRECLIPSE-GE47-JOB1/base-test/org.eclipse.jdt.groovy.core.tests.builder/src/main/resources
26-Jun-2018 01:25:13 [INFO]
26-Jun-2018 01:25:13 [INFO] --- tycho-compiler-plugin:0.24.0:compile (default-compile) @ org.eclipse.jdt.groovy.core.tests.builder ---
26-Jun-2018 01:25:13 [INFO] Compiling 43 source files to /opt/bamboo-home/xml-data/build-dir/GRECLIPSE-GE47-JOB1/base-test/org.eclipse.jdt.groovy.core.tests.builder/target/classes
26-Jun-2018 01:25:13 [INFO]
26-Jun-2018 01:25:13 [INFO] --- maven-resources-plugin:2.4.3:testResources (default-testResources) @ org.eclipse.jdt.groovy.core.tests.builder ---
26-Jun-2018 01:25:13 [WARNING] Using platform encoding (UTF-8 actually) to copy filtered resources, i.e. build is platform dependent!
26-Jun-2018 01:25:13 [INFO] skip non existing resourceDirectory /opt/bamboo-home/xml-data/build-dir/GRECLIPSE-GE47-JOB1/base-test/org.eclipse.jdt.groovy.core.tests.builder/src/test/resources
26-Jun-2018 01:25:13 [INFO]
26-Jun-2018 01:25:13 [INFO] --- tycho-source-plugin:0.24.0:plugin-source (plugin-source) @ org.eclipse.jdt.groovy.core.tests.builder ---
26-Jun-2018 01:25:13 [WARNING] bundle localization file /opt/bamboo-home/xml-data/build-dir/GRECLIPSE-GE47-JOB1/base-test/org.eclipse.jdt.groovy.core.tests.builder/plugin.properties not found
26-Jun-2018 01:25:13 [INFO] Building jar: /opt/bamboo-home/xml-data/build-dir/GRECLIPSE-GE47-JOB1/base-test/org.eclipse.jdt.groovy.core.tests.builder/target/org.eclipse.jdt.groovy.core.tests.builder-2.9.3-SNAPSHOT-sources.jar
26-Jun-2018 01:25:13 [INFO]
26-Jun-2018 01:25:13 [INFO] --- target-platform-configuration:0.24.0:target-platform (default-target-platform) @ org.eclipse.jdt.groovy.core.tests.builder ---
26-Jun-2018 01:25:13 [INFO]
26-Jun-2018 01:25:13 [INFO] --- tycho-packaging-plugin:0.24.0:package-plugin (default-package-plugin) @ org.eclipse.jdt.groovy.core.tests.builder ---
26-Jun-2018 01:25:13 [INFO] Building jar: /opt/bamboo-home/xml-data/build-dir/GRECLIPSE-GE47-JOB1/base-test/org.eclipse.jdt.groovy.core.tests.builder/target/org.eclipse.jdt.groovy.core.tests.builder-2.9.3-SNAPSHOT.jar
26-Jun-2018 01:25:13 [INFO]
26-Jun-2018 01:25:13 [INFO] --- tycho-p2-plugin:0.24.0:p2-metadata-default (default-p2-metadata-default) @ org.eclipse.jdt.groovy.core.tests.builder ---
26-Jun-2018 01:25:13 [INFO]
26-Jun-2018 01:25:13 [INFO] --- maven-jarsigner-plugin:1.2:sign (sign) @ org.eclipse.jdt.groovy.core.tests.builder ---
26-Jun-2018 01:25:15 [INFO] 2 archive(s) processed
26-Jun-2018 01:25:15 [INFO]
26-Jun-2018 01:25:15 [INFO] --- tycho-source-feature-plugin:0.24.0:source-feature (source-feature) @ org.eclipse.jdt.groovy.core.tests.builder ---
26-Jun-2018 01:25:15 [INFO]
26-Jun-2018 01:25:15 [INFO] --- tycho-p2-plugin:0.24.0:p2-metadata (attach-p2-metadata) @ org.eclipse.jdt.groovy.core.tests.builder ---
26-Jun-2018 01:25:15 [INFO]
26-Jun-2018 01:25:15 [INFO] --- maven-install-plugin:2.3.1:install (default-install) @ org.eclipse.jdt.groovy.core.tests.builder ---
26-Jun-2018 01:25:15 [INFO] Installing /opt/bamboo-home/xml-data/build-dir/GRECLIPSE-GE47-JOB1/base-test/org.eclipse.jdt.groovy.core.tests.builder/target/org.eclipse.jdt.groovy.core.tests.builder-2.9.3-SNAPSHOT.jar to /home/bamboo/.m2/repository/org/codehaus/groovy/eclipse/org.eclipse.jdt.groovy.core.tests.builder/2.9.3-SNAPSHOT/org.eclipse.jdt.groovy.core.tests.builder-2.9.3-SNAPSHOT.jar
26-Jun-2018 01:25:15 [INFO] Installing /opt/bamboo-home/xml-data/build-dir/GRECLIPSE-GE47-JOB1/base-test/org.eclipse.jdt.groovy.core.tests.builder/pom.xml to /home/bamboo/.m2/repository/org/codehaus/groovy/eclipse/org.eclipse.jdt.groovy.core.tests.builder/2.9.3-SNAPSHOT/org.eclipse.jdt.groovy.core.tests.builder-2.9.3-SNAPSHOT.pom
26-Jun-2018 01:25:15 [INFO] Installing /opt/bamboo-home/xml-data/build-dir/GRECLIPSE-GE47-JOB1/base-test/org.eclipse.jdt.groovy.core.tests.builder/target/org.eclipse.jdt.groovy.core.tests.builder-2.9.3-SNAPSHOT-sources.jar to /home/bamboo/.m2/repository/org/codehaus/groovy/eclipse/org.eclipse.jdt.groovy.core.tests.builder/2.9.3-SNAPSHOT/org.eclipse.jdt.groovy.core.tests.builder-2.9.3-SNAPSHOT-sources.jar
26-Jun-2018 01:25:15 [INFO] Installing /opt/bamboo-home/xml-data/build-dir/GRECLIPSE-GE47-JOB1/base-test/org.eclipse.jdt.groovy.core.tests.builder/target/p2content.xml to /home/bamboo/.m2/repository/org/codehaus/groovy/eclipse/org.eclipse.jdt.groovy.core.tests.builder/2.9.3-SNAPSHOT/org.eclipse.jdt.groovy.core.tests.builder-2.9.3-SNAPSHOT-p2metadata.xml
26-Jun-2018 01:25:15 [INFO] Installing /opt/bamboo-home/xml-data/build-dir/GRECLIPSE-GE47-JOB1/base-test/org.eclipse.jdt.groovy.core.tests.builder/target/p2artifacts.xml to /home/bamboo/.m2/repository/org/codehaus/groovy/eclipse/org.eclipse.jdt.groovy.core.tests.builder/2.9.3-SNAPSHOT/org.eclipse.jdt.groovy.core.tests.builder-2.9.3-SNAPSHOT-p2artifacts.xml
26-Jun-2018 01:25:15 [INFO] Installing /opt/bamboo-home/xml-data/build-dir/GRECLIPSE-GE47-JOB1/base-test/org.eclipse.jdt.groovy.core.tests.builder/target/p2content.xml to /home/bamboo/.m2/repository/org/codehaus/groovy/eclipse/org.eclipse.jdt.groovy.core.tests.builder/2.9.3-SNAPSHOT/org.eclipse.jdt.groovy.core.tests.builder-2.9.3-SNAPSHOT-p2metadata.xml
26-Jun-2018 01:25:15 [INFO] Installing /opt/bamboo-home/xml-data/build-dir/GRECLIPSE-GE47-JOB1/base-test/org.eclipse.jdt.groovy.core.tests.builder/target/p2artifacts.xml to /home/bamboo/.m2/repository/org/codehaus/groovy/eclipse/org.eclipse.jdt.groovy.core.tests.builder/2.9.3-SNAPSHOT/org.eclipse.jdt.groovy.core.tests.builder-2.9.3-SNAPSHOT-p2artifacts.xml
26-Jun-2018 01:25:15 [INFO]
26-Jun-2018 01:25:15 [INFO] --- tycho-p2-plugin:0.24.0:update-local-index (default-update-local-index) @ org.eclipse.jdt.groovy.core.tests.builder ---
26-Jun-2018 01:25:15 [INFO]
26-Jun-2018 01:25:15 [INFO] --- maven-deploy-plugin:2.5:deploy (default-deploy) @ org.eclipse.jdt.groovy.core.tests.builder ---
26-Jun-2018 01:25:15 [INFO] Skipping artifact deployment
26-Jun-2018 01:25:15 [INFO]                                                                         
26-Jun-2018 01:25:15 [INFO] ------------------------------------------------------------------------
26-Jun-2018 01:25:15 [INFO] Building org.codehaus.groovy.eclipse.tests 2.9.3-SNAPSHOT
26-Jun-2018 01:25:15 [INFO] ------------------------------------------------------------------------
26-Jun-2018 01:25:15 [INFO]
26-Jun-2018 01:25:15 [INFO] --- maven-clean-plugin:2.5:clean (default-clean) @ org.codehaus.groovy.eclipse.tests ---
26-Jun-2018 01:25:15 [INFO]
26-Jun-2018 01:25:15 [INFO] --- tycho-packaging-plugin:0.24.0:build-qualifier (default-build-qualifier) @ org.codehaus.groovy.eclipse.tests ---
26-Jun-2018 01:25:15 [INFO] The project's OSGi version is 2.9.3.xx-201806260123-e47
26-Jun-2018 01:25:15 [INFO]
26-Jun-2018 01:25:15 [INFO] --- tycho-packaging-plugin:0.24.0:validate-id (default-validate-id) @ org.codehaus.groovy.eclipse.tests ---
26-Jun-2018 01:25:15 [INFO]
26-Jun-2018 01:25:15 [INFO] --- tycho-packaging-plugin:0.24.0:validate-version (default-validate-version) @ org.codehaus.groovy.eclipse.tests ---
26-Jun-2018 01:25:15 [INFO]
26-Jun-2018 01:25:15 [INFO] --- properties-maven-plugin:1.0-alpha-2:read-project-properties (default) @ org.codehaus.groovy.eclipse.tests ---
26-Jun-2018 01:25:15 [INFO]
26-Jun-2018 01:25:15 [INFO] --- maven-resources-plugin:2.4.3:resources (default-resources) @ org.codehaus.groovy.eclipse.tests ---
26-Jun-2018 01:25:15 [WARNING] Using platform encoding (UTF-8 actually) to copy filtered resources, i.e. build is platform dependent!
26-Jun-2018 01:25:15 [INFO] skip non existing resourceDirectory /opt/bamboo-home/xml-data/build-dir/GRECLIPSE-GE47-JOB1/ide-test/org.codehaus.groovy.eclipse.tests/src/main/resources
26-Jun-2018 01:25:15 [INFO]
26-Jun-2018 01:25:15 [INFO] --- tycho-compiler-plugin:0.24.0:compile (default-compile) @ org.codehaus.groovy.eclipse.tests ---
26-Jun-2018 01:25:15 [INFO] Using Groovy-Eclipse compiler to compile both Java and Groovy files
26-Jun-2018 01:25:18 [INFO]
26-Jun-2018 01:25:18 [INFO] --- maven-resources-plugin:2.4.3:testResources (default-testResources) @ org.codehaus.groovy.eclipse.tests ---
26-Jun-2018 01:25:18 [WARNING] Using platform encoding (UTF-8 actually) to copy filtered resources, i.e. build is platform dependent!
26-Jun-2018 01:25:18 [INFO] skip non existing resourceDirectory /opt/bamboo-home/xml-data/build-dir/GRECLIPSE-GE47-JOB1/ide-test/org.codehaus.groovy.eclipse.tests/src/test/resources
26-Jun-2018 01:25:18 [INFO]
26-Jun-2018 01:25:18 [INFO] --- tycho-source-plugin:0.24.0:plugin-source (plugin-source) @ org.codehaus.groovy.eclipse.tests ---
26-Jun-2018 01:25:18 [WARNING] bundle localization file /opt/bamboo-home/xml-data/build-dir/GRECLIPSE-GE47-JOB1/ide-test/org.codehaus.groovy.eclipse.tests/plugin.properties not found
26-Jun-2018 01:25:18 [WARNING] Bundle-Vendor header not found in /opt/bamboo-home/xml-data/build-dir/GRECLIPSE-GE47-JOB1/ide-test/org.codehaus.groovy.eclipse.tests/META-INF/MANIFEST.MF, fallback to 'unknown' for source bundle
26-Jun-2018 01:25:18 [INFO] Building jar: /opt/bamboo-home/xml-data/build-dir/GRECLIPSE-GE47-JOB1/ide-test/org.codehaus.groovy.eclipse.tests/target/org.codehaus.groovy.eclipse.tests-2.9.3-SNAPSHOT-sources.jar
26-Jun-2018 01:25:18 [INFO]
26-Jun-2018 01:25:18 [INFO] --- target-platform-configuration:0.24.0:target-platform (default-target-platform) @ org.codehaus.groovy.eclipse.tests ---
26-Jun-2018 01:25:18 [INFO]
26-Jun-2018 01:25:18 [INFO] --- tycho-packaging-plugin:0.24.0:package-plugin (default-package-plugin) @ org.codehaus.groovy.eclipse.tests ---
26-Jun-2018 01:25:18 [INFO] Building jar: /opt/bamboo-home/xml-data/build-dir/GRECLIPSE-GE47-JOB1/ide-test/org.codehaus.groovy.eclipse.tests/target/org.codehaus.groovy.eclipse.tests-2.9.3-SNAPSHOT.jar
26-Jun-2018 01:25:18 [INFO]
26-Jun-2018 01:25:18 [INFO] --- tycho-p2-plugin:0.24.0:p2-metadata-default (default-p2-metadata-default) @ org.codehaus.groovy.eclipse.tests ---
26-Jun-2018 01:25:18 [INFO]
26-Jun-2018 01:25:18 [INFO] --- maven-jarsigner-plugin:1.2:sign (sign) @ org.codehaus.groovy.eclipse.tests ---
26-Jun-2018 01:25:19 [INFO] 2 archive(s) processed
26-Jun-2018 01:25:19 [INFO]
26-Jun-2018 01:25:19 [INFO] --- tycho-source-feature-plugin:0.24.0:source-feature (source-feature) @ org.codehaus.groovy.eclipse.tests ---
26-Jun-2018 01:25:19 [INFO]
26-Jun-2018 01:25:19 [INFO] --- tycho-p2-plugin:0.24.0:p2-metadata (attach-p2-metadata) @ org.codehaus.groovy.eclipse.tests ---
26-Jun-2018 01:25:19 [INFO]
26-Jun-2018 01:25:19 [INFO] --- maven-install-plugin:2.3.1:install (default-install) @ org.codehaus.groovy.eclipse.tests ---
26-Jun-2018 01:25:19 [INFO] Installing /opt/bamboo-home/xml-data/build-dir/GRECLIPSE-GE47-JOB1/ide-test/org.codehaus.groovy.eclipse.tests/target/org.codehaus.groovy.eclipse.tests-2.9.3-SNAPSHOT.jar to /home/bamboo/.m2/repository/org/codehaus/groovy/eclipse/org.codehaus.groovy.eclipse.tests/2.9.3-SNAPSHOT/org.codehaus.groovy.eclipse.tests-2.9.3-SNAPSHOT.jar
26-Jun-2018 01:25:19 [INFO] Installing /opt/bamboo-home/xml-data/build-dir/GRECLIPSE-GE47-JOB1/ide-test/org.codehaus.groovy.eclipse.tests/pom.xml to /home/bamboo/.m2/repository/org/codehaus/groovy/eclipse/org.codehaus.groovy.eclipse.tests/2.9.3-SNAPSHOT/org.codehaus.groovy.eclipse.tests-2.9.3-SNAPSHOT.pom
26-Jun-2018 01:25:19 [INFO] Installing /opt/bamboo-home/xml-data/build-dir/GRECLIPSE-GE47-JOB1/ide-test/org.codehaus.groovy.eclipse.tests/target/org.codehaus.groovy.eclipse.tests-2.9.3-SNAPSHOT-sources.jar to /home/bamboo/.m2/repository/org/codehaus/groovy/eclipse/org.codehaus.groovy.eclipse.tests/2.9.3-SNAPSHOT/org.codehaus.groovy.eclipse.tests-2.9.3-SNAPSHOT-sources.jar
26-Jun-2018 01:25:19 [INFO] Installing /opt/bamboo-home/xml-data/build-dir/GRECLIPSE-GE47-JOB1/ide-test/org.codehaus.groovy.eclipse.tests/target/p2content.xml to /home/bamboo/.m2/repository/org/codehaus/groovy/eclipse/org.codehaus.groovy.eclipse.tests/2.9.3-SNAPSHOT/org.codehaus.groovy.eclipse.tests-2.9.3-SNAPSHOT-p2metadata.xml
26-Jun-2018 01:25:19 [INFO] Installing /opt/bamboo-home/xml-data/build-dir/GRECLIPSE-GE47-JOB1/ide-test/org.codehaus.groovy.eclipse.tests/target/p2artifacts.xml to /home/bamboo/.m2/repository/org/codehaus/groovy/eclipse/org.codehaus.groovy.eclipse.tests/2.9.3-SNAPSHOT/org.codehaus.groovy.eclipse.tests-2.9.3-SNAPSHOT-p2artifacts.xml
26-Jun-2018 01:25:19 [INFO] Installing /opt/bamboo-home/xml-data/build-dir/GRECLIPSE-GE47-JOB1/ide-test/org.codehaus.groovy.eclipse.tests/target/p2content.xml to /home/bamboo/.m2/repository/org/codehaus/groovy/eclipse/org.codehaus.groovy.eclipse.tests/2.9.3-SNAPSHOT/org.codehaus.groovy.eclipse.tests-2.9.3-SNAPSHOT-p2metadata.xml
26-Jun-2018 01:25:19 [INFO] Installing /opt/bamboo-home/xml-data/build-dir/GRECLIPSE-GE47-JOB1/ide-test/org.codehaus.groovy.eclipse.tests/target/p2artifacts.xml to /home/bamboo/.m2/repository/org/codehaus/groovy/eclipse/org.codehaus.groovy.eclipse.tests/2.9.3-SNAPSHOT/org.codehaus.groovy.eclipse.tests-2.9.3-SNAPSHOT-p2artifacts.xml
26-Jun-2018 01:25:19 [INFO]
26-Jun-2018 01:25:19 [INFO] --- tycho-p2-plugin:0.24.0:update-local-index (default-update-local-index) @ org.codehaus.groovy.eclipse.tests ---
26-Jun-2018 01:25:19 [INFO]
26-Jun-2018 01:25:19 [INFO] --- maven-deploy-plugin:2.5:deploy (default-deploy) @ org.codehaus.groovy.eclipse.tests ---
26-Jun-2018 01:25:19 [INFO] Skipping artifact deployment
26-Jun-2018 01:25:19 [INFO]                                                                         
26-Jun-2018 01:25:19 [INFO] ------------------------------------------------------------------------
26-Jun-2018 01:25:19 [INFO] Building org.codehaus.groovy.eclipse.codeassist.completion.test 2.9.3-SNAPSHOT
26-Jun-2018 01:25:19 [INFO] ------------------------------------------------------------------------
26-Jun-2018 01:25:19 [INFO]
26-Jun-2018 01:25:19 [INFO] --- maven-clean-plugin:2.5:clean (default-clean) @ org.codehaus.groovy.eclipse.codeassist.completion.test ---
26-Jun-2018 01:25:19 [INFO]
26-Jun-2018 01:25:19 [INFO] --- tycho-packaging-plugin:0.24.0:build-qualifier (default-build-qualifier) @ org.codehaus.groovy.eclipse.codeassist.completion.test ---
26-Jun-2018 01:25:19 [INFO] The project's OSGi version is 2.9.3.xx-201806260123-e47
26-Jun-2018 01:25:19 [INFO]
26-Jun-2018 01:25:19 [INFO] --- tycho-packaging-plugin:0.24.0:validate-id (default-validate-id) @ org.codehaus.groovy.eclipse.codeassist.completion.test ---
26-Jun-2018 01:25:19 [INFO]
26-Jun-2018 01:25:19 [INFO] --- tycho-packaging-plugin:0.24.0:validate-version (default-validate-version) @ org.codehaus.groovy.eclipse.codeassist.completion.test ---
26-Jun-2018 01:25:19 [INFO]
26-Jun-2018 01:25:19 [INFO] --- properties-maven-plugin:1.0-alpha-2:read-project-properties (default) @ org.codehaus.groovy.eclipse.codeassist.completion.test ---
26-Jun-2018 01:25:19 [INFO]
26-Jun-2018 01:25:19 [INFO] --- maven-resources-plugin:2.4.3:resources (default-resources) @ org.codehaus.groovy.eclipse.codeassist.completion.test ---
26-Jun-2018 01:25:19 [WARNING] Using platform encoding (UTF-8 actually) to copy filtered resources, i.e. build is platform dependent!
26-Jun-2018 01:25:19 [INFO] skip non existing resourceDirectory /opt/bamboo-home/xml-data/build-dir/GRECLIPSE-GE47-JOB1/ide-test/org.codehaus.groovy.eclipse.codeassist.completion.test/src/main/resources
26-Jun-2018 01:25:19 [INFO]
26-Jun-2018 01:25:19 [INFO] --- tycho-compiler-plugin:0.24.0:compile (default-compile) @ org.codehaus.groovy.eclipse.codeassist.completion.test ---
26-Jun-2018 01:25:19 [INFO] Using Groovy-Eclipse compiler to compile both Java and Groovy files
26-Jun-2018 01:25:21 [INFO]
26-Jun-2018 01:25:21 [INFO] --- maven-resources-plugin:2.4.3:testResources (default-testResources) @ org.codehaus.groovy.eclipse.codeassist.completion.test ---
26-Jun-2018 01:25:21 [WARNING] Using platform encoding (UTF-8 actually) to copy filtered resources, i.e. build is platform dependent!
26-Jun-2018 01:25:21 [INFO] skip non existing resourceDirectory /opt/bamboo-home/xml-data/build-dir/GRECLIPSE-GE47-JOB1/ide-test/org.codehaus.groovy.eclipse.codeassist.completion.test/src/test/resources
26-Jun-2018 01:25:21 [INFO]
26-Jun-2018 01:25:21 [INFO] --- tycho-source-plugin:0.24.0:plugin-source (plugin-source) @ org.codehaus.groovy.eclipse.codeassist.completion.test ---
26-Jun-2018 01:25:21 [WARNING] bundle localization file /opt/bamboo-home/xml-data/build-dir/GRECLIPSE-GE47-JOB1/ide-test/org.codehaus.groovy.eclipse.codeassist.completion.test/plugin.properties not found
26-Jun-2018 01:25:21 [WARNING] Bundle-Vendor header not found in /opt/bamboo-home/xml-data/build-dir/GRECLIPSE-GE47-JOB1/ide-test/org.codehaus.groovy.eclipse.codeassist.completion.test/META-INF/MANIFEST.MF, fallback to 'unknown' for source bundle
26-Jun-2018 01:25:21 [INFO] Building jar: /opt/bamboo-home/xml-data/build-dir/GRECLIPSE-GE47-JOB1/ide-test/org.codehaus.groovy.eclipse.codeassist.completion.test/target/org.codehaus.groovy.eclipse.codeassist.completion.test-2.9.3-SNAPSHOT-sources.jar
26-Jun-2018 01:25:21 [INFO]
26-Jun-2018 01:25:21 [INFO] --- target-platform-configuration:0.24.0:target-platform (default-target-platform) @ org.codehaus.groovy.eclipse.codeassist.completion.test ---
26-Jun-2018 01:25:21 [INFO]
26-Jun-2018 01:25:21 [INFO] --- tycho-packaging-plugin:0.24.0:package-plugin (default-package-plugin) @ org.codehaus.groovy.eclipse.codeassist.completion.test ---
26-Jun-2018 01:25:21 [INFO] Building jar: /opt/bamboo-home/xml-data/build-dir/GRECLIPSE-GE47-JOB1/ide-test/org.codehaus.groovy.eclipse.codeassist.completion.test/target/org.codehaus.groovy.eclipse.codeassist.completion.test-2.9.3-SNAPSHOT.jar
26-Jun-2018 01:25:21 [INFO]
26-Jun-2018 01:25:21 [INFO] --- tycho-p2-plugin:0.24.0:p2-metadata-default (default-p2-metadata-default) @ org.codehaus.groovy.eclipse.codeassist.completion.test ---
26-Jun-2018 01:25:21 [INFO]
26-Jun-2018 01:25:21 [INFO] --- maven-jarsigner-plugin:1.2:sign (sign) @ org.codehaus.groovy.eclipse.codeassist.completion.test ---
26-Jun-2018 01:25:22 [INFO] 2 archive(s) processed
26-Jun-2018 01:25:22 [INFO]
26-Jun-2018 01:25:22 [INFO] --- tycho-source-feature-plugin:0.24.0:source-feature (source-feature) @ org.codehaus.groovy.eclipse.codeassist.completion.test ---
26-Jun-2018 01:25:22 [INFO]
26-Jun-2018 01:25:22 [INFO] --- tycho-p2-plugin:0.24.0:p2-metadata (attach-p2-metadata) @ org.codehaus.groovy.eclipse.codeassist.completion.test ---
26-Jun-2018 01:25:22 [INFO]
26-Jun-2018 01:25:22 [INFO] --- maven-install-plugin:2.3.1:install (default-install) @ org.codehaus.groovy.eclipse.codeassist.completion.test ---
26-Jun-2018 01:25:22 [INFO] Installing /opt/bamboo-home/xml-data/build-dir/GRECLIPSE-GE47-JOB1/ide-test/org.codehaus.groovy.eclipse.codeassist.completion.test/target/org.codehaus.groovy.eclipse.codeassist.completion.test-2.9.3-SNAPSHOT.jar to /home/bamboo/.m2/repository/org/codehaus/groovy/eclipse/org.codehaus.groovy.eclipse.codeassist.completion.test/2.9.3-SNAPSHOT/org.codehaus.groovy.eclipse.codeassist.completion.test-2.9.3-SNAPSHOT.jar
26-Jun-2018 01:25:22 [INFO] Installing /opt/bamboo-home/xml-data/build-dir/GRECLIPSE-GE47-JOB1/ide-test/org.codehaus.groovy.eclipse.codeassist.completion.test/pom.xml to /home/bamboo/.m2/repository/org/codehaus/groovy/eclipse/org.codehaus.groovy.eclipse.codeassist.completion.test/2.9.3-SNAPSHOT/org.codehaus.groovy.eclipse.codeassist.completion.test-2.9.3-SNAPSHOT.pom
26-Jun-2018 01:25:22 [INFO] Installing /opt/bamboo-home/xml-data/build-dir/GRECLIPSE-GE47-JOB1/ide-test/org.codehaus.groovy.eclipse.codeassist.completion.test/target/org.codehaus.groovy.eclipse.codeassist.completion.test-2.9.3-SNAPSHOT-sources.jar to /home/bamboo/.m2/repository/org/codehaus/groovy/eclipse/org.codehaus.groovy.eclipse.codeassist.completion.test/2.9.3-SNAPSHOT/org.codehaus.groovy.eclipse.codeassist.completion.test-2.9.3-SNAPSHOT-sources.jar
26-Jun-2018 01:25:22 [INFO] Installing /opt/bamboo-home/xml-data/build-dir/GRECLIPSE-GE47-JOB1/ide-test/org.codehaus.groovy.eclipse.codeassist.completion.test/target/p2content.xml to /home/bamboo/.m2/repository/org/codehaus/groovy/eclipse/org.codehaus.groovy.eclipse.codeassist.completion.test/2.9.3-SNAPSHOT/org.codehaus.groovy.eclipse.codeassist.completion.test-2.9.3-SNAPSHOT-p2metadata.xml
26-Jun-2018 01:25:22 [INFO] Installing /opt/bamboo-home/xml-data/build-dir/GRECLIPSE-GE47-JOB1/ide-test/org.codehaus.groovy.eclipse.codeassist.completion.test/target/p2artifacts.xml to /home/bamboo/.m2/repository/org/codehaus/groovy/eclipse/org.codehaus.groovy.eclipse.codeassist.completion.test/2.9.3-SNAPSHOT/org.codehaus.groovy.eclipse.codeassist.completion.test-2.9.3-SNAPSHOT-p2artifacts.xml
26-Jun-2018 01:25:22 [INFO] Installing /opt/bamboo-home/xml-data/build-dir/GRECLIPSE-GE47-JOB1/ide-test/org.codehaus.groovy.eclipse.codeassist.completion.test/target/p2content.xml to /home/bamboo/.m2/repository/org/codehaus/groovy/eclipse/org.codehaus.groovy.eclipse.codeassist.completion.test/2.9.3-SNAPSHOT/org.codehaus.groovy.eclipse.codeassist.completion.test-2.9.3-SNAPSHOT-p2metadata.xml
26-Jun-2018 01:25:22 [INFO] Installing /opt/bamboo-home/xml-data/build-dir/GRECLIPSE-GE47-JOB1/ide-test/org.codehaus.groovy.eclipse.codeassist.completion.test/target/p2artifacts.xml to /home/bamboo/.m2/repository/org/codehaus/groovy/eclipse/org.codehaus.groovy.eclipse.codeassist.completion.test/2.9.3-SNAPSHOT/org.codehaus.groovy.eclipse.codeassist.completion.test-2.9.3-SNAPSHOT-p2artifacts.xml
26-Jun-2018 01:25:22 [INFO]
26-Jun-2018 01:25:22 [INFO] --- tycho-p2-plugin:0.24.0:update-local-index (default-update-local-index) @ org.codehaus.groovy.eclipse.codeassist.completion.test ---
26-Jun-2018 01:25:22 [INFO]
26-Jun-2018 01:25:22 [INFO] --- maven-deploy-plugin:2.5:deploy (default-deploy) @ org.codehaus.groovy.eclipse.codeassist.completion.test ---
26-Jun-2018 01:25:22 [INFO] Skipping artifact deployment
26-Jun-2018 01:25:22 [INFO]                                                                         
26-Jun-2018 01:25:22 [INFO] ------------------------------------------------------------------------
26-Jun-2018 01:25:22 [INFO] Building org.codehaus.groovy.eclipse.codebrowsing.test 2.9.3-SNAPSHOT
26-Jun-2018 01:25:22 [INFO] ------------------------------------------------------------------------
26-Jun-2018 01:25:22 [INFO]
26-Jun-2018 01:25:22 [INFO] --- maven-clean-plugin:2.5:clean (default-clean) @ org.codehaus.groovy.eclipse.codebrowsing.test ---
26-Jun-2018 01:25:22 [INFO]
26-Jun-2018 01:25:22 [INFO] --- tycho-packaging-plugin:0.24.0:build-qualifier (default-build-qualifier) @ org.codehaus.groovy.eclipse.codebrowsing.test ---
26-Jun-2018 01:25:22 [INFO] The project's OSGi version is 2.9.3.xx-201806260123-e47
26-Jun-2018 01:25:22 [INFO]
26-Jun-2018 01:25:22 [INFO] --- tycho-packaging-plugin:0.24.0:validate-id (default-validate-id) @ org.codehaus.groovy.eclipse.codebrowsing.test ---
26-Jun-2018 01:25:22 [INFO]
26-Jun-2018 01:25:22 [INFO] --- tycho-packaging-plugin:0.24.0:validate-version (default-validate-version) @ org.codehaus.groovy.eclipse.codebrowsing.test ---
26-Jun-2018 01:25:22 [INFO]
26-Jun-2018 01:25:22 [INFO] --- properties-maven-plugin:1.0-alpha-2:read-project-properties (default) @ org.codehaus.groovy.eclipse.codebrowsing.test ---
26-Jun-2018 01:25:22 [INFO]
26-Jun-2018 01:25:22 [INFO] --- maven-resources-plugin:2.4.3:resources (default-resources) @ org.codehaus.groovy.eclipse.codebrowsing.test ---
26-Jun-2018 01:25:22 [WARNING] Using platform encoding (UTF-8 actually) to copy filtered resources, i.e. build is platform dependent!
26-Jun-2018 01:25:22 [INFO] skip non existing resourceDirectory /opt/bamboo-home/xml-data/build-dir/GRECLIPSE-GE47-JOB1/ide-test/org.codehaus.groovy.eclipse.codebrowsing.test/src/main/resources
26-Jun-2018 01:25:22 [INFO]
26-Jun-2018 01:25:22 [INFO] --- tycho-compiler-plugin:0.24.0:compile (default-compile) @ org.codehaus.groovy.eclipse.codebrowsing.test ---
26-Jun-2018 01:25:22 [INFO] Using Groovy-Eclipse compiler to compile both Java and Groovy files
26-Jun-2018 01:25:23 [INFO]
26-Jun-2018 01:25:23 [INFO] --- maven-resources-plugin:2.4.3:testResources (default-testResources) @ org.codehaus.groovy.eclipse.codebrowsing.test ---
26-Jun-2018 01:25:23 [WARNING] Using platform encoding (UTF-8 actually) to copy filtered resources, i.e. build is platform dependent!
26-Jun-2018 01:25:23 [INFO] skip non existing resourceDirectory /opt/bamboo-home/xml-data/build-dir/GRECLIPSE-GE47-JOB1/ide-test/org.codehaus.groovy.eclipse.codebrowsing.test/src/test/resources
26-Jun-2018 01:25:23 [INFO]
26-Jun-2018 01:25:23 [INFO] --- tycho-source-plugin:0.24.0:plugin-source (plugin-source) @ org.codehaus.groovy.eclipse.codebrowsing.test ---
26-Jun-2018 01:25:23 [WARNING] bundle localization file /opt/bamboo-home/xml-data/build-dir/GRECLIPSE-GE47-JOB1/ide-test/org.codehaus.groovy.eclipse.codebrowsing.test/plugin.properties not found
26-Jun-2018 01:25:23 [WARNING] Bundle-Vendor header not found in /opt/bamboo-home/xml-data/build-dir/GRECLIPSE-GE47-JOB1/ide-test/org.codehaus.groovy.eclipse.codebrowsing.test/META-INF/MANIFEST.MF, fallback to 'unknown' for source bundle
26-Jun-2018 01:25:23 [INFO] Building jar: /opt/bamboo-home/xml-data/build-dir/GRECLIPSE-GE47-JOB1/ide-test/org.codehaus.groovy.eclipse.codebrowsing.test/target/org.codehaus.groovy.eclipse.codebrowsing.test-2.9.3-SNAPSHOT-sources.jar
26-Jun-2018 01:25:23 [INFO]
26-Jun-2018 01:25:23 [INFO] --- target-platform-configuration:0.24.0:target-platform (default-target-platform) @ org.codehaus.groovy.eclipse.codebrowsing.test ---
26-Jun-2018 01:25:23 [INFO]
26-Jun-2018 01:25:23 [INFO] --- tycho-packaging-plugin:0.24.0:package-plugin (default-package-plugin) @ org.codehaus.groovy.eclipse.codebrowsing.test ---
26-Jun-2018 01:25:23 [INFO] Building jar: /opt/bamboo-home/xml-data/build-dir/GRECLIPSE-GE47-JOB1/ide-test/org.codehaus.groovy.eclipse.codebrowsing.test/target/org.codehaus.groovy.eclipse.codebrowsing.test-2.9.3-SNAPSHOT.jar
26-Jun-2018 01:25:23 [INFO]
26-Jun-2018 01:25:23 [INFO] --- tycho-p2-plugin:0.24.0:p2-metadata-default (default-p2-metadata-default) @ org.codehaus.groovy.eclipse.codebrowsing.test ---
26-Jun-2018 01:25:23 [INFO]
26-Jun-2018 01:25:23 [INFO] --- maven-jarsigner-plugin:1.2:sign (sign) @ org.codehaus.groovy.eclipse.codebrowsing.test ---
26-Jun-2018 01:25:24 [INFO] 2 archive(s) processed
26-Jun-2018 01:25:24 [INFO]
26-Jun-2018 01:25:24 [INFO] --- tycho-source-feature-plugin:0.24.0:source-feature (source-feature) @ org.codehaus.groovy.eclipse.codebrowsing.test ---
26-Jun-2018 01:25:24 [INFO]
26-Jun-2018 01:25:24 [INFO] --- tycho-p2-plugin:0.24.0:p2-metadata (attach-p2-metadata) @ org.codehaus.groovy.eclipse.codebrowsing.test ---
26-Jun-2018 01:25:24 [INFO]
26-Jun-2018 01:25:24 [INFO] --- maven-install-plugin:2.3.1:install (default-install) @ org.codehaus.groovy.eclipse.codebrowsing.test ---
26-Jun-2018 01:25:24 [INFO] Installing /opt/bamboo-home/xml-data/build-dir/GRECLIPSE-GE47-JOB1/ide-test/org.codehaus.groovy.eclipse.codebrowsing.test/target/org.codehaus.groovy.eclipse.codebrowsing.test-2.9.3-SNAPSHOT.jar to /home/bamboo/.m2/repository/org/codehaus/groovy/eclipse/org.codehaus.groovy.eclipse.codebrowsing.test/2.9.3-SNAPSHOT/org.codehaus.groovy.eclipse.codebrowsing.test-2.9.3-SNAPSHOT.jar
26-Jun-2018 01:25:24 [INFO] Installing /opt/bamboo-home/xml-data/build-dir/GRECLIPSE-GE47-JOB1/ide-test/org.codehaus.groovy.eclipse.codebrowsing.test/pom.xml to /home/bamboo/.m2/repository/org/codehaus/groovy/eclipse/org.codehaus.groovy.eclipse.codebrowsing.test/2.9.3-SNAPSHOT/org.codehaus.groovy.eclipse.codebrowsing.test-2.9.3-SNAPSHOT.pom
26-Jun-2018 01:25:24 [INFO] Installing /opt/bamboo-home/xml-data/build-dir/GRECLIPSE-GE47-JOB1/ide-test/org.codehaus.groovy.eclipse.codebrowsing.test/target/org.codehaus.groovy.eclipse.codebrowsing.test-2.9.3-SNAPSHOT-sources.jar to /home/bamboo/.m2/repository/org/codehaus/groovy/eclipse/org.codehaus.groovy.eclipse.codebrowsing.test/2.9.3-SNAPSHOT/org.codehaus.groovy.eclipse.codebrowsing.test-2.9.3-SNAPSHOT-sources.jar
26-Jun-2018 01:25:24 [INFO] Installing /opt/bamboo-home/xml-data/build-dir/GRECLIPSE-GE47-JOB1/ide-test/org.codehaus.groovy.eclipse.codebrowsing.test/target/p2content.xml to /home/bamboo/.m2/repository/org/codehaus/groovy/eclipse/org.codehaus.groovy.eclipse.codebrowsing.test/2.9.3-SNAPSHOT/org.codehaus.groovy.eclipse.codebrowsing.test-2.9.3-SNAPSHOT-p2metadata.xml
26-Jun-2018 01:25:24 [INFO] Installing /opt/bamboo-home/xml-data/build-dir/GRECLIPSE-GE47-JOB1/ide-test/org.codehaus.groovy.eclipse.codebrowsing.test/target/p2artifacts.xml to /home/bamboo/.m2/repository/org/codehaus/groovy/eclipse/org.codehaus.groovy.eclipse.codebrowsing.test/2.9.3-SNAPSHOT/org.codehaus.groovy.eclipse.codebrowsing.test-2.9.3-SNAPSHOT-p2artifacts.xml
26-Jun-2018 01:25:24 [INFO] Installing /opt/bamboo-home/xml-data/build-dir/GRECLIPSE-GE47-JOB1/ide-test/org.codehaus.groovy.eclipse.codebrowsing.test/target/p2content.xml to /home/bamboo/.m2/repository/org/codehaus/groovy/eclipse/org.codehaus.groovy.eclipse.codebrowsing.test/2.9.3-SNAPSHOT/org.codehaus.groovy.eclipse.codebrowsing.test-2.9.3-SNAPSHOT-p2metadata.xml
26-Jun-2018 01:25:24 [INFO] Installing /opt/bamboo-home/xml-data/build-dir/GRECLIPSE-GE47-JOB1/ide-test/org.codehaus.groovy.eclipse.codebrowsing.test/target/p2artifacts.xml to /home/bamboo/.m2/repository/org/codehaus/groovy/eclipse/org.codehaus.groovy.eclipse.codebrowsing.test/2.9.3-SNAPSHOT/org.codehaus.groovy.eclipse.codebrowsing.test-2.9.3-SNAPSHOT-p2artifacts.xml
26-Jun-2018 01:25:24 [INFO]
26-Jun-2018 01:25:24 [INFO] --- tycho-p2-plugin:0.24.0:update-local-index (default-update-local-index) @ org.codehaus.groovy.eclipse.codebrowsing.test ---
26-Jun-2018 01:25:24 [INFO]
26-Jun-2018 01:25:24 [INFO] --- maven-deploy-plugin:2.5:deploy (default-deploy) @ org.codehaus.groovy.eclipse.codebrowsing.test ---
26-Jun-2018 01:25:24 [INFO] Skipping artifact deployment
26-Jun-2018 01:25:24 [INFO]                                                                         
26-Jun-2018 01:25:24 [INFO] ------------------------------------------------------------------------
26-Jun-2018 01:25:24 [INFO] Building org.codehaus.groovy.eclipse.core.test 2.9.3-SNAPSHOT
26-Jun-2018 01:25:24 [INFO] ------------------------------------------------------------------------
26-Jun-2018 01:25:24 [INFO]
26-Jun-2018 01:25:24 [INFO] --- maven-clean-plugin:2.5:clean (default-clean) @ org.codehaus.groovy.eclipse.core.test ---
26-Jun-2018 01:25:24 [INFO]
26-Jun-2018 01:25:24 [INFO] --- tycho-packaging-plugin:0.24.0:build-qualifier (default-build-qualifier) @ org.codehaus.groovy.eclipse.core.test ---
26-Jun-2018 01:25:24 [INFO] The project's OSGi version is 2.9.3.xx-201806260123-e47
26-Jun-2018 01:25:24 [INFO]
26-Jun-2018 01:25:24 [INFO] --- tycho-packaging-plugin:0.24.0:validate-id (default-validate-id) @ org.codehaus.groovy.eclipse.core.test ---
26-Jun-2018 01:25:24 [INFO]
26-Jun-2018 01:25:24 [INFO] --- tycho-packaging-plugin:0.24.0:validate-version (default-validate-version) @ org.codehaus.groovy.eclipse.core.test ---
26-Jun-2018 01:25:24 [INFO]
26-Jun-2018 01:25:24 [INFO] --- properties-maven-plugin:1.0-alpha-2:read-project-properties (default) @ org.codehaus.groovy.eclipse.core.test ---
26-Jun-2018 01:25:24 [INFO]
26-Jun-2018 01:25:24 [INFO] --- maven-resources-plugin:2.4.3:resources (default-resources) @ org.codehaus.groovy.eclipse.core.test ---
26-Jun-2018 01:25:24 [WARNING] Using platform encoding (UTF-8 actually) to copy filtered resources, i.e. build is platform dependent!
26-Jun-2018 01:25:24 [INFO] skip non existing resourceDirectory /opt/bamboo-home/xml-data/build-dir/GRECLIPSE-GE47-JOB1/ide-test/org.codehaus.groovy.eclipse.core.test/src/main/resources
26-Jun-2018 01:25:24 [INFO]
26-Jun-2018 01:25:24 [INFO] --- tycho-compiler-plugin:0.24.0:compile (default-compile) @ org.codehaus.groovy.eclipse.core.test ---
26-Jun-2018 01:25:24 [INFO] Using Groovy-Eclipse compiler to compile both Java and Groovy files
26-Jun-2018 01:25:24 [INFO]
26-Jun-2018 01:25:24 [INFO] --- maven-resources-plugin:2.4.3:testResources (default-testResources) @ org.codehaus.groovy.eclipse.core.test ---
26-Jun-2018 01:25:24 [WARNING] Using platform encoding (UTF-8 actually) to copy filtered resources, i.e. build is platform dependent!
26-Jun-2018 01:25:24 [INFO] skip non existing resourceDirectory /opt/bamboo-home/xml-data/build-dir/GRECLIPSE-GE47-JOB1/ide-test/org.codehaus.groovy.eclipse.core.test/src/test/resources
26-Jun-2018 01:25:24 [INFO]
26-Jun-2018 01:25:24 [INFO] --- tycho-source-plugin:0.24.0:plugin-source (plugin-source) @ org.codehaus.groovy.eclipse.core.test ---
26-Jun-2018 01:25:24 [WARNING] bundle localization file /opt/bamboo-home/xml-data/build-dir/GRECLIPSE-GE47-JOB1/ide-test/org.codehaus.groovy.eclipse.core.test/plugin.properties not found
26-Jun-2018 01:25:24 [WARNING] Bundle-Vendor header not found in /opt/bamboo-home/xml-data/build-dir/GRECLIPSE-GE47-JOB1/ide-test/org.codehaus.groovy.eclipse.core.test/META-INF/MANIFEST.MF, fallback to 'unknown' for source bundle
26-Jun-2018 01:25:24 [INFO] Building jar: /opt/bamboo-home/xml-data/build-dir/GRECLIPSE-GE47-JOB1/ide-test/org.codehaus.groovy.eclipse.core.test/target/org.codehaus.groovy.eclipse.core.test-2.9.3-SNAPSHOT-sources.jar
26-Jun-2018 01:25:24 [INFO]
26-Jun-2018 01:25:24 [INFO] --- target-platform-configuration:0.24.0:target-platform (default-target-platform) @ org.codehaus.groovy.eclipse.core.test ---
26-Jun-2018 01:25:25 [INFO]
26-Jun-2018 01:25:25 [INFO] --- tycho-packaging-plugin:0.24.0:package-plugin (default-package-plugin) @ org.codehaus.groovy.eclipse.core.test ---
26-Jun-2018 01:25:25 [INFO] Building jar: /opt/bamboo-home/xml-data/build-dir/GRECLIPSE-GE47-JOB1/ide-test/org.codehaus.groovy.eclipse.core.test/target/org.codehaus.groovy.eclipse.core.test-2.9.3-SNAPSHOT.jar
26-Jun-2018 01:25:25 [INFO]
26-Jun-2018 01:25:25 [INFO] --- tycho-p2-plugin:0.24.0:p2-metadata-default (default-p2-metadata-default) @ org.codehaus.groovy.eclipse.core.test ---
26-Jun-2018 01:25:25 [INFO]
26-Jun-2018 01:25:25 [INFO] --- maven-jarsigner-plugin:1.2:sign (sign) @ org.codehaus.groovy.eclipse.core.test ---
26-Jun-2018 01:25:26 [INFO] 2 archive(s) processed
26-Jun-2018 01:25:26 [INFO]
26-Jun-2018 01:25:26 [INFO] --- tycho-source-feature-plugin:0.24.0:source-feature (source-feature) @ org.codehaus.groovy.eclipse.core.test ---
26-Jun-2018 01:25:26 [INFO]
26-Jun-2018 01:25:26 [INFO] --- tycho-p2-plugin:0.24.0:p2-metadata (attach-p2-metadata) @ org.codehaus.groovy.eclipse.core.test ---
26-Jun-2018 01:25:26 [INFO]
26-Jun-2018 01:25:26 [INFO] --- maven-install-plugin:2.3.1:install (default-install) @ org.codehaus.groovy.eclipse.core.test ---
26-Jun-2018 01:25:26 [INFO] Installing /opt/bamboo-home/xml-data/build-dir/GRECLIPSE-GE47-JOB1/ide-test/org.codehaus.groovy.eclipse.core.test/target/org.codehaus.groovy.eclipse.core.test-2.9.3-SNAPSHOT.jar to /home/bamboo/.m2/repository/org/codehaus/groovy/eclipse/org.codehaus.groovy.eclipse.core.test/2.9.3-SNAPSHOT/org.codehaus.groovy.eclipse.core.test-2.9.3-SNAPSHOT.jar
26-Jun-2018 01:25:26 [INFO] Installing /opt/bamboo-home/xml-data/build-dir/GRECLIPSE-GE47-JOB1/ide-test/org.codehaus.groovy.eclipse.core.test/pom.xml to /home/bamboo/.m2/repository/org/codehaus/groovy/eclipse/org.codehaus.groovy.eclipse.core.test/2.9.3-SNAPSHOT/org.codehaus.groovy.eclipse.core.test-2.9.3-SNAPSHOT.pom
26-Jun-2018 01:25:26 [INFO] Installing /opt/bamboo-home/xml-data/build-dir/GRECLIPSE-GE47-JOB1/ide-test/org.codehaus.groovy.eclipse.core.test/target/org.codehaus.groovy.eclipse.core.test-2.9.3-SNAPSHOT-sources.jar to /home/bamboo/.m2/repository/org/codehaus/groovy/eclipse/org.codehaus.groovy.eclipse.core.test/2.9.3-SNAPSHOT/org.codehaus.groovy.eclipse.core.test-2.9.3-SNAPSHOT-sources.jar
26-Jun-2018 01:25:26 [INFO] Installing /opt/bamboo-home/xml-data/build-dir/GRECLIPSE-GE47-JOB1/ide-test/org.codehaus.groovy.eclipse.core.test/target/p2content.xml to /home/bamboo/.m2/repository/org/codehaus/groovy/eclipse/org.codehaus.groovy.eclipse.core.test/2.9.3-SNAPSHOT/org.codehaus.groovy.eclipse.core.test-2.9.3-SNAPSHOT-p2metadata.xml
26-Jun-2018 01:25:26 [INFO] Installing /opt/bamboo-home/xml-data/build-dir/GRECLIPSE-GE47-JOB1/ide-test/org.codehaus.groovy.eclipse.core.test/target/p2artifacts.xml to /home/bamboo/.m2/repository/org/codehaus/groovy/eclipse/org.codehaus.groovy.eclipse.core.test/2.9.3-SNAPSHOT/org.codehaus.groovy.eclipse.core.test-2.9.3-SNAPSHOT-p2artifacts.xml
26-Jun-2018 01:25:26 [INFO] Installing /opt/bamboo-home/xml-data/build-dir/GRECLIPSE-GE47-JOB1/ide-test/org.codehaus.groovy.eclipse.core.test/target/p2content.xml to /home/bamboo/.m2/repository/org/codehaus/groovy/eclipse/org.codehaus.groovy.eclipse.core.test/2.9.3-SNAPSHOT/org.codehaus.groovy.eclipse.core.test-2.9.3-SNAPSHOT-p2metadata.xml
26-Jun-2018 01:25:26 [INFO] Installing /opt/bamboo-home/xml-data/build-dir/GRECLIPSE-GE47-JOB1/ide-test/org.codehaus.groovy.eclipse.core.test/target/p2artifacts.xml to /home/bamboo/.m2/repository/org/codehaus/groovy/eclipse/org.codehaus.groovy.eclipse.core.test/2.9.3-SNAPSHOT/org.codehaus.groovy.eclipse.core.test-2.9.3-SNAPSHOT-p2artifacts.xml
26-Jun-2018 01:25:26 [INFO]
26-Jun-2018 01:25:26 [INFO] --- tycho-p2-plugin:0.24.0:update-local-index (default-update-local-index) @ org.codehaus.groovy.eclipse.core.test ---
26-Jun-2018 01:25:26 [INFO]
26-Jun-2018 01:25:26 [INFO] --- maven-deploy-plugin:2.5:deploy (default-deploy) @ org.codehaus.groovy.eclipse.core.test ---
26-Jun-2018 01:25:26 [INFO] Skipping artifact deployment
26-Jun-2018 01:25:26 [INFO]                                                                         
26-Jun-2018 01:25:26 [INFO] ------------------------------------------------------------------------
26-Jun-2018 01:25:26 [INFO] Building org.codehaus.groovy.eclipse.dsl.tests 2.9.3-SNAPSHOT
26-Jun-2018 01:25:26 [INFO] ------------------------------------------------------------------------
26-Jun-2018 01:25:26 [INFO]
26-Jun-2018 01:25:26 [INFO] --- maven-clean-plugin:2.5:clean (default-clean) @ org.codehaus.groovy.eclipse.dsl.tests ---
26-Jun-2018 01:25:26 [INFO]
26-Jun-2018 01:25:26 [INFO] --- tycho-packaging-plugin:0.24.0:build-qualifier (default-build-qualifier) @ org.codehaus.groovy.eclipse.dsl.tests ---
26-Jun-2018 01:25:26 [INFO] The project's OSGi version is 2.9.3.xx-201806260123-e47
26-Jun-2018 01:25:26 [INFO]
26-Jun-2018 01:25:26 [INFO] --- tycho-packaging-plugin:0.24.0:validate-id (default-validate-id) @ org.codehaus.groovy.eclipse.dsl.tests ---
26-Jun-2018 01:25:26 [INFO]
26-Jun-2018 01:25:26 [INFO] --- tycho-packaging-plugin:0.24.0:validate-version (default-validate-version) @ org.codehaus.groovy.eclipse.dsl.tests ---
26-Jun-2018 01:25:26 [INFO]
26-Jun-2018 01:25:26 [INFO] --- properties-maven-plugin:1.0-alpha-2:read-project-properties (default) @ org.codehaus.groovy.eclipse.dsl.tests ---
26-Jun-2018 01:25:26 [INFO]
26-Jun-2018 01:25:26 [INFO] --- maven-resources-plugin:2.4.3:resources (default-resources) @ org.codehaus.groovy.eclipse.dsl.tests ---
26-Jun-2018 01:25:26 [WARNING] Using platform encoding (UTF-8 actually) to copy filtered resources, i.e. build is platform dependent!
26-Jun-2018 01:25:26 [INFO] skip non existing resourceDirectory /opt/bamboo-home/xml-data/build-dir/GRECLIPSE-GE47-JOB1/ide-test/org.codehaus.groovy.eclipse.dsl.tests/src/main/resources
26-Jun-2018 01:25:26 [INFO]
26-Jun-2018 01:25:26 [INFO] --- tycho-compiler-plugin:0.24.0:compile (default-compile) @ org.codehaus.groovy.eclipse.dsl.tests ---
26-Jun-2018 01:25:26 [INFO] Using Groovy-Eclipse compiler to compile both Java and Groovy files
26-Jun-2018 01:25:26 org.codehaus.groovy.control.messages.SyntaxErrorMessage@7bb4e102
26-Jun-2018 01:25:27 exception handling
26-Jun-2018 01:25:27 org.codehaus.groovy.control.MultipleCompilationErrorsException: startup failed:
26-Jun-2018 01:25:27 /opt/bamboo-home/xml-data/build-dir/GRECLIPSE-GE47-JOB1/ide-test/org.codehaus.groovy.eclipse.dsl.tests/src/org/codehaus/groovy/eclipse/dsl/tests/PointcutEvaluationTests.groovy: 64: The return type of VisitStatus acceptASTNode(org.codehaus.groovy.ast.ASTNode, org.eclipse.jdt.groovy.search.TypeLookupResult, org.eclipse.jdt.core.IJavaElement) in org.codehaus.groovy.eclipse.dsl.tests.PointcutEvaluationTests$PointcutEvaluationRequestor is incompatible with org.eclipse.jdt.groovy.search.ITypeRequestor$VisitStatus acceptASTNode(org.codehaus.groovy.ast.ASTNode, org.eclipse.jdt.groovy.search.TypeLookupResult, org.eclipse.jdt.core.IJavaElement) in org.eclipse.jdt.groovy.search.ITypeRequestor
26-Jun-2018 01:25:27 . At [64:9]  @ line 64, column 9.
26-Jun-2018 01:25:27            VisitStatus acceptASTNode(ASTNode node, TypeLookupResult result, IJavaElement enclosingElement) {
26-Jun-2018 01:25:27            ^
26-Jun-2018 01:25:27
26-Jun-2018 01:25:27 1 error
26-Jun-2018 01:25:27
26-Jun-2018 01:25:27         at org.codehaus.groovy.control.ErrorCollector.failIfErrors(ErrorCollector.java:313)
26-Jun-2018 01:25:27         at org.codehaus.groovy.control.CompilationUnit.applyToPrimaryClassNodes(CompilationUnit.java:1227)
26-Jun-2018 01:25:27         at org.codehaus.groovy.control.CompilationUnit.doPhaseOperation(CompilationUnit.java:631)
26-Jun-2018 01:25:27         at org.codehaus.groovy.control.CompilationUnit.processPhaseOperations(CompilationUnit.java:609)
26-Jun-2018 01:25:27         at org.codehaus.groovy.control.CompilationUnit.compile(CompilationUnit.java:586)
26-Jun-2018 01:25:27         at org.codehaus.jdt.groovy.internal.compiler.ast.GroovyCompilationUnitDeclaration.processToPhase(GroovyCompilationUnitDeclaration.java:184)
26-Jun-2018 01:25:27         at org.codehaus.jdt.groovy.internal.compiler.ast.GroovyCompilationUnitDeclaration.generateCode(GroovyCompilationUnitDeclaration.java:1632)
26-Jun-2018 01:25:27         at org.eclipse.jdt.internal.compiler.Compiler.process(Compiler.java:838)
26-Jun-2018 01:25:27         at org.eclipse.jdt.internal.compiler.ProcessTaskManager.run(ProcessTaskManager.java:137)
26-Jun-2018 01:25:27         at java.lang.Thread.run(Thread.java:748)
26-Jun-2018 01:25:27 /opt/bamboo-home/xml-data/build-dir/GRECLIPSE-GE47-JOB1/ide-test/org.codehaus.groovy.eclipse.dsl.tests/src/org/codehaus/groovy/eclipse/dsl/tests/MetaDSLInferencingTests.groovy: 64 Groovy:The return type of VisitStatus acceptASTNode(org.codehaus.groovy.ast.ASTNode, org.eclipse.jdt.groovy.search.TypeLookupResult, org.eclipse.jdt.core.IJavaElement) in org.codehaus.groovy.eclipse.dsl.tests.PointcutEvaluationTests$PointcutEvaluationRequestor is incompatible with org.eclipse.jdt.groovy.search.ITypeRequestor$VisitStatus acceptASTNode(org.codehaus.groovy.ast.ASTNode, org.eclipse.jdt.groovy.search.TypeLookupResult, org.eclipse.jdt.core.IJavaElement) in org.eclipse.jdt.groovy.search.ITypeRequestor
26-Jun-2018 01:25:27 exception handling
26-Jun-2018 01:25:27 org.codehaus.groovy.control.MultipleCompilationErrorsException: startup failed:
26-Jun-2018 01:25:27
26-Jun-2018 01:25:27         at org.codehaus.groovy.control.ErrorCollector.failIfErrors(ErrorCollector.java:313)
26-Jun-2018 01:25:27         at org.codehaus.groovy.control.CompilationUnit.applyToSourceUnits(CompilationUnit.java:1027)
26-Jun-2018 01:25:27         at org.codehaus.groovy.control.CompilationUnit.compile(CompilationUnit.java:592)
26-Jun-2018 01:25:27         at org.codehaus.jdt.groovy.internal.compiler.ast.GroovyCompilationUnitDeclaration.processToPhase(GroovyCompilationUnitDeclaration.java:184)
26-Jun-2018 01:25:27         at org.codehaus.jdt.groovy.internal.compiler.ast.GroovyCompilationUnitDeclaration.resolve(GroovyCompilationUnitDeclaration.java:2098)
26-Jun-2018 01:25:27         at org.eclipse.jdt.internal.compiler.Compiler.process(Compiler.java:827)
26-Jun-2018 01:25:27         at org.eclipse.jdt.internal.compiler.ProcessTaskManager.run(ProcessTaskManager.java:137)
26-Jun-2018 01:25:27         at java.lang.Thread.run(Thread.java:748)
26-Jun-2018 01:25:27 exception handling
26-Jun-2018 01:25:27 org.codehaus.groovy.control.MultipleCompilationErrorsException: startup failed:
26-Jun-2018 01:25:27
26-Jun-2018 01:25:27         at org.codehaus.groovy.control.ErrorCollector.failIfErrors(ErrorCollector.java:313)
26-Jun-2018 01:25:27         at org.codehaus.groovy.control.CompilationUnit.applyToSourceUnits(CompilationUnit.java:1027)
26-Jun-2018 01:25:27         at org.codehaus.groovy.control.CompilationUnit.compile(CompilationUnit.java:592)
26-Jun-2018 01:25:27         at org.codehaus.jdt.groovy.internal.compiler.ast.GroovyCompilationUnitDeclaration.processToPhase(GroovyCompilationUnitDeclaration.java:184)
26-Jun-2018 01:25:27         at org.codehaus.jdt.groovy.internal.compiler.ast.GroovyCompilationUnitDeclaration.analyseCode(GroovyCompilationUnitDeclaration.java:2181)
26-Jun-2018 01:25:27         at org.eclipse.jdt.internal.compiler.Compiler.process(Compiler.java:833)
26-Jun-2018 01:25:27         at org.eclipse.jdt.internal.compiler.ProcessTaskManager.run(ProcessTaskManager.java:137)
26-Jun-2018 01:25:27         at java.lang.Thread.run(Thread.java:748)
26-Jun-2018 01:25:27 exception handling
26-Jun-2018 01:25:27 org.codehaus.groovy.control.MultipleCompilationErrorsException: startup failed:
26-Jun-2018 01:25:27
26-Jun-2018 01:25:27         at org.codehaus.groovy.control.ErrorCollector.failIfErrors(ErrorCollector.java:313)
26-Jun-2018 01:25:27         at org.codehaus.groovy.control.CompilationUnit.applyToSourceUnits(CompilationUnit.java:1027)
26-Jun-2018 01:25:27         at org.codehaus.groovy.control.CompilationUnit.compile(CompilationUnit.java:592)
26-Jun-2018 01:25:27         at org.codehaus.jdt.groovy.internal.compiler.ast.GroovyCompilationUnitDeclaration.processToPhase(GroovyCompilationUnitDeclaration.java:184)
26-Jun-2018 01:25:27         at org.codehaus.jdt.groovy.internal.compiler.ast.GroovyCompilationUnitDeclaration.generateCode(GroovyCompilationUnitDeclaration.java:1632)
26-Jun-2018 01:25:27         at org.eclipse.jdt.internal.compiler.Compiler.process(Compiler.java:838)
26-Jun-2018 01:25:27         at org.eclipse.jdt.internal.compiler.ProcessTaskManager.run(ProcessTaskManager.java:137)
26-Jun-2018 01:25:27         at java.lang.Thread.run(Thread.java:748)
26-Jun-2018 01:25:27 exception handling
26-Jun-2018 01:25:27 org.codehaus.groovy.control.MultipleCompilationErrorsException: startup failed:
26-Jun-2018 01:25:27
26-Jun-2018 01:25:27         at org.codehaus.groovy.control.ErrorCollector.failIfErrors(ErrorCollector.java:313)
26-Jun-2018 01:25:27         at org.codehaus.groovy.control.CompilationUnit.applyToSourceUnits(CompilationUnit.java:1027)
26-Jun-2018 01:25:27         at org.codehaus.groovy.control.CompilationUnit.compile(CompilationUnit.java:592)
26-Jun-2018 01:25:27         at org.codehaus.jdt.groovy.internal.compiler.ast.GroovyCompilationUnitDeclaration.processToPhase(GroovyCompilationUnitDeclaration.java:184)
26-Jun-2018 01:25:27         at org.codehaus.jdt.groovy.internal.compiler.ast.GroovyCompilationUnitDeclaration.resolve(GroovyCompilationUnitDeclaration.java:2098)
26-Jun-2018 01:25:27         at org.eclipse.jdt.internal.compiler.Compiler.process(Compiler.java:827)
26-Jun-2018 01:25:27         at org.eclipse.jdt.internal.compiler.ProcessTaskManager.run(ProcessTaskManager.java:137)
26-Jun-2018 01:25:27         at java.lang.Thread.run(Thread.java:748)
26-Jun-2018 01:25:27 exception handling
26-Jun-2018 01:25:27 org.codehaus.groovy.control.MultipleCompilationErrorsException: startup failed:
26-Jun-2018 01:25:27
26-Jun-2018 01:25:27         at org.codehaus.groovy.control.ErrorCollector.failIfErrors(ErrorCollector.java:313)
26-Jun-2018 01:25:27         at org.codehaus.groovy.control.CompilationUnit.applyToSourceUnits(CompilationUnit.java:1027)
26-Jun-2018 01:25:27         at org.codehaus.groovy.control.CompilationUnit.compile(CompilationUnit.java:592)
26-Jun-2018 01:25:27         at org.codehaus.jdt.groovy.internal.compiler.ast.GroovyCompilationUnitDeclaration.processToPhase(GroovyCompilationUnitDeclaration.java:184)
26-Jun-2018 01:25:27         at org.codehaus.jdt.groovy.internal.compiler.ast.GroovyCompilationUnitDeclaration.analyseCode(GroovyCompilationUnitDeclaration.java:2181)
26-Jun-2018 01:25:27         at org.eclipse.jdt.internal.compiler.Compiler.process(Compiler.java:833)
26-Jun-2018 01:25:27         at org.eclipse.jdt.internal.compiler.ProcessTaskManager.run(ProcessTaskManager.java:137)
26-Jun-2018 01:25:27         at java.lang.Thread.run(Thread.java:748)
26-Jun-2018 01:25:27 exception handling
26-Jun-2018 01:25:27 org.codehaus.groovy.control.MultipleCompilationErrorsException: startup failed:
26-Jun-2018 01:25:27
26-Jun-2018 01:25:27         at org.codehaus.groovy.control.ErrorCollector.failIfErrors(ErrorCollector.java:313)
26-Jun-2018 01:25:27         at org.codehaus.groovy.control.CompilationUnit.applyToSourceUnits(CompilationUnit.java:1027)
26-Jun-2018 01:25:27         at org.codehaus.groovy.control.CompilationUnit.compile(CompilationUnit.java:592)
26-Jun-2018 01:25:27         at org.codehaus.jdt.groovy.internal.compiler.ast.GroovyCompilationUnitDeclaration.processToPhase(GroovyCompilationUnitDeclaration.java:184)
26-Jun-2018 01:25:27         at org.codehaus.jdt.groovy.internal.compiler.ast.GroovyCompilationUnitDeclaration.generateCode(GroovyCompilationUnitDeclaration.java:1632)
26-Jun-2018 01:25:27         at org.eclipse.jdt.internal.compiler.Compiler.process(Compiler.java:838)
26-Jun-2018 01:25:27         at org.eclipse.jdt.internal.compiler.ProcessTaskManager.run(ProcessTaskManager.java:137)
26-Jun-2018 01:25:27         at java.lang.Thread.run(Thread.java:748)
26-Jun-2018 01:25:27 exception handling
26-Jun-2018 01:25:27 org.codehaus.groovy.control.MultipleCompilationErrorsException: startup failed:
26-Jun-2018 01:25:27
26-Jun-2018 01:25:27         at org.codehaus.groovy.control.ErrorCollector.failIfErrors(ErrorCollector.java:313)
26-Jun-2018 01:25:27         at org.codehaus.groovy.control.CompilationUnit.applyToSourceUnits(CompilationUnit.java:1027)
26-Jun-2018 01:25:27         at org.codehaus.groovy.control.CompilationUnit.compile(CompilationUnit.java:592)
26-Jun-2018 01:25:27         at org.codehaus.jdt.groovy.internal.compiler.ast.GroovyCompilationUnitDeclaration.processToPhase(GroovyCompilationUnitDeclaration.java:184)
26-Jun-2018 01:25:27         at org.codehaus.jdt.groovy.internal.compiler.ast.GroovyCompilationUnitDeclaration.resolve(GroovyCompilationUnitDeclaration.java:2098)
26-Jun-2018 01:25:27         at org.eclipse.jdt.internal.compiler.Compiler.process(Compiler.java:827)
26-Jun-2018 01:25:27         at org.eclipse.jdt.internal.compiler.ProcessTaskManager.run(ProcessTaskManager.java:137)
26-Jun-2018 01:25:27         at java.lang.Thread.run(Thread.java:748)
26-Jun-2018 01:25:27 exception handling
26-Jun-2018 01:25:27 org.codehaus.groovy.control.MultipleCompilationErrorsException: startup failed:
26-Jun-2018 01:25:27
26-Jun-2018 01:25:27         at org.codehaus.groovy.control.ErrorCollector.failIfErrors(ErrorCollector.java:313)
26-Jun-2018 01:25:27         at org.codehaus.groovy.control.CompilationUnit.applyToSourceUnits(CompilationUnit.java:1027)
26-Jun-2018 01:25:27         at org.codehaus.groovy.control.CompilationUnit.compile(CompilationUnit.java:592)
26-Jun-2018 01:25:27         at org.codehaus.jdt.groovy.internal.compiler.ast.GroovyCompilationUnitDeclaration.processToPhase(GroovyCompilationUnitDeclaration.java:184)
26-Jun-2018 01:25:27         at org.codehaus.jdt.groovy.internal.compiler.ast.GroovyCompilationUnitDeclaration.analyseCode(GroovyCompilationUnitDeclaration.java:2181)
26-Jun-2018 01:25:27         at org.eclipse.jdt.internal.compiler.Compiler.process(Compiler.java:833)
26-Jun-2018 01:25:27         at org.eclipse.jdt.internal.compiler.ProcessTaskManager.run(ProcessTaskManager.java:137)
26-Jun-2018 01:25:27         at java.lang.Thread.run(Thread.java:748)
26-Jun-2018 01:25:27 exception handling
26-Jun-2018 01:25:27 org.codehaus.groovy.control.MultipleCompilationErrorsException: startup failed:
26-Jun-2018 01:25:27
26-Jun-2018 01:25:27         at org.codehaus.groovy.control.ErrorCollector.failIfErrors(ErrorCollector.java:313)
26-Jun-2018 01:25:27         at org.codehaus.groovy.control.CompilationUnit.applyToSourceUnits(CompilationUnit.java:1027)
26-Jun-2018 01:25:27         at org.codehaus.groovy.control.CompilationUnit.compile(CompilationUnit.java:592)
26-Jun-2018 01:25:27         at org.codehaus.jdt.groovy.internal.compiler.ast.GroovyCompilationUnitDeclaration.processToPhase(GroovyCompilationUnitDeclaration.java:184)
26-Jun-2018 01:25:27         at org.codehaus.jdt.groovy.internal.compiler.ast.GroovyCompilationUnitDeclaration.generateCode(GroovyCompilationUnitDeclaration.java:1632)
26-Jun-2018 01:25:27         at org.eclipse.jdt.internal.compiler.Compiler.process(Compiler.java:838)
26-Jun-2018 01:25:27         at org.eclipse.jdt.internal.compiler.ProcessTaskManager.run(ProcessTaskManager.java:137)
26-Jun-2018 01:25:27         at java.lang.Thread.run(Thread.java:748)
26-Jun-2018 01:25:27 exception handling
26-Jun-2018 01:25:27 org.codehaus.groovy.control.MultipleCompilationErrorsException: startup failed:
26-Jun-2018 01:25:27
26-Jun-2018 01:25:27         at org.codehaus.groovy.control.ErrorCollector.failIfErrors(ErrorCollector.java:313)
26-Jun-2018 01:25:27         at org.codehaus.groovy.control.CompilationUnit.applyToSourceUnits(CompilationUnit.java:1027)
26-Jun-2018 01:25:27         at org.codehaus.groovy.control.CompilationUnit.compile(CompilationUnit.java:592)
26-Jun-2018 01:25:27         at org.codehaus.jdt.groovy.internal.compiler.ast.GroovyCompilationUnitDeclaration.processToPhase(GroovyCompilationUnitDeclaration.java:184)
26-Jun-2018 01:25:27         at org.codehaus.jdt.groovy.internal.compiler.ast.GroovyCompilationUnitDeclaration.resolve(GroovyCompilationUnitDeclaration.java:2098)
26-Jun-2018 01:25:27         at org.eclipse.jdt.internal.compiler.Compiler.process(Compiler.java:827)
26-Jun-2018 01:25:27         at org.eclipse.jdt.internal.compiler.ProcessTaskManager.run(ProcessTaskManager.java:137)
26-Jun-2018 01:25:27         at java.lang.Thread.run(Thread.java:748)
26-Jun-2018 01:25:27 exception handling
26-Jun-2018 01:25:27 org.codehaus.groovy.control.MultipleCompilationErrorsException: startup failed:
26-Jun-2018 01:25:27
26-Jun-2018 01:25:27         at org.codehaus.groovy.control.ErrorCollector.failIfErrors(ErrorCollector.java:313)
26-Jun-2018 01:25:27         at org.codehaus.groovy.control.CompilationUnit.applyToSourceUnits(CompilationUnit.java:1027)
26-Jun-2018 01:25:27         at org.codehaus.groovy.control.CompilationUnit.compile(CompilationUnit.java:592)
26-Jun-2018 01:25:27         at org.codehaus.jdt.groovy.internal.compiler.ast.GroovyCompilationUnitDeclaration.processToPhase(GroovyCompilationUnitDeclaration.java:184)
26-Jun-2018 01:25:27         at org.codehaus.jdt.groovy.internal.compiler.ast.GroovyCompilationUnitDeclaration.analyseCode(GroovyCompilationUnitDeclaration.java:2181)
26-Jun-2018 01:25:27         at org.eclipse.jdt.internal.compiler.Compiler.process(Compiler.java:833)
26-Jun-2018 01:25:27         at org.eclipse.jdt.internal.compiler.ProcessTaskManager.run(ProcessTaskManager.java:137)
26-Jun-2018 01:25:27         at java.lang.Thread.run(Thread.java:748)
26-Jun-2018 01:25:27 exception handling
26-Jun-2018 01:25:27 org.codehaus.groovy.control.MultipleCompilationErrorsException: startup failed:
26-Jun-2018 01:25:27
26-Jun-2018 01:25:27         at org.codehaus.groovy.control.ErrorCollector.failIfErrors(ErrorCollector.java:313)
26-Jun-2018 01:25:27         at org.codehaus.groovy.control.CompilationUnit.applyToSourceUnits(CompilationUnit.java:1027)
26-Jun-2018 01:25:27         at org.codehaus.groovy.control.CompilationUnit.compile(CompilationUnit.java:592)
26-Jun-2018 01:25:27         at org.codehaus.jdt.groovy.internal.compiler.ast.GroovyCompilationUnitDeclaration.processToPhase(GroovyCompilationUnitDeclaration.java:184)
26-Jun-2018 01:25:27         at org.codehaus.jdt.groovy.internal.compiler.ast.GroovyCompilationUnitDeclaration.generateCode(GroovyCompilationUnitDeclaration.java:1632)
26-Jun-2018 01:25:27         at org.eclipse.jdt.internal.compiler.Compiler.process(Compiler.java:838)
26-Jun-2018 01:25:27         at org.eclipse.jdt.internal.compiler.ProcessTaskManager.run(ProcessTaskManager.java:137)
26-Jun-2018 01:25:27         at java.lang.Thread.run(Thread.java:748)
26-Jun-2018 01:25:27 exception handling
26-Jun-2018 01:25:27 org.codehaus.groovy.control.MultipleCompilationErrorsException: startup failed:
26-Jun-2018 01:25:27
26-Jun-2018 01:25:27         at org.codehaus.groovy.control.ErrorCollector.failIfErrors(ErrorCollector.java:313)
26-Jun-2018 01:25:27         at org.codehaus.groovy.control.CompilationUnit.applyToSourceUnits(CompilationUnit.java:1027)
26-Jun-2018 01:25:27         at org.codehaus.groovy.control.CompilationUnit.compile(CompilationUnit.java:592)
26-Jun-2018 01:25:27         at org.codehaus.jdt.groovy.internal.compiler.ast.GroovyCompilationUnitDeclaration.processToPhase(GroovyCompilationUnitDeclaration.java:184)
26-Jun-2018 01:25:27         at org.codehaus.jdt.groovy.internal.compiler.ast.GroovyCompilationUnitDeclaration.resolve(GroovyCompilationUnitDeclaration.java:2098)
26-Jun-2018 01:25:27         at org.eclipse.jdt.internal.compiler.Compiler.process(Compiler.java:827)
26-Jun-2018 01:25:27         at org.eclipse.jdt.internal.compiler.ProcessTaskManager.run(ProcessTaskManager.java:137)
26-Jun-2018 01:25:27         at java.lang.Thread.run(Thread.java:748)
26-Jun-2018 01:25:27 exception handling
26-Jun-2018 01:25:27 org.codehaus.groovy.control.MultipleCompilationErrorsException: startup failed:
26-Jun-2018 01:25:27
26-Jun-2018 01:25:27         at org.codehaus.groovy.control.ErrorCollector.failIfErrors(ErrorCollector.java:313)
26-Jun-2018 01:25:27         at org.codehaus.groovy.control.CompilationUnit.applyToSourceUnits(CompilationUnit.java:1027)
26-Jun-2018 01:25:27         at org.codehaus.groovy.control.CompilationUnit.compile(CompilationUnit.java:592)
26-Jun-2018 01:25:27         at org.codehaus.jdt.groovy.internal.compiler.ast.GroovyCompilationUnitDeclaration.processToPhase(GroovyCompilationUnitDeclaration.java:184)
26-Jun-2018 01:25:27         at org.codehaus.jdt.groovy.internal.compiler.ast.GroovyCompilationUnitDeclaration.analyseCode(GroovyCompilationUnitDeclaration.java:2181)
26-Jun-2018 01:25:27         at org.eclipse.jdt.internal.compiler.Compiler.process(Compiler.java:833)
26-Jun-2018 01:25:27         at org.eclipse.jdt.internal.compiler.ProcessTaskManager.run(ProcessTaskManager.java:137)
26-Jun-2018 01:25:27         at java.lang.Thread.run(Thread.java:748)
26-Jun-2018 01:25:27 exception handling
26-Jun-2018 01:25:27 org.codehaus.groovy.control.MultipleCompilationErrorsException: startup failed:
26-Jun-2018 01:25:27
26-Jun-2018 01:25:27         at org.codehaus.groovy.control.ErrorCollector.failIfErrors(ErrorCollector.java:313)
26-Jun-2018 01:25:27         at org.codehaus.groovy.control.CompilationUnit.applyToSourceUnits(CompilationUnit.java:1027)
26-Jun-2018 01:25:27         at org.codehaus.groovy.control.CompilationUnit.compile(CompilationUnit.java:592)
26-Jun-2018 01:25:27         at org.codehaus.jdt.groovy.internal.compiler.ast.GroovyCompilationUnitDeclaration.processToPhase(GroovyCompilationUnitDeclaration.java:184)
26-Jun-2018 01:25:27         at org.codehaus.jdt.groovy.internal.compiler.ast.GroovyCompilationUnitDeclaration.generateCode(GroovyCompilationUnitDeclaration.java:1632)
26-Jun-2018 01:25:27         at org.eclipse.jdt.internal.compiler.Compiler.process(Compiler.java:838)
26-Jun-2018 01:25:27         at org.eclipse.jdt.internal.compiler.ProcessTaskManager.run(ProcessTaskManager.java:137)
26-Jun-2018 01:25:27         at java.lang.Thread.run(Thread.java:748)
26-Jun-2018 01:25:27 exception handling
26-Jun-2018 01:25:27 org.codehaus.groovy.control.MultipleCompilationErrorsException: startup failed:
26-Jun-2018 01:25:27
26-Jun-2018 01:25:27         at org.codehaus.groovy.control.ErrorCollector.failIfErrors(ErrorCollector.java:313)
26-Jun-2018 01:25:27         at org.codehaus.groovy.control.CompilationUnit.applyToSourceUnits(CompilationUnit.java:1027)
26-Jun-2018 01:25:27         at org.codehaus.groovy.control.CompilationUnit.compile(CompilationUnit.java:592)
26-Jun-2018 01:25:27         at org.codehaus.jdt.groovy.internal.compiler.ast.GroovyCompilationUnitDeclaration.processToPhase(GroovyCompilationUnitDeclaration.java:184)
26-Jun-2018 01:25:27         at org.codehaus.jdt.groovy.internal.compiler.ast.GroovyCompilationUnitDeclaration.resolve(GroovyCompilationUnitDeclaration.java:2098)
26-Jun-2018 01:25:27         at org.eclipse.jdt.internal.compiler.Compiler.process(Compiler.java:827)
26-Jun-2018 01:25:27         at org.eclipse.jdt.internal.compiler.ProcessTaskManager.run(ProcessTaskManager.java:137)
26-Jun-2018 01:25:27         at java.lang.Thread.run(Thread.java:748)
26-Jun-2018 01:25:27 exception handling
26-Jun-2018 01:25:27 org.codehaus.groovy.control.MultipleCompilationErrorsException: startup failed:
26-Jun-2018 01:25:27
26-Jun-2018 01:25:27         at org.codehaus.groovy.control.ErrorCollector.failIfErrors(ErrorCollector.java:313)
26-Jun-2018 01:25:27         at org.codehaus.groovy.control.CompilationUnit.applyToSourceUnits(CompilationUnit.java:1027)
26-Jun-2018 01:25:27         at org.codehaus.groovy.control.CompilationUnit.compile(CompilationUnit.java:592)
26-Jun-2018 01:25:27         at org.codehaus.jdt.groovy.internal.compiler.ast.GroovyCompilationUnitDeclaration.processToPhase(GroovyCompilationUnitDeclaration.java:184)
26-Jun-2018 01:25:27         at org.codehaus.jdt.groovy.internal.compiler.ast.GroovyCompilationUnitDeclaration.analyseCode(GroovyCompilationUnitDeclaration.java:2181)
26-Jun-2018 01:25:27         at org.eclipse.jdt.internal.compiler.Compiler.process(Compiler.java:833)
26-Jun-2018 01:25:27         at org.eclipse.jdt.internal.compiler.ProcessTaskManager.run(ProcessTaskManager.java:137)
26-Jun-2018 01:25:27         at java.lang.Thread.run(Thread.java:748)
26-Jun-2018 01:25:27 exception handling
26-Jun-2018 01:25:27 org.codehaus.groovy.control.MultipleCompilationErrorsException: startup failed:
26-Jun-2018 01:25:27
26-Jun-2018 01:25:27         at org.codehaus.groovy.control.ErrorCollector.failIfErrors(ErrorCollector.java:313)
26-Jun-2018 01:25:27         at org.codehaus.groovy.control.CompilationUnit.applyToSourceUnits(CompilationUnit.java:1027)
26-Jun-2018 01:25:27         at org.codehaus.groovy.control.CompilationUnit.compile(CompilationUnit.java:592)
26-Jun-2018 01:25:27         at org.codehaus.jdt.groovy.internal.compiler.ast.GroovyCompilationUnitDeclaration.processToPhase(GroovyCompilationUnitDeclaration.java:184)
26-Jun-2018 01:25:27         at org.codehaus.jdt.groovy.internal.compiler.ast.GroovyCompilationUnitDeclaration.generateCode(GroovyCompilationUnitDeclaration.java:1632)
26-Jun-2018 01:25:27         at org.eclipse.jdt.internal.compiler.Compiler.process(Compiler.java:838)
26-Jun-2018 01:25:27         at org.eclipse.jdt.internal.compiler.ProcessTaskManager.run(ProcessTaskManager.java:137)
26-Jun-2018 01:25:27         at java.lang.Thread.run(Thread.java:748)
26-Jun-2018 01:25:27 exception handling
26-Jun-2018 01:25:27 org.codehaus.groovy.control.MultipleCompilationErrorsException: startup failed:
26-Jun-2018 01:25:27
26-Jun-2018 01:25:27         at org.codehaus.groovy.control.ErrorCollector.failIfErrors(ErrorCollector.java:313)
26-Jun-2018 01:25:27         at org.codehaus.groovy.control.CompilationUnit.applyToSourceUnits(CompilationUnit.java:1027)
26-Jun-2018 01:25:27         at org.codehaus.groovy.control.CompilationUnit.compile(CompilationUnit.java:592)
26-Jun-2018 01:25:27         at org.codehaus.jdt.groovy.internal.compiler.ast.GroovyCompilationUnitDeclaration.processToPhase(GroovyCompilationUnitDeclaration.java:184)
26-Jun-2018 01:25:27         at org.codehaus.jdt.groovy.internal.compiler.ast.GroovyCompilationUnitDeclaration.resolve(GroovyCompilationUnitDeclaration.java:2098)
26-Jun-2018 01:25:27         at org.eclipse.jdt.internal.compiler.Compiler.process(Compiler.java:827)
26-Jun-2018 01:25:27         at org.eclipse.jdt.internal.compiler.ProcessTaskManager.run(ProcessTaskManager.java:137)
26-Jun-2018 01:25:27         at java.lang.Thread.run(Thread.java:748)
26-Jun-2018 01:25:27 exception handling
26-Jun-2018 01:25:27 org.codehaus.groovy.control.MultipleCompilationErrorsException: startup failed:
26-Jun-2018 01:25:27
26-Jun-2018 01:25:27         at org.codehaus.groovy.control.ErrorCollector.failIfErrors(ErrorCollector.java:313)
26-Jun-2018 01:25:27         at org.codehaus.groovy.control.CompilationUnit.applyToSourceUnits(CompilationUnit.java:1027)
26-Jun-2018 01:25:27         at org.codehaus.groovy.control.CompilationUnit.compile(CompilationUnit.java:592)
26-Jun-2018 01:25:27         at org.codehaus.jdt.groovy.internal.compiler.ast.GroovyCompilationUnitDeclaration.processToPhase(GroovyCompilationUnitDeclaration.java:184)
26-Jun-2018 01:25:27         at org.codehaus.jdt.groovy.internal.compiler.ast.GroovyCompilationUnitDeclaration.analyseCode(GroovyCompilationUnitDeclaration.java:2181)
26-Jun-2018 01:25:27         at org.eclipse.jdt.internal.compiler.Compiler.process(Compiler.java:833)
26-Jun-2018 01:25:27         at org.eclipse.jdt.internal.compiler.ProcessTaskManager.run(ProcessTaskManager.java:137)
26-Jun-2018 01:25:27         at java.lang.Thread.run(Thread.java:748)
26-Jun-2018 01:25:27 exception handling
26-Jun-2018 01:25:27 org.codehaus.groovy.control.MultipleCompilationErrorsException: startup failed:
26-Jun-2018 01:25:27
26-Jun-2018 01:25:27         at org.codehaus.groovy.control.ErrorCollector.failIfErrors(ErrorCollector.java:313)
26-Jun-2018 01:25:27         at org.codehaus.groovy.control.CompilationUnit.applyToSourceUnits(CompilationUnit.java:1027)
26-Jun-2018 01:25:27         at org.codehaus.groovy.control.CompilationUnit.compile(CompilationUnit.java:592)
26-Jun-2018 01:25:27         at org.codehaus.jdt.groovy.internal.compiler.ast.GroovyCompilationUnitDeclaration.processToPhase(GroovyCompilationUnitDeclaration.java:184)
26-Jun-2018 01:25:27         at org.codehaus.jdt.groovy.internal.compiler.ast.GroovyCompilationUnitDeclaration.generateCode(GroovyCompilationUnitDeclaration.java:1632)
26-Jun-2018 01:25:27         at org.eclipse.jdt.internal.compiler.Compiler.process(Compiler.java:838)
26-Jun-2018 01:25:27         at org.eclipse.jdt.internal.compiler.ProcessTaskManager.run(ProcessTaskManager.java:137)
26-Jun-2018 01:25:27         at java.lang.Thread.run(Thread.java:748)
26-Jun-2018 01:25:27 exception handling
26-Jun-2018 01:25:27 org.codehaus.groovy.control.MultipleCompilationErrorsException: startup failed:
26-Jun-2018 01:25:27
26-Jun-2018 01:25:27         at org.codehaus.groovy.control.ErrorCollector.failIfErrors(ErrorCollector.java:313)
26-Jun-2018 01:25:27         at org.codehaus.groovy.control.CompilationUnit.applyToSourceUnits(CompilationUnit.java:1027)
26-Jun-2018 01:25:27         at org.codehaus.groovy.control.CompilationUnit.compile(CompilationUnit.java:592)
26-Jun-2018 01:25:27         at org.codehaus.jdt.groovy.internal.compiler.ast.GroovyCompilationUnitDeclaration.processToPhase(GroovyCompilationUnitDeclaration.java:184)
26-Jun-2018 01:25:27         at org.codehaus.jdt.groovy.internal.compiler.ast.GroovyCompilationUnitDeclaration.resolve(GroovyCompilationUnitDeclaration.java:2098)
26-Jun-2018 01:25:27         at org.eclipse.jdt.internal.compiler.Compiler.process(Compiler.java:827)
26-Jun-2018 01:25:27         at org.eclipse.jdt.internal.compiler.ProcessTaskManager.run(ProcessTaskManager.java:137)
26-Jun-2018 01:25:27         at java.lang.Thread.run(Thread.java:748)
26-Jun-2018 01:25:27 exception handling
26-Jun-2018 01:25:27 org.codehaus.groovy.control.MultipleCompilationErrorsException: startup failed:
26-Jun-2018 01:25:27
26-Jun-2018 01:25:27         at org.codehaus.groovy.control.ErrorCollector.failIfErrors(ErrorCollector.java:313)
26-Jun-2018 01:25:27         at org.codehaus.groovy.control.CompilationUnit.applyToSourceUnits(CompilationUnit.java:1027)
26-Jun-2018 01:25:27         at org.codehaus.groovy.control.CompilationUnit.compile(CompilationUnit.java:592)
26-Jun-2018 01:25:27         at org.codehaus.jdt.groovy.internal.compiler.ast.GroovyCompilationUnitDeclaration.processToPhase(GroovyCompilationUnitDeclaration.java:184)
26-Jun-2018 01:25:27         at org.codehaus.jdt.groovy.internal.compiler.ast.GroovyCompilationUnitDeclaration.analyseCode(GroovyCompilationUnitDeclaration.java:2181)
26-Jun-2018 01:25:27         at org.eclipse.jdt.internal.compiler.Compiler.process(Compiler.java:833)
26-Jun-2018 01:25:27         at org.eclipse.jdt.internal.compiler.ProcessTaskManager.run(ProcessTaskManager.java:137)
26-Jun-2018 01:25:27         at java.lang.Thread.run(Thread.java:748)
26-Jun-2018 01:25:27 exception handling
26-Jun-2018 01:25:27 org.codehaus.groovy.control.MultipleCompilationErrorsException: startup failed:
26-Jun-2018 01:25:27
26-Jun-2018 01:25:27         at org.codehaus.groovy.control.ErrorCollector.failIfErrors(ErrorCollector.java:313)
26-Jun-2018 01:25:27         at org.codehaus.groovy.control.CompilationUnit.applyToSourceUnits(CompilationUnit.java:1027)
26-Jun-2018 01:25:27         at org.codehaus.groovy.control.CompilationUnit.compile(CompilationUnit.java:592)
26-Jun-2018 01:25:27         at org.codehaus.jdt.groovy.internal.compiler.ast.GroovyCompilationUnitDeclaration.processToPhase(GroovyCompilationUnitDeclaration.java:184)
26-Jun-2018 01:25:27         at org.codehaus.jdt.groovy.internal.compiler.ast.GroovyCompilationUnitDeclaration.generateCode(GroovyCompilationUnitDeclaration.java:1632)
26-Jun-2018 01:25:27         at org.eclipse.jdt.internal.compiler.Compiler.process(Compiler.java:838)
26-Jun-2018 01:25:27         at org.eclipse.jdt.internal.compiler.ProcessTaskManager.run(ProcessTaskManager.java:137)
26-Jun-2018 01:25:27         at java.lang.Thread.run(Thread.java:748)
26-Jun-2018 01:25:27 exception handling
26-Jun-2018 01:25:27 org.codehaus.groovy.control.MultipleCompilationErrorsException: startup failed:
26-Jun-2018 01:25:27
26-Jun-2018 01:25:27         at org.codehaus.groovy.control.ErrorCollector.failIfErrors(ErrorCollector.java:313)
26-Jun-2018 01:25:27         at org.codehaus.groovy.control.CompilationUnit.applyToSourceUnits(CompilationUnit.java:1027)
26-Jun-2018 01:25:27         at org.codehaus.groovy.control.CompilationUnit.compile(CompilationUnit.java:592)
26-Jun-2018 01:25:27         at org.codehaus.jdt.groovy.internal.compiler.ast.GroovyCompilationUnitDeclaration.processToPhase(GroovyCompilationUnitDeclaration.java:184)
26-Jun-2018 01:25:27         at org.codehaus.jdt.groovy.internal.compiler.ast.GroovyCompilationUnitDeclaration.resolve(GroovyCompilationUnitDeclaration.java:2098)
26-Jun-2018 01:25:27         at org.eclipse.jdt.internal.compiler.Compiler.process(Compiler.java:827)
26-Jun-2018 01:25:27         at org.eclipse.jdt.internal.compiler.ProcessTaskManager.run(ProcessTaskManager.java:137)
26-Jun-2018 01:25:27         at java.lang.Thread.run(Thread.java:748)
26-Jun-2018 01:25:27 exception handling
26-Jun-2018 01:25:27 org.codehaus.groovy.control.MultipleCompilationErrorsException: startup failed:
26-Jun-2018 01:25:27
26-Jun-2018 01:25:27         at org.codehaus.groovy.control.ErrorCollector.failIfErrors(ErrorCollector.java:313)
26-Jun-2018 01:25:27         at org.codehaus.groovy.control.CompilationUnit.applyToSourceUnits(CompilationUnit.java:1027)
26-Jun-2018 01:25:27         at org.codehaus.groovy.control.CompilationUnit.compile(CompilationUnit.java:592)
26-Jun-2018 01:25:27         at org.codehaus.jdt.groovy.internal.compiler.ast.GroovyCompilationUnitDeclaration.processToPhase(GroovyCompilationUnitDeclaration.java:184)
26-Jun-2018 01:25:27         at org.codehaus.jdt.groovy.internal.compiler.ast.GroovyCompilationUnitDeclaration.analyseCode(GroovyCompilationUnitDeclaration.java:2181)
26-Jun-2018 01:25:27         at org.eclipse.jdt.internal.compiler.Compiler.process(Compiler.java:833)
26-Jun-2018 01:25:27         at org.eclipse.jdt.internal.compiler.ProcessTaskManager.run(ProcessTaskManager.java:137)
26-Jun-2018 01:25:27         at java.lang.Thread.run(Thread.java:748)
26-Jun-2018 01:25:27 exception handling
26-Jun-2018 01:25:27 org.codehaus.groovy.control.MultipleCompilationErrorsException: startup failed:
26-Jun-2018 01:25:27
26-Jun-2018 01:25:27         at org.codehaus.groovy.control.ErrorCollector.failIfErrors(ErrorCollector.java:313)
26-Jun-2018 01:25:27         at org.codehaus.groovy.control.CompilationUnit.applyToSourceUnits(CompilationUnit.java:1027)
26-Jun-2018 01:25:27         at org.codehaus.groovy.control.CompilationUnit.compile(CompilationUnit.java:592)
26-Jun-2018 01:25:27         at org.codehaus.jdt.groovy.internal.compiler.ast.GroovyCompilationUnitDeclaration.processToPhase(GroovyCompilationUnitDeclaration.java:184)
26-Jun-2018 01:25:27         at org.codehaus.jdt.groovy.internal.compiler.ast.GroovyCompilationUnitDeclaration.generateCode(GroovyCompilationUnitDeclaration.java:1632)
26-Jun-2018 01:25:27         at org.eclipse.jdt.internal.compiler.Compiler.process(Compiler.java:838)
26-Jun-2018 01:25:27         at org.eclipse.jdt.internal.compiler.ProcessTaskManager.run(ProcessTaskManager.java:137)
26-Jun-2018 01:25:27         at java.lang.Thread.run(Thread.java:748)
26-Jun-2018 01:25:27 [INFO] ------------------------------------------------------------------------
26-Jun-2018 01:25:27 [INFO] Reactor Summary:
26-Jun-2018 01:25:27 [INFO]
26-Jun-2018 01:25:27 [INFO] org.codehaus.groovy.eclipse.parent ................. SUCCESS [  0.678 s]
26-Jun-2018 01:25:27 [INFO] org.codehaus.groovy ................................ SUCCESS [  7.703 s]
26-Jun-2018 01:25:27 [INFO] org.codehaus.groovy ................................ SUCCESS [  4.832 s]
26-Jun-2018 01:25:27 [INFO] org.codehaus.groovy ................................ SUCCESS [  4.386 s]
26-Jun-2018 01:25:27 [INFO] org.codehaus.groovy ................................ SUCCESS [  4.588 s]
26-Jun-2018 01:25:27 [INFO] org.codehaus.groovy ................................ SUCCESS [  5.110 s]
26-Jun-2018 01:25:27 [INFO] org.codehaus.groovy ................................ SUCCESS [  4.943 s]
26-Jun-2018 01:25:27 [INFO] org.codehaus.groovy ................................ SUCCESS [  6.141 s]
26-Jun-2018 01:25:27 [INFO] org.codehaus.groovy.eclipse.compilerResolver ....... SUCCESS [  1.202 s]
26-Jun-2018 01:25:27 [INFO] org.eclipse.jdt.core ............................... SUCCESS [ 20.092 s]
26-Jun-2018 01:25:27 [INFO] org.eclipse.jdt.groovy.core ........................ SUCCESS [  2.422 s]
26-Jun-2018 01:25:27 [INFO] org.codehaus.groovy.eclipse ........................ SUCCESS [  0.607 s]
26-Jun-2018 01:25:27 [INFO] org.codehaus.groovy.eclipse.core ................... SUCCESS [  1.474 s]
26-Jun-2018 01:25:27 [INFO] org.codehaus.groovy.eclipse.ant .................... SUCCESS [  1.213 s]
26-Jun-2018 01:25:27 [INFO] org.codehaus.groovy.eclipse.codebrowsing ........... SUCCESS [  1.384 s]
26-Jun-2018 01:25:27 [INFO] org.codehaus.groovy.eclipse.refactoring ............ SUCCESS [  2.071 s]
26-Jun-2018 01:25:27 [INFO] org.codehaus.groovy.eclipse.ui ..................... SUCCESS [  2.819 s]
26-Jun-2018 01:25:27 [INFO] org.codehaus.groovy.eclipse.astviews ............... SUCCESS [  5.079 s]
26-Jun-2018 01:25:27 [INFO] org.codehaus.groovy.eclipse.codeassist.completion .. SUCCESS [  1.936 s]
26-Jun-2018 01:25:27 [INFO] org.codehaus.groovy.eclipse.dsl .................... SUCCESS [  2.447 s]
26-Jun-2018 01:25:27 [INFO] org.codehaus.groovy.eclipse.quickfix ............... SUCCESS [  1.740 s]
26-Jun-2018 01:25:27 [INFO] org.codehaus.groovy18.feature ...................... SUCCESS [  0.704 s]
26-Jun-2018 01:25:27 [INFO] org.codehaus.groovy20.feature ...................... SUCCESS [  0.609 s]
26-Jun-2018 01:25:27 [INFO] org.codehaus.groovy21.feature ...................... SUCCESS [  0.606 s]
26-Jun-2018 01:25:27 [INFO] org.codehaus.groovy22.feature ...................... SUCCESS [  0.621 s]
26-Jun-2018 01:25:27 [INFO] org.codehaus.groovy23.feature ...................... SUCCESS [  0.589 s]
26-Jun-2018 01:25:27 [INFO] org.codehaus.groovy24.feature ...................... SUCCESS [  0.624 s]
26-Jun-2018 01:25:27 [INFO] org.codehaus.groovy25.feature ...................... SUCCESS [  0.642 s]
26-Jun-2018 01:25:27 [INFO] org.codehaus.groovy.jdt.patch ...................... SUCCESS [  0.628 s]
26-Jun-2018 01:25:27 [INFO] org.codehaus.groovy.headless.feature ............... SUCCESS [  0.659 s]
26-Jun-2018 01:25:27 [INFO] org.codehaus.groovy.compilerless.feature ........... SUCCESS [  0.786 s]
26-Jun-2018 01:25:27 [INFO] org.codehaus.groovy.eclipse.feature ................ SUCCESS [  0.724 s]
26-Jun-2018 01:25:27 [INFO] org.eclipse.jdt.core.tests.compiler ................ SUCCESS [  8.281 s]
26-Jun-2018 01:25:27 [INFO] org.eclipse.jdt.core.tests.builder ................. SUCCESS [  1.625 s]
26-Jun-2018 01:25:27 [INFO] org.eclipse.jdt.groovy.core.tests.compiler ......... SUCCESS [  1.437 s]
26-Jun-2018 01:25:27 [INFO] org.eclipse.jdt.groovy.core.tests.builder .......... SUCCESS [  1.976 s]
26-Jun-2018 01:25:27 [INFO] org.codehaus.groovy.eclipse.tests .................. SUCCESS [  4.372 s]
26-Jun-2018 01:25:27 [INFO] org.codehaus.groovy.eclipse.codeassist.completion.test SUCCESS [  2.672 s]
26-Jun-2018 01:25:27 [INFO] org.codehaus.groovy.eclipse.codebrowsing.test ...... SUCCESS [  2.183 s]
26-Jun-2018 01:25:27 [INFO] org.codehaus.groovy.eclipse.core.test .............. SUCCESS [  1.607 s]
26-Jun-2018 01:25:27 [INFO] org.codehaus.groovy.eclipse.dsl.tests .............. FAILURE [  0.900 s]
26-Jun-2018 01:25:27 [INFO] org.codehaus.groovy.eclipse.junit.test ............. SKIPPED
26-Jun-2018 01:25:27 [INFO] org.codehaus.groovy.eclipse.refactoring.test ....... SKIPPED
26-Jun-2018 01:25:27 [INFO] org.codehaus.groovy.eclipse.quickfix.test .......... SKIPPED
26-Jun-2018 01:25:27 [INFO] org.codehaus.groovy.alltests ....................... SKIPPED
26-Jun-2018 01:25:27 [INFO] org.codehaus.groovy.alltests.feature ............... SKIPPED
26-Jun-2018 01:25:27 [INFO] org.codehaus.groovy.m2eclipse ...................... SKIPPED
26-Jun-2018 01:25:27 [INFO] org.codehaus.groovy.m2eclipse.feature .............. SKIPPED
26-Jun-2018 01:25:27 [INFO] org.codehaus.groovy.eclipse.site ................... SKIPPED
26-Jun-2018 01:25:27 [INFO] ------------------------------------------------------------------------
26-Jun-2018 01:25:27 [INFO] BUILD FAILURE
26-Jun-2018 01:25:27 [INFO] ------------------------------------------------------------------------
26-Jun-2018 01:25:27 [INFO] Total time: 04:28 min
26-Jun-2018 01:25:27 [INFO] Finished at: 2018-06-26T01:25:27+00:00
26-Jun-2018 01:25:27 [INFO] Final Memory: 164M/688M
26-Jun-2018 01:25:27 [INFO] ------------------------------------------------------------------------
26-Jun-2018 01:25:27 [ERROR] Failed to execute goal org.eclipse.tycho:tycho-compiler-plugin:0.24.0:compile (default-compile) on project org.codehaus.groovy.eclipse.dsl.tests: Compilation failure: Compilation failure:
26-Jun-2018 01:25:27 [ERROR] /opt/bamboo-home/xml-data/build-dir/GRECLIPSE-GE47-JOB1/ide-test/org.codehaus.groovy.eclipse.dsl.tests/src/org/codehaus/groovy/eclipse/dsl/tests/MetaDSLInferencingTests.groovy:[64,1] 1. ERROR in /opt/bamboo-home/xml-data/build-dir/GRECLIPSE-GE47-JOB1/ide-test/org.codehaus.groovy.eclipse.dsl.tests/src/org/codehaus/groovy/eclipse/dsl/tests/MetaDSLInferencingTests.groovy (at line 64)
26-Jun-2018 01:25:27 [ERROR] @Test
26-Jun-2018 01:25:27 [ERROR] ^
26-Jun-2018 01:25:27 [ERROR] Groovy:The return type of VisitStatus acceptASTNode(org.codehaus.groovy.ast.ASTNode, org.eclipse.jdt.groovy.search.TypeLookupResult, org.eclipse.jdt.core.IJavaElement) in org.codehaus.groovy.eclipse.dsl.tests.PointcutEvaluationTests$PointcutEvaluationRequestor is incompatible with org.eclipse.jdt.groovy.search.ITypeRequestor$VisitStatus acceptASTNode(org.codehaus.groovy.ast.ASTNode, org.eclipse.jdt.groovy.search.TypeLookupResult, org.eclipse.jdt.core.IJavaElement) in org.eclipse.jdt.groovy.search.ITypeRequestor
26-Jun-2018 01:25:27 [ERROR]
26-Jun-2018 01:25:27 [ERROR] Found 1 error and 0 warnings.
26-Jun-2018 01:25:27 [ERROR] -> [Help 1]
26-Jun-2018 01:25:27 [ERROR]
26-Jun-2018 01:25:27 [ERROR] To see the full stack trace of the errors, re-run Maven with the -e switch.
26-Jun-2018 01:25:27 [ERROR] Re-run Maven using the -X switch to enable full debug logging.
26-Jun-2018 01:25:27 [ERROR]
26-Jun-2018 01:25:27 [ERROR] For more information about the errors and possible solutions, please read the following articles:
26-Jun-2018 01:25:27 [ERROR] [Help 1] http://cwiki.apache.org/confluence/display/MAVEN/MojoFailureException
26-Jun-2018 01:25:27 [ERROR]
26-Jun-2018 01:25:27 [ERROR] After correcting the problems, you can resume the build with the command
26-Jun-2018 01:25:27 [ERROR]   mvn <goals> -rf :org.codehaus.groovy.eclipse.dsl.tests
26-Jun-2018 01:25:28 Failing task since return code of [/opt/maven-3.3/bin/mvn --batch-mode -Djava.io.tmpdir=/tmp/GRECLIPSE-GE47-JOB1 -Pe47 clean deploy -Psnapshot] was 1 while expected 0
26-Jun-2018 01:25:28 Parsing test results under /opt/bamboo-home/xml-data/build-dir/GRECLIPSE-GE47-JOB1...
26-Jun-2018 01:25:29 Finished task 'Maven 3.x' with result: Failed
26-Jun-2018 01:25:29 Running post build plugin 'Docker Container Cleanup'
26-Jun-2018 01:25:29 Running post build plugin 'NCover Results Collector'
26-Jun-2018 01:25:29 Running post build plugin 'Artifactory Release Management Staging'
26-Jun-2018 01:25:29 Running post build plugin 'Artifactory Build Info Copier'
26-Jun-2018 01:25:29 Running post build plugin 'Artifactory Gradle Properties Info Copier'
26-Jun-2018 01:25:29 Running post build plugin 'Clover Results Collector'
26-Jun-2018 01:25:29 Running post build plugin 'npm Cache Cleanup'
26-Jun-2018 01:25:29 Running post build plugin 'Artifact Copier'
26-Jun-2018 01:25:29 Publishing an artifact: surefire-reports
26-Jun-2018 01:25:31 Finished publishing of artifact Job artifact: [surefire-reports], pattern: [**/target/TEST-*.xml] in 2.162 s
26-Jun-2018 01:25:31 Publishing an artifact: Zipped Update Site
26-Jun-2018 01:25:31 Unable to publish artifact [Zipped Update Site]: the source directory /opt/bamboo-home/xml-data/build-dir/GRECLIPSE-GE47-JOB1/Site-org.codehaus.groovy.eclipse/target/site does not exist.
26-Jun-2018 01:25:31 The artifact hasn't been successfully published after 894.2 μs
26-Jun-2018 01:25:32 Successfully removed working directory at '/opt/bamboo-home/xml-data/build-dir/GRECLIPSE-GE47-JOB1'
26-Jun-2018 01:25:32 Finalising the build...
26-Jun-2018 01:25:32 Stopping timer.
26-Jun-2018 01:25:32 Build GRECLIPSE-GE47-JOB1-512 completed.
26-Jun-2018 01:25:32 Running on server: post build plugin 'NCover Results Collector'
26-Jun-2018 01:25:32 Running on server: post build plugin 'Build Hanging Detection Configuration'
26-Jun-2018 01:25:32 Running on server: post build plugin 'Clover Delta Calculator'
26-Jun-2018 01:25:32 Running on server: post build plugin 'Maven Dependencies Postprocessor'
26-Jun-2018 01:25:32 All post build plugins have finished
26-Jun-2018 01:25:32 Generating build results summary...
26-Jun-2018 01:25:32 Saving build results to disk...
26-Jun-2018 01:25:32 Logging substituted variables...
26-Jun-2018 01:25:32 Indexing build results...
26-Jun-2018 01:25:32 Finished building GRECLIPSE-GE47-JOB1-512.