Build: #316 failed Changes by Eric Milles

Build result summary

Details

Completed
Duration
107 minutes
Labels
None
Revision
90a6b3059f84741867bf5997d08fa2d26b636166 90a6b3059f84741867bf5997d08fa2d26b636166
Total tests
5713
Failing since
#306 (Changes by Eric Milles)
Fixed in
#317 (Changes by Felix Dorner <felix.dorner@gmail.com> and Eric Milles)

Responsible

Code commits

Author Commit Message Commit date
Eric Milles Eric Milles 90a6b3059f84741867bf5997d08fa2d26b636166 90a6b3059f84741867bf5997d08fa2d26b636166 add @Generated annotation to default constructor for incremental compile
Eric Milles Eric Milles cd898e78d0e5489e2b46eb9cf0191df087d0bcc5 cd898e78d0e5489e2b46eb9cf0191df087d0bcc5 minor fix-ups

Tests

New test failures 4
Status Test View job Duration
Collapse Failed BasicGroovyBuildTests testPackageNames3 History
Default Job < 1 sec
java.lang.AssertionError: missing expected problem: Problem : The declared package "" does not match the expected package "p.q.r" [ resource : </Project/src/p/q/r/X.groovy> range : <0,1> category : <60> severity : <2>]
	at org.eclipse.jdt.core.groovy.tests.builder.BasicGroovyBuildTests.testPackageNames3(BasicGroovyBuildTests.java:1786)
Collapse Failed BuildAccessRulesTests testAccessForImplementsGenerics History
Default Job < 1 sec
junit.framework.ComparisonFailure: 
----------- Expected ------------
Problem : Access restriction: The type 'BeanInfo' is not API (restriction on required library '##') [ resource : </Project/src/Foo.groovy> range : <55,63> category : <150> severity : <2>]

------------ but was ------------

--------- Difference is ----------
 expected:<[Problem : Access restriction: The type 'BeanInfo' is not API (restriction on required library '##') [ resource : </Project/src/Foo.groovy> range : <55,63> category : <150> severity : <2>]
(13 more lines...)
Collapse Failed BuildAccessRulesTests testAccessForExtends History
Default Job < 1 sec
junit.framework.ComparisonFailure: 
----------- Expected ------------
Problem : Access restriction: The type 'BeanDescriptor' is not API (restriction on required library '##') [ resource : </Project/src/Foo.groovy> range : <38,52> category : <150> severity : <2>]

------------ but was ------------

--------- Difference is ----------
 expected:<[Problem : Access restriction: The type 'BeanDescriptor' is not API (restriction on required library '##') [ resource : </Project/src/Foo.groovy> range : <38,52> category : <150> severity : <2>]
(13 more lines...)
Collapse Failed DGMInferencingTests testDGM16 History
Default Job < 1 sec
java.lang.AssertionError: Expected type not found.
Expected: java.lang.String
Found: java.lang.Object
Declaring type: Search
ASTNode: org.codehaus.groovy.ast.expr.VariableExpression@f170c[variable: key]
Confidence: INFERRED

java.lang.AssertionError: 
(9 more lines...)
Fixed tests 2
Status Test Failing since View job Duration
Successful BasicGroovyBuildTests testGRE1773 History
Failing since build #311 (Changes by Eric Milles) Default Job < 1 sec
Successful BasicGroovyBuildTests testIncrementalCompilationTheBasics History
Failing since build #315 (Changes by Eric Milles) Default Job < 1 sec