Build: #330 failed Changes by Eric Milles

Build result summary

Details

Completed
Duration
266 minutes
Labels
None
Agent
bamboo-16.af.pivotal.io
Revision
25675391e1a5e9af708e1dd2c785ae420a83c645 25675391e1a5e9af708e1dd2c785ae420a83c645
Total tests
5727
Failing since
#325 (Changes by Eric Milles)
Fixed in
#347 (Changes by Eric Milles)

Responsible

Comments on Default Job

  1. Anonymous user

    Detected hung build state. Attempting to generate stack trace and terminate spawned sub-processes.

Code commits

Author Commit Message Commit date
Eric Milles Eric Milles 25675391e1a5e9af708e1dd2c785ae420a83c645 25675391e1a5e9af708e1dd2c785ae420a83c645 Eclipse 4.12 (M3) JDT Patch for Groovy-Eclipse: JDT commit 3d670fe
#839 #838

Tests

New test failures 3
Status Test View job Duration
Collapse Failed BuildAccessRulesTests testAccessForMethodReturnType History
Default Job < 1 sec
junit.framework.ComparisonFailure: 
----------- Expected ------------
Problem : Access restriction: The type 'BeanInfo' is not API (restriction on required library '##') [ resource : </Project/src/Foo.groovy> range : <34,42> category : <150> severity : <2>]

------------ but was ------------

--------- Difference is ----------
 expected:<[Problem : Access restriction: The type 'BeanInfo' is not API (restriction on required library '##') [ resource : </Project/src/Foo.groovy> range : <34,42> category : <150> severity : <2>]
(13 more lines...)
Collapse Failed DGMInferencingTests testDGM46 History
Default Job < 1 sec
java.lang.AssertionError: Expected type not found.
Expected: java.util.regex.Pattern[]
Found: java.lang.String
Declaring type: java.util.regex.Pattern[]
ASTNode: org.codehaus.groovy.ast.expr.ConstantExpression@f1716[eachWithIndex]
Confidence: UNKNOWN

java.lang.AssertionError: 
(9 more lines...)
Collapse Failed GenericInferencingTests testMap15 History
Default Job < 1 sec
java.lang.NoClassDefFoundError: org/codehaus/groovy/runtime/DefaultGroovyMethodsSupport
	at org.eclipse.jdt.core.groovy.tests.search.GenericInferencingTests.testMap15(GenericInferencingTests.java:370)
Caused by: java.lang.ClassNotFoundException: org.codehaus.groovy.runtime.DefaultGroovyMethodsSupport
	at org.eclipse.jdt.core.groovy.tests.search.GenericInferencingTests.testMap15(GenericInferencingTests.java:370)
Existing test failures 3
Status Test Failing since View job Duration
org.junit.ComparisonFailure: unexpected recompiled units. lenExpected=3 lenActual=4 expected:<...st.Class1,test.Class[]2,test.Class3}> but was:<...st.Class1,test.Class[1,test.Class]2,test.Class3}>
	at org.eclipse.jdt.core.groovy.tests.builder.BasicGroovyBuildTests.testGRE1773(BasicGroovyBuildTests.java:3422)
org.junit.runners.model.TestTimedOutException: test timed out after 1500 milliseconds
	at org.eclipse.jdt.groovy.core.tests.basic.EnumerationTests.testEnum4438(EnumerationTests.java:316)
org.junit.runners.model.TestTimedOutException: test timed out after 1500 milliseconds
	at org.eclipse.jdt.groovy.core.tests.basic.EnumerationTests.testEnum4438(EnumerationTests.java:316)